hbase-builds mailing list archives

Site index · List index
Message view « Date » · « Thread »
Top « Date » · « Thread »
From gmcdon...@apache.org
Subject Build failed in Jenkins: hbase #1120
Date Mon, 11 Apr 2016 20:10:38 GMT
See <https://analysis.apache.org/jenkins/job/hbase/1120/changes>

Changes:

[jerryjch] HBASE-15591 ServerCrashProcedure not yielding

[ramkrishna.s.vasudevan] HBASE-15605 Remove PB references from HCD and HTD for 2.0 (Ram)

[tedyu] HBASE-15093 Replication can report incorrect size of log queue for the

[matteo.bertozzi] HBASE-15627 Miss space and closing quote in

------------------------------------------
[...truncated 975 lines...]
[INFO] Scanning for projects...
[INFO] 
[INFO] Using the builder org.apache.maven.lifecycle.internal.builder.singlethreaded.SingleThreadedBuilder
with a thread count of 1
[INFO]                                                                         
[INFO] ------------------------------------------------------------------------
[INFO] Building hbase-shaded-client-project-archetype 2.0.0-SNAPSHOT
[INFO] ------------------------------------------------------------------------
[INFO] 
[INFO] --- maven-resources-plugin:2.7:resources (default-resources) @ hbase-shaded-client-project-archetype
---
[WARNING] Using platform encoding (UTF-8 actually) to copy filtered resources, i.e. build
is platform dependent!
[INFO] Copying 9 resources
[INFO] 
[INFO] --- maven-resources-plugin:2.7:testResources (default-testResources) @ hbase-shaded-client-project-archetype
---
[WARNING] Using platform encoding (UTF-8 actually) to copy filtered resources, i.e. build
is platform dependent!
[INFO] Copying 2 resources
[INFO] 
[INFO] --- maven-archetype-plugin:2.4:jar (default-jar) @ hbase-shaded-client-project-archetype
---
[INFO] Building archetype jar: <https://analysis.apache.org/jenkins/job/hbase/ws/hbase-archetypes/hbase-shaded-client-project/target/build-archetype/target/generated-sources/archetype/target/hbase-shaded-client-project-archetype-2.0.0-SNAPSHOT>
[INFO] ------------------------------------------------------------------------
[INFO] BUILD SUCCESS
[INFO] ------------------------------------------------------------------------
[INFO] Total time: 5.933 s
[INFO] Finished at: 2016-04-11T20:09:34+00:00
[INFO] Final Memory: 13M/491M
[INFO] ------------------------------------------------------------------------
[INFO] Archetype project created in <https://analysis.apache.org/jenkins/job/hbase/ws/hbase-archetypes/hbase-shaded-client-project/target/build-archetype/target/generated-sources/archetype>
[INFO] ------------------------------------------------------------------------
[INFO] BUILD SUCCESS
[INFO] ------------------------------------------------------------------------
[INFO] Total time: 19.632 s
[INFO] Finished at: 2016-04-11T20:09:35+00:00
[INFO] Final Memory: 15M/491M
[INFO] ------------------------------------------------------------------------
[INFO] 
[INFO] --- maven-resources-plugin:2.7:copy-resources (hbase-client-ARCHETYPE__copy-pom-to-temp-for-xslt-processing)
@ hbase-archetype-builder ---
[INFO] Using 'UTF-8' encoding to copy filtered resources.
[INFO] Copying 1 resource
[INFO] 
[INFO] --- maven-resources-plugin:2.7:copy-resources (hbase-shaded-client-ARCHETYPE__copy-pom-to-temp-for-xslt-processing)
@ hbase-archetype-builder ---
[INFO] Using 'UTF-8' encoding to copy filtered resources.
[INFO] Copying 1 resource
[INFO] 
[INFO] --- xml-maven-plugin:1.0.1:transform (modify-archetype-pom-files-via-xslt) @ hbase-archetype-builder
---
Warning:  org.apache.xerces.parsers.SAXParser: Feature 'http://javax.xml.XMLConstants/feature/secure-processing'
is not recognized.
Warning:  org.apache.xerces.parsers.SAXParser: Property 'http://javax.xml.XMLConstants/property/accessExternalDTD'
is not recognized.
Warning:  org.apache.xerces.parsers.SAXParser: Property 'http://www.oracle.com/xml/jaxp/properties/entityExpansionLimit'
is not recognized.
[INFO] Transforming file: <https://analysis.apache.org/jenkins/job/hbase/ws/hbase-archetypes/hbase-archetype-builder/../hbase-client-project/target/temp-arch/pom.xml>
[INFO] Transformed 1 file(s).
Warning:  org.apache.xerces.parsers.SAXParser: Feature 'http://javax.xml.XMLConstants/feature/secure-processing'
is not recognized.
Warning:  org.apache.xerces.parsers.SAXParser: Property 'http://javax.xml.XMLConstants/property/accessExternalDTD'
is not recognized.
Warning:  org.apache.xerces.parsers.SAXParser: Property 'http://www.oracle.com/xml/jaxp/properties/entityExpansionLimit'
is not recognized.
[INFO] Transforming file: <https://analysis.apache.org/jenkins/job/hbase/ws/hbase-archetypes/hbase-archetype-builder/../hbase-shaded-client-project/target/temp-arch/pom.xml>
[INFO] Transformed 1 file(s).
[INFO] 
[INFO] --- maven-install-plugin:2.3.1:install (default-install) @ hbase-archetype-builder
---
[INFO] Installing <https://analysis.apache.org/jenkins/job/hbase/ws/hbase-archetypes/hbase-archetype-builder/pom.xml>
to /x1/jenkins/jenkins-master/jenkins-home/maven-repositories/1/org/apache/hbase/hbase-archetype-builder/2.0.0-SNAPSHOT/hbase-archetype-builder-2.0.0-SNAPSHOT.pom
[INFO] 
[INFO] --- exec-maven-plugin:1.4.0:exec (run-installArchetypes-script) @ hbase-archetype-builder
---
[INFO] Scanning for projects...
[INFO] 
[INFO] Using the builder org.apache.maven.lifecycle.internal.builder.singlethreaded.SingleThreadedBuilder
with a thread count of 1
[INFO]                                                                         
[INFO] ------------------------------------------------------------------------
[INFO] Building hbase-client-project-archetype 2.0.0-SNAPSHOT
[INFO] ------------------------------------------------------------------------
[INFO] 
[INFO] --- maven-resources-plugin:2.7:resources (default-resources) @ hbase-client-project-archetype
---
[INFO] Using 'UTF-8' encoding to copy filtered resources.
[INFO] Copying 9 resources
[INFO] 
[INFO] --- maven-resources-plugin:2.7:testResources (default-testResources) @ hbase-client-project-archetype
---
[INFO] Using 'UTF-8' encoding to copy filtered resources.
[INFO] Copying 2 resources
[INFO] 
[INFO] --- maven-archetype-plugin:2.4:jar (default-jar) @ hbase-client-project-archetype ---
[INFO] Building archetype jar: <https://analysis.apache.org/jenkins/job/hbase/ws/hbase-archetypes/hbase-client-project/target/build-archetype/target/generated-sources/archetype/target/hbase-client-project-archetype-2.0.0-SNAPSHOT>
[INFO] 
[INFO] --- maven-archetype-plugin:2.4:integration-test (default-integration-test) @ hbase-client-project-archetype
---
[INFO] Processing Archetype IT project: basic
[INFO] ----------------------------------------------------------------------------
[INFO] Using following parameters for creating project from Archetype: hbase-client-project-archetype:2.0.0-SNAPSHOT
[INFO] ----------------------------------------------------------------------------
[INFO] Parameter: groupId, Value: archetype.it
[INFO] Parameter: artifactId, Value: basic
[INFO] Parameter: version, Value: 0.1-SNAPSHOT
[INFO] Parameter: package, Value: it.pkg
[INFO] Parameter: packageInPathFormat, Value: it/pkg
[INFO] Parameter: version, Value: 0.1-SNAPSHOT
[INFO] Parameter: package, Value: it.pkg
[INFO] Parameter: groupId, Value: archetype.it
[INFO] Parameter: artifactId, Value: basic
[INFO] project created from Archetype in dir: <https://analysis.apache.org/jenkins/job/hbase/ws/hbase-archetypes/hbase-client-project/target/build-archetype/target/generated-sources/archetype/target/test-classes/projects/basic/project/basic>
[INFO] 
[INFO] --- maven-install-plugin:2.5.2:install (default-install) @ hbase-client-project-archetype
---
[INFO] Installing <https://analysis.apache.org/jenkins/job/hbase/ws/hbase-archetypes/hbase-client-project/target/build-archetype/target/generated-sources/archetype/target/hbase-client-project-archetype-2.0.0-SNAPSHOT.jar>
to /x1/jenkins/mvn-repo/org/apache/hbase/hbase-client-project-archetype/2.0.0-SNAPSHOT/hbase-client-project-archetype-2.0.0-SNAPSHOT.jar
[INFO] Installing <https://analysis.apache.org/jenkins/job/hbase/ws/hbase-archetypes/hbase-client-project/target/build-archetype/target/generated-sources/archetype/pom.xml>
to /x1/jenkins/mvn-repo/org/apache/hbase/hbase-client-project-archetype/2.0.0-SNAPSHOT/hbase-client-project-archetype-2.0.0-SNAPSHOT.pom
[INFO] 
[INFO] --- maven-archetype-plugin:2.4:update-local-catalog (default-update-local-catalog)
@ hbase-client-project-archetype ---
[INFO] ------------------------------------------------------------------------
[INFO] BUILD SUCCESS
[INFO] ------------------------------------------------------------------------
[INFO] Total time: 5.400 s
[INFO] Finished at: 2016-04-11T20:09:47+00:00
[INFO] Final Memory: 14M/491M
[INFO] ------------------------------------------------------------------------
[INFO] Scanning for projects...
[INFO] 
[INFO] Using the builder org.apache.maven.lifecycle.internal.builder.singlethreaded.SingleThreadedBuilder
with a thread count of 1
[INFO]                                                                         
[INFO] ------------------------------------------------------------------------
[INFO] Building hbase-shaded-client-project-archetype 2.0.0-SNAPSHOT
[INFO] ------------------------------------------------------------------------
[INFO] 
[INFO] --- maven-resources-plugin:2.7:resources (default-resources) @ hbase-shaded-client-project-archetype
---
[INFO] Using 'UTF-8' encoding to copy filtered resources.
[INFO] Copying 9 resources
[INFO] 
[INFO] --- maven-resources-plugin:2.7:testResources (default-testResources) @ hbase-shaded-client-project-archetype
---
[INFO] Using 'UTF-8' encoding to copy filtered resources.
[INFO] Copying 2 resources
[INFO] 
[INFO] --- maven-archetype-plugin:2.4:jar (default-jar) @ hbase-shaded-client-project-archetype
---
[INFO] Building archetype jar: <https://analysis.apache.org/jenkins/job/hbase/ws/hbase-archetypes/hbase-shaded-client-project/target/build-archetype/target/generated-sources/archetype/target/hbase-shaded-client-project-archetype-2.0.0-SNAPSHOT>
[INFO] 
[INFO] --- maven-archetype-plugin:2.4:integration-test (default-integration-test) @ hbase-shaded-client-project-archetype
---
[INFO] Processing Archetype IT project: basic
[INFO] ----------------------------------------------------------------------------
[INFO] Using following parameters for creating project from Archetype: hbase-shaded-client-project-archetype:2.0.0-SNAPSHOT
[INFO] ----------------------------------------------------------------------------
[INFO] Parameter: groupId, Value: archetype.it
[INFO] Parameter: artifactId, Value: basic
[INFO] Parameter: version, Value: 0.1-SNAPSHOT
[INFO] Parameter: package, Value: it.pkg
[INFO] Parameter: packageInPathFormat, Value: it/pkg
[INFO] Parameter: version, Value: 0.1-SNAPSHOT
[INFO] Parameter: package, Value: it.pkg
[INFO] Parameter: groupId, Value: archetype.it
[INFO] Parameter: artifactId, Value: basic
[INFO] project created from Archetype in dir: <https://analysis.apache.org/jenkins/job/hbase/ws/hbase-archetypes/hbase-shaded-client-project/target/build-archetype/target/generated-sources/archetype/target/test-classes/projects/basic/project/basic>
[INFO] 
[INFO] --- maven-install-plugin:2.5.2:install (default-install) @ hbase-shaded-client-project-archetype
---
[INFO] Installing <https://analysis.apache.org/jenkins/job/hbase/ws/hbase-archetypes/hbase-shaded-client-project/target/build-archetype/target/generated-sources/archetype/target/hbase-shaded-client-project-archetype-2.0.0-SNAPSHOT.jar>
to /x1/jenkins/mvn-repo/org/apache/hbase/hbase-shaded-client-project-archetype/2.0.0-SNAPSHOT/hbase-shaded-client-project-archetype-2.0.0-SNAPSHOT.jar
[INFO] Installing <https://analysis.apache.org/jenkins/job/hbase/ws/hbase-archetypes/hbase-shaded-client-project/target/build-archetype/target/generated-sources/archetype/pom.xml>
to /x1/jenkins/mvn-repo/org/apache/hbase/hbase-shaded-client-project-archetype/2.0.0-SNAPSHOT/hbase-shaded-client-project-archetype-2.0.0-SNAPSHOT.pom
[INFO] 
[INFO] --- maven-archetype-plugin:2.4:update-local-catalog (default-update-local-catalog)
@ hbase-shaded-client-project-archetype ---
[INFO] ------------------------------------------------------------------------
[INFO] BUILD SUCCESS
[INFO] ------------------------------------------------------------------------
[INFO] Total time: 4.364 s
[INFO] Finished at: 2016-04-11T20:09:55+00:00
[INFO] Final Memory: 14M/491M
[INFO] ------------------------------------------------------------------------
[JENKINS] Archiving disabled
[JENKINS] Archiving disabled
[JENKINS] Archiving disabled
[JENKINS] Archiving disabled
[JENKINS] Archiving disabled
[JENKINS] Archiving disabled
[JENKINS] Archiving disabled
[JENKINS] Archiving disabled
[JENKINS] Archiving disabled
[JENKINS] Archiving disabled
[JENKINS] Archiving disabled
[JENKINS] Archiving disabled
[JENKINS] Archiving disabled
[JENKINS] Archiving disabled
[JENKINS] Archiving disabled
[JENKINS] Archiving disabled
[JENKINS] Archiving disabled
[JENKINS] Archiving disabled
[JENKINS] Archiving disabled
[JENKINS] Archiving disabled
[JENKINS] Archiving disabled
[JENKINS] Archiving disabled
[JENKINS] Archiving disabled
[JENKINS] Archiving disabled
[JENKINS] Archiving disabled
[JENKINS] Archiving disabled
[JENKINS] Archiving disabled
[JENKINS] Archiving disabled
[JENKINS] Archiving disabled
[JENKINS] Archiving disabled
[INFO] ------------------------------------------------------------------------
[INFO] Reactor Summary:
[INFO] 
[INFO] Apache HBase ...................................... SUCCESS [ 47.258 s]
[INFO] Apache HBase - Checkstyle ......................... SUCCESS [  6.979 s]
[INFO] Apache HBase - Resource Bundle .................... SUCCESS [  2.315 s]
[INFO] Apache HBase - Annotations ........................ SUCCESS [  4.576 s]
[INFO] Apache HBase - Protocol ........................... SUCCESS [ 45.114 s]
[INFO] Apache HBase - Common ............................. SUCCESS [01:00 min]
[INFO] Apache HBase - Procedure .......................... SUCCESS [ 12.903 s]
[INFO] Apache HBase - Client ............................. SUCCESS [ 24.806 s]
[INFO] Apache HBase - Hadoop Compatibility ............... SUCCESS [ 13.071 s]
[INFO] Apache HBase - Hadoop Two Compatibility ........... SUCCESS [ 10.822 s]
[INFO] Apache HBase - Prefix Tree ........................ SUCCESS [  7.669 s]
[INFO] Apache HBase - Server ............................. FAILURE [ 59.171 s]
[INFO] Apache HBase - Testing Util ....................... SKIPPED
[INFO] Apache HBase - Thrift ............................. SKIPPED
[INFO] Apache HBase - RSGroup ............................ SKIPPED
[INFO] Apache HBase - Shell .............................. SKIPPED
[INFO] Apache HBase - Integration Tests .................. SKIPPED
[INFO] Apache HBase - Examples ........................... SKIPPED
[INFO] Apache HBase - Rest ............................... SKIPPED
[INFO] Apache HBase - External Block Cache ............... SKIPPED
[INFO] Apache HBase - Spark .............................. SKIPPED
[INFO] Apache HBase - Assembly ........................... SKIPPED
[INFO] Apache HBase - Shaded ............................. SUCCESS [  1.022 s]
[INFO] Apache HBase - Shaded - Client .................... SUCCESS [  6.865 s]
[INFO] Apache HBase - Shaded - Server .................... SKIPPED
[INFO] Apache HBase - Archetypes ......................... SUCCESS [  2.256 s]
[INFO] Apache HBase - Exemplar for hbase-client archetype  SKIPPED
[INFO] Apache HBase - Exemplar for hbase-shaded-client archetype  SKIPPED
[INFO] Apache HBase - Archetype builder .................. SUCCESS [01:29 min]
[INFO] ------------------------------------------------------------------------
[INFO] BUILD FAILURE
[INFO] ------------------------------------------------------------------------
[INFO] Total time: 06:58 min
[INFO] Finished at: 2016-04-11T20:09:58+00:00
[INFO] Final Memory: 106M/669M
[INFO] ------------------------------------------------------------------------
Waiting for Jenkins to finish collecting data[ERROR] Failed to execute goal org.apache.maven.plugins:maven-compiler-plugin:3.2:compile
(default-compile) on project hbase-server: Compilation failure: Compilation failure:
[ERROR] <https://analysis.apache.org/jenkins/job/hbase/ws/hbase-server/src/main/java/org/apache/hadoop/hbase/util/CompoundBloomFilter.java>:[49,26]
org.apache.hadoop.hbase.io.hfile.HFileBlockIndex.BlockIndexReader is not public in org.apache.hadoop.hbase.io.hfile.HFileBlockIndex;
cannot be accessed from outside package
[ERROR] <https://analysis.apache.org/jenkins/job/hbase/ws/hbase-server/src/main/java/org/apache/hadoop/hbase/util/CompoundBloomFilter.java>:[43,8]
org.apache.hadoop.hbase.util.CompoundBloomFilter is not abstract and does not override abstract
method contains(byte[],int,int,org.apache.hadoop.hbase.nio.ByteBuff) in org.apache.hadoop.hbase.util.BloomFilter
[ERROR] <https://analysis.apache.org/jenkins/job/hbase/ws/hbase-server/src/main/java/org/apache/hadoop/hbase/util/CompoundBloomFilter.java>:[87,32]
org.apache.hadoop.hbase.io.hfile.HFileBlockIndex.BlockIndexReader is not public in org.apache.hadoop.hbase.io.hfile.HFileBlockIndex;
cannot be accessed from outside package
[ERROR] <https://analysis.apache.org/jenkins/job/hbase/ws/hbase-server/src/main/java/org/apache/hadoop/hbase/util/CompoundBloomFilter.java>:[91,3]
method does not override or implement a method from a supertype
[ERROR] <https://analysis.apache.org/jenkins/job/hbase/ws/hbase-server/src/main/java/org/apache/hadoop/hbase/util/CompoundBloomFilter.java>:[119,57]
incompatible types
[ERROR] required: java.nio.ByteBuffer
[ERROR] found:    org.apache.hadoop.hbase.nio.ByteBuff
[ERROR] <https://analysis.apache.org/jenkins/job/hbase/ws/hbase-server/src/main/java/org/apache/hadoop/hbase/util/CompoundBloomFilter.java>:[122,21]
getUncompressedSizeWithoutHeader() is not public in org.apache.hadoop.hbase.io.hfile.HFileBlock;
cannot be accessed from outside package
[ERROR] <https://analysis.apache.org/jenkins/job/hbase/ws/hbase-server/src/main/java/org/apache/hadoop/hbase/util/CompoundBloomFilter.java>:[120,31]
method contains in class org.apache.hadoop.hbase.util.BloomFilterUtil cannot be applied to
given types;
[ERROR] required: byte[],int,int,org.apache.hadoop.hbase.nio.ByteBuff,int,int,org.apache.hadoop.hbase.util.Hash,int
[ERROR] found: byte[],int,int,java.nio.ByteBuffer,int,int,org.apache.hadoop.hbase.util.Hash,int
[ERROR] reason: actual argument java.nio.ByteBuffer cannot be converted to org.apache.hadoop.hbase.nio.ByteBuff
by method invocation conversion
[ERROR] <https://analysis.apache.org/jenkins/job/hbase/ws/hbase-server/src/main/java/org/apache/hadoop/hbase/util/CompoundBloomFilter.java>:[135,3]
method does not override or implement a method from a supertype
[ERROR] -> [Help 1]
[ERROR] 
[ERROR] To see the full stack trace of the errors, re-run Maven with the -e switch.
[ERROR] Re-run Maven using the -X switch to enable full debug logging.
[ERROR] 
[ERROR] For more information about the errors and possible solutions, please read the following
articles:
[ERROR] [Help 1] http://cwiki.apache.org/confluence/display/MAVEN/MojoFailureException
[ERROR] 
[ERROR] After correcting the problems, you can resume the build with the command
[ERROR]   mvn <goals> -rf :hbase-server

Sending e-mails to: builds@hbase.apache.org
channel stopped
Skipping sonar analysis due to bad build status FAILURE

Mime
View raw message