hbase-builds mailing list archives

Site index · List index
Message view « Date » · « Thread »
Top « Date » · « Thread »
From Apache Jenkins Server <jenk...@builds.apache.org>
Subject Build failed in Jenkins: HBase-Trunk_matrix » latest1.7,yahoo-not-h2 #841
Date Wed, 13 Apr 2016 01:55:19 GMT
See <https://builds.apache.org/job/HBase-Trunk_matrix/jdk=latest1.7,label=yahoo-not-h2/841/changes>

Changes:

[matteo.bertozzi] HBASE-15632 Undo the checking of lastStoreFlushTimeMap.isEmpty()

[matteo.bertozzi] HBASE-15621 Suppress Hbase SnapshotHFile cleaner error messages when a

------------------------------------------
[...truncated 4719 lines...]
Tests run: 3, Failures: 0, Errors: 0, Skipped: 0, Time elapsed: 0.822 sec - in org.apache.hadoop.hbase.codec.TestCellMessageCodec
Running org.apache.hadoop.hbase.protobuf.TestReplicationProtobuf
Tests run: 1, Failures: 0, Errors: 0, Skipped: 0, Time elapsed: 0.73 sec - in org.apache.hadoop.hbase.protobuf.TestReplicationProtobuf
Running org.apache.hadoop.hbase.protobuf.TestProtobufUtil
Tests run: 7, Failures: 0, Errors: 0, Skipped: 0, Time elapsed: 10.499 sec - in org.apache.hadoop.hbase.protobuf.TestProtobufUtil
Running org.apache.hadoop.hbase.zookeeper.TestZooKeeperMainServer
Tests run: 2, Failures: 0, Errors: 0, Skipped: 0, Time elapsed: 8.487 sec - in org.apache.hadoop.hbase.zookeeper.TestZooKeeperMainServer
Running org.apache.hadoop.hbase.security.TestUser
Tests run: 8, Failures: 0, Errors: 0, Skipped: 0, Time elapsed: 10.706 sec - in org.apache.hadoop.hbase.security.TestUser
Running org.apache.hadoop.hbase.security.token.TestAuthenticationKey
Tests run: 1, Failures: 0, Errors: 0, Skipped: 0, Time elapsed: 3.144 sec - in org.apache.hadoop.hbase.security.token.TestAuthenticationKey
Running org.apache.hadoop.hbase.security.token.TestZKSecretWatcherRefreshKeys
Tests run: 1, Failures: 0, Errors: 0, Skipped: 0, Time elapsed: 2.027 sec - in org.apache.hadoop.hbase.security.token.TestZKSecretWatcherRefreshKeys
Running org.apache.hadoop.hbase.security.TestSecureIPC
Tests run: 4, Failures: 0, Errors: 0, Skipped: 0, Time elapsed: 37.222 sec - in org.apache.hadoop.hbase.security.TestSecureIPC
Running org.apache.hadoop.hbase.security.TestAsyncSecureIPC
Tests run: 4, Failures: 0, Errors: 0, Skipped: 0, Time elapsed: 16.944 sec - in org.apache.hadoop.hbase.security.TestAsyncSecureIPC
Running org.apache.hadoop.hbase.security.TestUsersOperationsWithSecureHadoop
Tests run: 1, Failures: 0, Errors: 0, Skipped: 0, Time elapsed: 10.132 sec - in org.apache.hadoop.hbase.security.TestUsersOperationsWithSecureHadoop
Running org.apache.hadoop.hbase.security.visibility.TestExpressionExpander
Tests run: 1, Failures: 0, Errors: 0, Skipped: 0, Time elapsed: 0.906 sec - in org.apache.hadoop.hbase.security.visibility.TestExpressionExpander
Running org.apache.hadoop.hbase.security.visibility.TestExpressionParser
Tests run: 4, Failures: 0, Errors: 0, Skipped: 0, Time elapsed: 1.185 sec - in org.apache.hadoop.hbase.security.visibility.TestExpressionParser
Running org.apache.hadoop.hbase.wal.TestWALMethods
Tests run: 3, Failures: 0, Errors: 0, Skipped: 0, Time elapsed: 7.606 sec - in org.apache.hadoop.hbase.wal.TestWALMethods
Running org.apache.hadoop.hbase.client.TestConnectionUtils
Tests run: 1, Failures: 0, Errors: 0, Skipped: 0, Time elapsed: 1.289 sec - in org.apache.hadoop.hbase.client.TestConnectionUtils
Running org.apache.hadoop.hbase.client.TestIntraRowPagination
Tests run: 1, Failures: 0, Errors: 0, Skipped: 0, Time elapsed: 11.911 sec - in org.apache.hadoop.hbase.client.TestIntraRowPagination
Running org.apache.hadoop.hbase.client.TestResult
Tests run: 9, Failures: 0, Errors: 0, Skipped: 0, Time elapsed: 2.366 sec - in org.apache.hadoop.hbase.client.TestResult
Running org.apache.hadoop.hbase.client.TestPutDeleteEtcCellIteration
Tests run: 6, Failures: 0, Errors: 0, Skipped: 0, Time elapsed: 2.1 sec - in org.apache.hadoop.hbase.client.TestPutDeleteEtcCellIteration
Running org.apache.hadoop.hbase.client.TestHBaseAdminNoCluster
Tests run: 2, Failures: 0, Errors: 0, Skipped: 1, Time elapsed: 22.412 sec - in org.apache.hadoop.hbase.client.TestHBaseAdminNoCluster
Running org.apache.hadoop.hbase.quotas.TestQuotaState
Tests run: 5, Failures: 0, Errors: 0, Skipped: 0, Time elapsed: 8.37 sec - in org.apache.hadoop.hbase.quotas.TestQuotaState
Running org.apache.hadoop.hbase.quotas.TestRateLimiter
Tests run: 12, Failures: 0, Errors: 0, Skipped: 0, Time elapsed: 3.3 sec - in org.apache.hadoop.hbase.quotas.TestRateLimiter
Running org.apache.hadoop.hbase.snapshot.TestSnapshotManifest
Tests run: 1, Failures: 0, Errors: 0, Skipped: 0, Time elapsed: 42.039 sec - in org.apache.hadoop.hbase.snapshot.TestSnapshotManifest
Running org.apache.hadoop.hbase.snapshot.TestMobRestoreSnapshotHelper
Tests run: 2, Failures: 0, Errors: 0, Skipped: 0, Time elapsed: 14.592 sec - in org.apache.hadoop.hbase.snapshot.TestMobRestoreSnapshotHelper
Running org.apache.hadoop.hbase.snapshot.TestRestoreSnapshotHelper
Tests run: 2, Failures: 0, Errors: 0, Skipped: 0, Time elapsed: 16.498 sec - in org.apache.hadoop.hbase.snapshot.TestRestoreSnapshotHelper
Running org.apache.hadoop.hbase.coprocessor.TestCoprocessorConfiguration
Tests run: 5, Failures: 0, Errors: 0, Skipped: 0, Time elapsed: 6.189 sec - in org.apache.hadoop.hbase.coprocessor.TestCoprocessorConfiguration
Running org.apache.hadoop.hbase.coprocessor.TestCoprocessorHost
Tests run: 1, Failures: 0, Errors: 0, Skipped: 0, Time elapsed: 3.203 sec - in org.apache.hadoop.hbase.coprocessor.TestCoprocessorHost
Running org.apache.hadoop.hbase.coprocessor.TestRegionObserverStacking
Tests run: 1, Failures: 0, Errors: 0, Skipped: 0, Time elapsed: 12.471 sec - in org.apache.hadoop.hbase.coprocessor.TestRegionObserverStacking
Running org.apache.hadoop.hbase.coprocessor.TestCoprocessorInterface
Tests run: 2, Failures: 0, Errors: 0, Skipped: 0, Time elapsed: 38.16 sec - in org.apache.hadoop.hbase.coprocessor.TestCoprocessorInterface
Running org.apache.hadoop.hbase.regionserver.TestStoreFileInfo
Tests run: 2, Failures: 0, Errors: 0, Skipped: 0, Time elapsed: 4.446 sec - in org.apache.hadoop.hbase.regionserver.TestStoreFileInfo
Running org.apache.hadoop.hbase.regionserver.TestResettingCounters
Tests run: 1, Failures: 0, Errors: 0, Skipped: 0, Time elapsed: 12.053 sec - in org.apache.hadoop.hbase.regionserver.TestResettingCounters
Running org.apache.hadoop.hbase.regionserver.TestBlocksScanned
Tests run: 2, Failures: 0, Errors: 0, Skipped: 0, Time elapsed: 29.198 sec - in org.apache.hadoop.hbase.regionserver.TestBlocksScanned
Running org.apache.hadoop.hbase.regionserver.TestKeyValueScanFixture
Tests run: 1, Failures: 0, Errors: 0, Skipped: 0, Time elapsed: 1.997 sec - in org.apache.hadoop.hbase.regionserver.TestKeyValueScanFixture
Running org.apache.hadoop.hbase.regionserver.TestMinVersions
Tests run: 6, Failures: 0, Errors: 0, Skipped: 0, Time elapsed: 19.044 sec - in org.apache.hadoop.hbase.regionserver.TestMinVersions
Running org.apache.hadoop.hbase.regionserver.TestExplicitColumnTracker
Tests run: 4, Failures: 0, Errors: 0, Skipped: 0, Time elapsed: 2.375 sec - in org.apache.hadoop.hbase.regionserver.TestExplicitColumnTracker
Running org.apache.hadoop.hbase.regionserver.TestDefaultStoreEngine
Tests run: 1, Failures: 0, Errors: 0, Skipped: 0, Time elapsed: 6.782 sec - in org.apache.hadoop.hbase.regionserver.TestDefaultStoreEngine
Running org.apache.hadoop.hbase.regionserver.TestTimeRangeTracker
Tests run: 4, Failures: 0, Errors: 0, Skipped: 0, Time elapsed: 1.95 sec - in org.apache.hadoop.hbase.regionserver.TestTimeRangeTracker
Running org.apache.hadoop.hbase.regionserver.TestQosFunction
Tests run: 2, Failures: 0, Errors: 0, Skipped: 0, Time elapsed: 14.069 sec - in org.apache.hadoop.hbase.regionserver.TestQosFunction
Running org.apache.hadoop.hbase.regionserver.TestScanWildcardColumnTracker
Tests run: 2, Failures: 0, Errors: 0, Skipped: 0, Time elapsed: 0.987 sec - in org.apache.hadoop.hbase.regionserver.TestScanWildcardColumnTracker
Running org.apache.hadoop.hbase.regionserver.TestKeepDeletes
Tests run: 12, Failures: 0, Errors: 0, Skipped: 0, Time elapsed: 20.764 sec - in org.apache.hadoop.hbase.regionserver.TestKeepDeletes
Running org.apache.hadoop.hbase.regionserver.TestDefaultCompactSelection
Tests run: 4, Failures: 0, Errors: 0, Skipped: 0, Time elapsed: 10.143 sec - in org.apache.hadoop.hbase.regionserver.TestDefaultCompactSelection
Running org.apache.hadoop.hbase.regionserver.TestScanDeleteTracker
Tests run: 8, Failures: 0, Errors: 0, Skipped: 0, Time elapsed: 2.346 sec - in org.apache.hadoop.hbase.regionserver.TestScanDeleteTracker
Running org.apache.hadoop.hbase.regionserver.TestBulkLoad
Tests run: 9, Failures: 0, Errors: 0, Skipped: 0, Time elapsed: 14.467 sec - in org.apache.hadoop.hbase.regionserver.TestBulkLoad
Running org.apache.hadoop.hbase.regionserver.TestRegionSplitPolicy
Tests run: 8, Failures: 0, Errors: 0, Skipped: 0, Time elapsed: 9.924 sec - in org.apache.hadoop.hbase.regionserver.TestRegionSplitPolicy
Running org.apache.hadoop.hbase.regionserver.TestServerNonceManager
Tests run: 6, Failures: 0, Errors: 0, Skipped: 0, Time elapsed: 10.296 sec - in org.apache.hadoop.hbase.regionserver.TestServerNonceManager
Running org.apache.hadoop.hbase.regionserver.TestHRegionFileSystem
Tests run: 3, Failures: 0, Errors: 0, Skipped: 0, Time elapsed: 24.627 sec - in org.apache.hadoop.hbase.regionserver.TestHRegionFileSystem
Running org.apache.hadoop.hbase.regionserver.TestScanWithBloomError
Tests run: 3, Failures: 0, Errors: 0, Skipped: 0, Time elapsed: 12.527 sec - in org.apache.hadoop.hbase.regionserver.TestScanWithBloomError
Running org.apache.hadoop.hbase.regionserver.TestStripeStoreEngine
Tests run: 2, Failures: 0, Errors: 0, Skipped: 0, Time elapsed: 9.235 sec - in org.apache.hadoop.hbase.regionserver.TestStripeStoreEngine
Running org.apache.hadoop.hbase.regionserver.TestHRegionInfo
Tests run: 11, Failures: 0, Errors: 0, Skipped: 0, Time elapsed: 20.244 sec - in org.apache.hadoop.hbase.regionserver.TestHRegionInfo
Running org.apache.hadoop.hbase.regionserver.TestHeapMemoryManager
Tests run: 13, Failures: 0, Errors: 0, Skipped: 0, Time elapsed: 25.062 sec - in org.apache.hadoop.hbase.regionserver.TestHeapMemoryManager
Running org.apache.hadoop.hbase.regionserver.TestDateTieredCompactionPolicy
Tests run: 15, Failures: 0, Errors: 0, Skipped: 0, Time elapsed: 14.059 sec - in org.apache.hadoop.hbase.regionserver.TestDateTieredCompactionPolicy
Running org.apache.hadoop.hbase.regionserver.TestMemStoreLAB
Tests run: 3, Failures: 0, Errors: 0, Skipped: 0, Time elapsed: 7.921 sec - in org.apache.hadoop.hbase.regionserver.TestMemStoreLAB
Running org.apache.hadoop.hbase.regionserver.wal.TestMetricsWAL
Tests run: 4, Failures: 0, Errors: 0, Skipped: 0, Time elapsed: 2.357 sec - in org.apache.hadoop.hbase.regionserver.wal.TestMetricsWAL
Running org.apache.hadoop.hbase.regionserver.wal.TestSequenceIdAccounting
Tests run: 3, Failures: 0, Errors: 0, Skipped: 0, Time elapsed: 0.722 sec - in org.apache.hadoop.hbase.regionserver.wal.TestSequenceIdAccounting
Running org.apache.hadoop.hbase.regionserver.wal.TestCompressor
Tests run: 4, Failures: 0, Errors: 0, Skipped: 0, Time elapsed: 2.299 sec - in org.apache.hadoop.hbase.regionserver.wal.TestCompressor
Running org.apache.hadoop.hbase.regionserver.wal.TestWALCellCodecWithCompression
Tests run: 2, Failures: 0, Errors: 0, Skipped: 0, Time elapsed: 0.995 sec - in org.apache.hadoop.hbase.regionserver.wal.TestWALCellCodecWithCompression
Running org.apache.hadoop.hbase.regionserver.wal.TestCustomWALCellCodec
Tests run: 1, Failures: 0, Errors: 0, Skipped: 0, Time elapsed: 1.245 sec - in org.apache.hadoop.hbase.regionserver.wal.TestCustomWALCellCodec
Running org.apache.hadoop.hbase.regionserver.wal.TestKeyValueCompression
Tests run: 3, Failures: 0, Errors: 0, Skipped: 0, Time elapsed: 1.428 sec - in org.apache.hadoop.hbase.regionserver.wal.TestKeyValueCompression
Running org.apache.hadoop.hbase.regionserver.wal.TestWALActionsListener
Tests run: 1, Failures: 0, Errors: 0, Skipped: 0, Time elapsed: 2.897 sec - in org.apache.hadoop.hbase.regionserver.wal.TestWALActionsListener
Running org.apache.hadoop.hbase.regionserver.TestScanner
Tests run: 7, Failures: 0, Errors: 0, Skipped: 0, Time elapsed: 48.289 sec - in org.apache.hadoop.hbase.regionserver.TestScanner
Running org.apache.hadoop.hbase.regionserver.TestStripeStoreFileManager
Tests run: 15, Failures: 0, Errors: 0, Skipped: 0, Time elapsed: 19.091 sec - in org.apache.hadoop.hbase.regionserver.TestStripeStoreFileManager
Running org.apache.hadoop.hbase.regionserver.TestRegionMergeTransaction
Tests run: 11, Failures: 0, Errors: 0, Skipped: 0, Time elapsed: 62.971 sec - in org.apache.hadoop.hbase.regionserver.TestRegionMergeTransaction
Running org.apache.hadoop.hbase.regionserver.TestStoreFile
Tests run: 13, Failures: 0, Errors: 0, Skipped: 0, Time elapsed: 15.297 sec - in org.apache.hadoop.hbase.regionserver.TestStoreFile
Running org.apache.hadoop.hbase.regionserver.TestRSStatusServlet
Tests run: 2, Failures: 0, Errors: 0, Skipped: 0, Time elapsed: 6.888 sec - in org.apache.hadoop.hbase.regionserver.TestRSStatusServlet
Running org.apache.hadoop.hbase.regionserver.TestMemStoreChunkPool
Tests run: 3, Failures: 0, Errors: 0, Skipped: 0, Time elapsed: 2.408 sec - in org.apache.hadoop.hbase.regionserver.TestMemStoreChunkPool
Running org.apache.hadoop.hbase.regionserver.TestWideScanner
Tests run: 1, Failures: 0, Errors: 0, Skipped: 0, Time elapsed: 21.465 sec - in org.apache.hadoop.hbase.regionserver.TestWideScanner
Running org.apache.hadoop.hbase.regionserver.TestKeyValueHeap
Tests run: 4, Failures: 0, Errors: 0, Skipped: 0, Time elapsed: 1.099 sec - in org.apache.hadoop.hbase.regionserver.TestKeyValueHeap
Running org.apache.hadoop.hbase.regionserver.TestMetricsRegion
Tests run: 1, Failures: 0, Errors: 0, Skipped: 0, Time elapsed: 3.433 sec - in org.apache.hadoop.hbase.regionserver.TestMetricsRegion
Running org.apache.hadoop.hbase.regionserver.TestMultiVersionConcurrencyControlBasic
Tests run: 1, Failures: 0, Errors: 0, Skipped: 0, Time elapsed: 0.811 sec - in org.apache.hadoop.hbase.regionserver.TestMultiVersionConcurrencyControlBasic
Running org.apache.hadoop.hbase.regionserver.TestQueryMatcher
Tests run: 5, Failures: 0, Errors: 0, Skipped: 0, Time elapsed: 1.65 sec - in org.apache.hadoop.hbase.regionserver.TestQueryMatcher
Running org.apache.hadoop.hbase.regionserver.TestStoreFileScannerWithTagCompression
Tests run: 1, Failures: 0, Errors: 0, Skipped: 0, Time elapsed: 2.461 sec - in org.apache.hadoop.hbase.regionserver.TestStoreFileScannerWithTagCompression
Running org.apache.hadoop.hbase.regionserver.TestStoreFileRefresherChore
Tests run: 1, Failures: 0, Errors: 0, Skipped: 0, Time elapsed: 20.272 sec - in org.apache.hadoop.hbase.regionserver.TestStoreFileRefresherChore
Running org.apache.hadoop.hbase.regionserver.compactions.TestStripeCompactionPolicy
Tests run: 30, Failures: 0, Errors: 0, Skipped: 0, Time elapsed: 23.288 sec - in org.apache.hadoop.hbase.regionserver.compactions.TestStripeCompactionPolicy
Running org.apache.hadoop.hbase.regionserver.compactions.TestOffPeakHours
Tests run: 3, Failures: 0, Errors: 0, Skipped: 0, Time elapsed: 0.864 sec - in org.apache.hadoop.hbase.regionserver.compactions.TestOffPeakHours
Running org.apache.hadoop.hbase.regionserver.compactions.TestStripeCompactor
Tests run: 6, Failures: 0, Errors: 0, Skipped: 0, Time elapsed: 15.445 sec - in org.apache.hadoop.hbase.regionserver.compactions.TestStripeCompactor
Running org.apache.hadoop.hbase.regionserver.compactions.TestDateTieredCompactor
Tests run: 4, Failures: 0, Errors: 0, Skipped: 0, Time elapsed: 10.336 sec - in org.apache.hadoop.hbase.regionserver.compactions.TestDateTieredCompactor
Running org.apache.hadoop.hbase.regionserver.TestMiniBatchOperationInProgress
Tests run: 1, Failures: 0, Errors: 0, Skipped: 0, Time elapsed: 0.925 sec - in org.apache.hadoop.hbase.regionserver.TestMiniBatchOperationInProgress
Running org.apache.hadoop.hbase.regionserver.TestMetricsRegionServer
Tests run: 5, Failures: 0, Errors: 0, Skipped: 0, Time elapsed: 6.584 sec - in org.apache.hadoop.hbase.regionserver.TestMetricsRegionServer
Running org.apache.hadoop.hbase.regionserver.TestSplitTransaction
Tests run: 8, Failures: 0, Errors: 0, Skipped: 0, Time elapsed: 285.03 sec - in org.apache.hadoop.hbase.regionserver.TestSplitTransaction
Running org.apache.hadoop.hbase.regionserver.TestCellSkipListSet
Tests run: 4, Failures: 0, Errors: 0, Skipped: 0, Time elapsed: 1.484 sec - in org.apache.hadoop.hbase.regionserver.TestCellSkipListSet
Running org.apache.hadoop.hbase.TestServerName
Tests run: 7, Failures: 0, Errors: 0, Skipped: 0, Time elapsed: 3.115 sec - in org.apache.hadoop.hbase.TestServerName
Running org.apache.hadoop.hbase.TestServerLoad
Tests run: 3, Failures: 0, Errors: 0, Skipped: 0, Time elapsed: 1.433 sec - in org.apache.hadoop.hbase.TestServerLoad
Running org.apache.hadoop.hbase.TestHDFSBlocksDistribution
Tests run: 2, Failures: 0, Errors: 0, Skipped: 0, Time elapsed: 1.418 sec - in org.apache.hadoop.hbase.TestHDFSBlocksDistribution
Running org.apache.hadoop.hbase.errorhandling.TestTimeoutExceptionInjector
Tests run: 4, Failures: 0, Errors: 0, Skipped: 0, Time elapsed: 2.445 sec - in org.apache.hadoop.hbase.errorhandling.TestTimeoutExceptionInjector
Running org.apache.hadoop.hbase.errorhandling.TestForeignExceptionDispatcher
Tests run: 3, Failures: 0, Errors: 0, Skipped: 0, Time elapsed: 2.743 sec - in org.apache.hadoop.hbase.errorhandling.TestForeignExceptionDispatcher
Running org.apache.hadoop.hbase.errorhandling.TestForeignExceptionSerialization
Tests run: 2, Failures: 0, Errors: 0, Skipped: 0, Time elapsed: 1.607 sec - in org.apache.hadoop.hbase.errorhandling.TestForeignExceptionSerialization
Running org.apache.hadoop.hbase.TestFSTableDescriptorForceCreation
Tests run: 3, Failures: 0, Errors: 0, Skipped: 0, Time elapsed: 8.194 sec - in org.apache.hadoop.hbase.TestFSTableDescriptorForceCreation
Running org.apache.hadoop.hbase.TestCheckTestClasses
Tests run: 1, Failures: 0, Errors: 0, Skipped: 0, Time elapsed: 14.976 sec - in org.apache.hadoop.hbase.TestCheckTestClasses

Results :

Failed tests: 
  TestAsyncIPC.testRTEDuringAsyncConnectionSetup:230 Waiting timed out after [1,000] msec

Tests run: 1082, Failures: 1, Errors: 0, Skipped: 21

[INFO] ------------------------------------------------------------------------
[INFO] Reactor Summary:
[INFO] 
[INFO] Apache HBase ...................................... SUCCESS [ 20.014 s]
[INFO] Apache HBase - Checkstyle ......................... SUCCESS [  5.361 s]
[INFO] Apache HBase - Resource Bundle .................... SUCCESS [  1.678 s]
[INFO] Apache HBase - Annotations ........................ SUCCESS [  1.368 s]
[INFO] Apache HBase - Protocol ........................... SUCCESS [ 17.197 s]
[INFO] Apache HBase - Common ............................. SUCCESS [06:58 min]
[INFO] Apache HBase - Procedure .......................... SUCCESS [09:21 min]
[INFO] Apache HBase - Client ............................. SUCCESS [03:52 min]
[INFO] Apache HBase - Hadoop Compatibility ............... SUCCESS [ 25.629 s]
[INFO] Apache HBase - Hadoop Two Compatibility ........... SUCCESS [ 48.215 s]
[INFO] Apache HBase - Prefix Tree ........................ SUCCESS [01:02 min]
[INFO] Apache HBase - Server ............................. FAILURE [  01:29 h]
[INFO] Apache HBase - Testing Util ....................... SKIPPED
[INFO] Apache HBase - Thrift ............................. SKIPPED
[INFO] Apache HBase - RSGroup ............................ SKIPPED
[INFO] Apache HBase - Shell .............................. SKIPPED
[INFO] Apache HBase - Integration Tests .................. SKIPPED
[INFO] Apache HBase - Examples ........................... SKIPPED
[INFO] Apache HBase - Rest ............................... SKIPPED
[INFO] Apache HBase - External Block Cache ............... SKIPPED
[INFO] Apache HBase - Spark .............................. SKIPPED
[INFO] Apache HBase - Assembly ........................... SKIPPED
[INFO] Apache HBase - Shaded ............................. SKIPPED
[INFO] Apache HBase - Shaded - Client .................... SKIPPED
[INFO] Apache HBase - Shaded - Server .................... SKIPPED
[INFO] Apache HBase - Archetypes ......................... SKIPPED
[INFO] Apache HBase - Exemplar for hbase-client archetype  SKIPPED
[INFO] Apache HBase - Exemplar for hbase-shaded-client archetype  SKIPPED
[INFO] Apache HBase - Archetype builder .................. SKIPPED
[INFO] ------------------------------------------------------------------------
[INFO] BUILD FAILURE
[INFO] ------------------------------------------------------------------------
[INFO] Total time: 01:52 h
[INFO] Finished at: 2016-04-13T01:53:24+00:00
[INFO] Final Memory: 69M/572M
[INFO] ------------------------------------------------------------------------
[ERROR] Failed to execute goal org.apache.maven.plugins:maven-surefire-plugin:2.18.1:test
(default-test) on project hbase-server: There are test failures.
[ERROR] 
[ERROR] Please refer to <https://builds.apache.org/job/HBase-Trunk_matrix/jdk=latest1.7,label=yahoo-not-h2/ws/hbase-server/target/surefire-reports>
for the individual test results.
[ERROR] -> [Help 1]
[ERROR] 
[ERROR] To see the full stack trace of the errors, re-run Maven with the -e switch.
[ERROR] Re-run Maven using the -X switch to enable full debug logging.
[ERROR] 
[ERROR] For more information about the errors and possible solutions, please read the following
articles:
[ERROR] [Help 1] http://cwiki.apache.org/confluence/display/MAVEN/MojoFailureException
[ERROR] 
[ERROR] After correcting the problems, you can resume the build with the command
[ERROR]   mvn <goals> -rf :hbase-server
Build step 'Invoke top-level Maven targets' marked build as failure
Performing Post build task...
Match found for :.* : True
Logical operation result is TRUE
Running script  : # Run zombie detector script
./dev-support/zombie-detector.sh --jenkins ${BUILD_ID}
[yahoo-not-h2] $ /bin/bash -xe /tmp/hudson5818216301087709740.sh
+ ./dev-support/zombie-detector.sh --jenkins 841
Wed Apr 13 01:53:28 UTC 2016 We're ok: there is no zombie test


    {color:green}+1 zombies{color}. No zombie tests found running at the end of the build.
POST BUILD TASK : SUCCESS
END OF POST BUILD TASK : 0
Archiving artifacts
Recording test results
[FINDBUGS] Skipping publisher since build result is FAILURE
[CHECKSTYLE] Skipping publisher since build result is FAILURE

Mime
View raw message