hbase-builds mailing list archives

Site index · List index
Message view « Date » · « Thread »
Top « Date » · « Thread »
From Apache Jenkins Server <jenk...@builds.apache.org>
Subject Build failed in Jenkins: HBase-1.2-IT » IntegrationTestBigLinkedList,latest1.7,yahoo-not-h2 #494
Date Fri, 29 Apr 2016 15:34:58 GMT
See <https://builds.apache.org/job/HBase-1.2-IT/it.test=IntegrationTestBigLinkedList,jdk=latest1.7,label=yahoo-not-h2/494/changes>

Changes:

[busbey] Revert "Label the new methods on Table introduced by HBASE-15645 as

[busbey] HBASE-15645 ADDENDUM Label the new methods on Table introduced by

------------------------------------------
[...truncated 45111 lines...]
173/281 KB   36/246 KB   5/5 KB   20/20 KB   25/25 KB   
173/281 KB   40/246 KB   5/5 KB   20/20 KB   25/25 KB   
177/281 KB   40/246 KB   5/5 KB   20/20 KB   25/25 KB   
177/281 KB   44/246 KB   5/5 KB   20/20 KB   25/25 KB   
181/281 KB   44/246 KB   5/5 KB   20/20 KB   25/25 KB   
181/281 KB   48/246 KB   5/5 KB   20/20 KB   25/25 KB   
185/281 KB   48/246 KB   5/5 KB   20/20 KB   25/25 KB   
189/281 KB   48/246 KB   5/5 KB   20/20 KB   25/25 KB   
189/281 KB   52/246 KB   5/5 KB   20/20 KB   25/25 KB   
193/281 KB   52/246 KB   5/5 KB   20/20 KB   25/25 KB   
193/281 KB   56/246 KB   5/5 KB   20/20 KB   25/25 KB   
197/281 KB   56/246 KB   5/5 KB   20/20 KB   25/25 KB   
197/281 KB   60/246 KB   5/5 KB   20/20 KB   25/25 KB   
201/281 KB   60/246 KB   5/5 KB   20/20 KB   25/25 KB   
205/281 KB   60/246 KB   5/5 KB   20/20 KB   25/25 KB   
205/281 KB   64/246 KB   5/5 KB   20/20 KB   25/25 KB   
209/281 KB   64/246 KB   5/5 KB   20/20 KB   25/25 KB   
209/281 KB   68/246 KB   5/5 KB   20/20 KB   25/25 KB   
213/281 KB   68/246 KB   5/5 KB   20/20 KB   25/25 KB   
213/281 KB   72/246 KB   5/5 KB   20/20 KB   25/25 KB   
217/281 KB   72/246 KB   5/5 KB   20/20 KB   25/25 KB   
221/281 KB   72/246 KB   5/5 KB   20/20 KB   25/25 KB   
221/281 KB   76/246 KB   5/5 KB   20/20 KB   25/25 KB   
225/281 KB   76/246 KB   5/5 KB   20/20 KB   25/25 KB   
225/281 KB   80/246 KB   5/5 KB   20/20 KB   25/25 KB   
229/281 KB   80/246 KB   5/5 KB   20/20 KB   25/25 KB   
229/281 KB   84/246 KB   5/5 KB   20/20 KB   25/25 KB   
233/281 KB   84/246 KB   5/5 KB   20/20 KB   25/25 KB   
233/281 KB   88/246 KB   5/5 KB   20/20 KB   25/25 KB   
237/281 KB   88/246 KB   5/5 KB   20/20 KB   25/25 KB   
237/281 KB   92/246 KB   5/5 KB   20/20 KB   25/25 KB   
241/281 KB   92/246 KB   5/5 KB   20/20 KB   25/25 KB   
245/281 KB   92/246 KB   5/5 KB   20/20 KB   25/25 KB   
245/281 KB   96/246 KB   5/5 KB   20/20 KB   25/25 KB   
249/281 KB   96/246 KB   5/5 KB   20/20 KB   25/25 KB   
249/281 KB   100/246 KB   5/5 KB   20/20 KB   25/25 KB   
253/281 KB   100/246 KB   5/5 KB   20/20 KB   25/25 KB   
253/281 KB   104/246 KB   5/5 KB   20/20 KB   25/25 KB   
257/281 KB   104/246 KB   5/5 KB   20/20 KB   25/25 KB   
257/281 KB   108/246 KB   5/5 KB   20/20 KB   25/25 KB   
261/281 KB   108/246 KB   5/5 KB   20/20 KB   25/25 KB   
261/281 KB   112/246 KB   5/5 KB   20/20 KB   25/25 KB   
265/281 KB   112/246 KB   5/5 KB   20/20 KB   25/25 KB   
269/281 KB   112/246 KB   5/5 KB   20/20 KB   25/25 KB   
269/281 KB   116/246 KB   5/5 KB   20/20 KB   25/25 KB   
273/281 KB   116/246 KB   5/5 KB   20/20 KB   25/25 KB   
273/281 KB   120/246 KB   5/5 KB   20/20 KB   25/25 KB   
277/281 KB   120/246 KB   5/5 KB   20/20 KB   25/25 KB   
277/281 KB   124/246 KB   5/5 KB   20/20 KB   25/25 KB   
281/281 KB   124/246 KB   5/5 KB   20/20 KB   25/25 KB   
281/281 KB   128/246 KB   5/5 KB   20/20 KB   25/25 KB   
281/281 KB   132/246 KB   5/5 KB   20/20 KB   25/25 KB   
281/281 KB   136/246 KB   5/5 KB   20/20 KB   25/25 KB   
281/281 KB   140/246 KB   5/5 KB   20/20 KB   25/25 KB   
281/281 KB   144/246 KB   5/5 KB   20/20 KB   25/25 KB   
281/281 KB   148/246 KB   5/5 KB   20/20 KB   25/25 KB   
281/281 KB   152/246 KB   5/5 KB   20/20 KB   25/25 KB   
281/281 KB   156/246 KB   5/5 KB   20/20 KB   25/25 KB   
281/281 KB   160/246 KB   5/5 KB   20/20 KB   25/25 KB   
281/281 KB   164/246 KB   5/5 KB   20/20 KB   25/25 KB   
281/281 KB   168/246 KB   5/5 KB   20/20 KB   25/25 KB   
281/281 KB   172/246 KB   5/5 KB   20/20 KB   25/25 KB   
281/281 KB   176/246 KB   5/5 KB   20/20 KB   25/25 KB   
281/281 KB   180/246 KB   5/5 KB   20/20 KB   25/25 KB   
281/281 KB   184/246 KB   5/5 KB   20/20 KB   25/25 KB   
281/281 KB   188/246 KB   5/5 KB   20/20 KB   25/25 KB   
281/281 KB   192/246 KB   5/5 KB   20/20 KB   25/25 KB   
281/281 KB   196/246 KB   5/5 KB   20/20 KB   25/25 KB   
281/281 KB   200/246 KB   5/5 KB   20/20 KB   25/25 KB   
281/281 KB   204/246 KB   5/5 KB   20/20 KB   25/25 KB   
281/281 KB   208/246 KB   5/5 KB   20/20 KB   25/25 KB   
281/281 KB   212/246 KB   5/5 KB   20/20 KB   25/25 KB   
281/281 KB   216/246 KB   5/5 KB   20/20 KB   25/25 KB   
281/281 KB   220/246 KB   5/5 KB   20/20 KB   25/25 KB   
281/281 KB   224/246 KB   5/5 KB   20/20 KB   25/25 KB   
281/281 KB   228/246 KB   5/5 KB   20/20 KB   25/25 KB   
281/281 KB   232/246 KB   5/5 KB   20/20 KB   25/25 KB   
281/281 KB   236/246 KB   5/5 KB   20/20 KB   25/25 KB   
281/281 KB   240/246 KB   5/5 KB   20/20 KB   25/25 KB   
281/281 KB   244/246 KB   5/5 KB   20/20 KB   25/25 KB   
281/281 KB   246/246 KB   5/5 KB   20/20 KB   25/25 KB   
                                                         
                                                         
Downloaded: http://repo.maven.apache.org/maven2/org/jamon/jamon-api/2.3.0/jamon-api-2.3.0.jar
(5 KB at 33.0 KB/sec)
Downloaded: http://repo.maven.apache.org/maven2/org/codehaus/plexus/plexus-compiler-api/1.8.1/plexus-compiler-api-1.8.1.jar
(20 KB at 143.3 KB/sec)
                                                         
Downloaded: http://repo.maven.apache.org/maven2/org/jamon/jamon-runtime/2.4.0/jamon-runtime-2.4.0.jar
(25 KB at 171.2 KB/sec)
                                                         
Downloaded: http://repo.maven.apache.org/maven2/org/jamon/jamon-processor/2.4.1/jamon-processor-2.4.1.jar
(281 KB at 1975.9 KB/sec)
                                                         
Downloaded: http://repo.maven.apache.org/maven2/org/codehaus/plexus/plexus-utils/1.5.5/plexus-utils-1.5.5.jar
(246 KB at 1692.3 KB/sec)
[INFO] Translating 10 templates from <https://builds.apache.org/job/HBase-1.2-IT/it.test=IntegrationTestBigLinkedList,jdk=latest1.7,label=yahoo-not-h2/ws/hbase-server/src/main/jamon>
to <https://builds.apache.org/job/HBase-1.2-IT/it.test=IntegrationTestBigLinkedList,jdk=latest1.7,label=yahoo-not-h2/ws/hbase-server/target/generated-jamon>
[INFO] 
[INFO] --- maven-antrun-plugin:1.6:run (generate) @ hbase-server ---
[INFO] Executing tasks

main:
    [mkdir] Created dir: <https://builds.apache.org/job/HBase-1.2-IT/it.test=IntegrationTestBigLinkedList,jdk=latest1.7,label=yahoo-not-h2/ws/hbase-server/target/hbase-webapps>
     [copy] Copying 20 files to <https://builds.apache.org/job/HBase-1.2-IT/it.test=IntegrationTestBigLinkedList,jdk=latest1.7,label=yahoo-not-h2/ws/hbase-server/target/hbase-webapps>
log4j:WARN No appenders could be found for logger (org.mortbay.log).
log4j:WARN Please initialize the log4j system properly.
log4j:WARN See http://logging.apache.org/log4j/1.2/faq.html#noconfig for more info.
    [mkdir] Created dir: <https://builds.apache.org/job/HBase-1.2-IT/it.test=IntegrationTestBigLinkedList,jdk=latest1.7,label=yahoo-not-h2/ws/hbase-server/target/hbase-webapps/master/WEB-INF>
    [mkdir] Created dir: <https://builds.apache.org/job/HBase-1.2-IT/it.test=IntegrationTestBigLinkedList,jdk=latest1.7,label=yahoo-not-h2/ws/hbase-server/target/hbase-webapps/regionserver/WEB-INF>
[INFO] Executed tasks
[INFO] 
[INFO] --- maven-remote-resources-plugin:1.5:process (default) @ hbase-server ---
[INFO] 
[INFO] --- maven-resources-plugin:2.6:resources (default-resources) @ hbase-server ---
[INFO] Using 'UTF-8' encoding to copy filtered resources.
[INFO] Copying 22 resources
[INFO] Copying 2 resources
[INFO] 
[INFO] --- maven-compiler-plugin:2.5.1:compile (default-compile) @ hbase-server ---
[INFO] Compiling 791 source files to <https://builds.apache.org/job/HBase-1.2-IT/it.test=IntegrationTestBigLinkedList,jdk=latest1.7,label=yahoo-not-h2/ws/hbase-server/target/classes>
[INFO] -------------------------------------------------------------
[ERROR] COMPILATION ERROR : 
[INFO] -------------------------------------------------------------
[ERROR] <https://builds.apache.org/job/HBase-1.2-IT/it.test=IntegrationTestBigLinkedList,jdk=latest1.7,label=yahoo-not-h2/ws/hbase-server/src/main/java/org/apache/hadoop/hbase/util/FSUtils.java>:[229,57]
Signal is internal proprietary API and may be removed in a future release
[ERROR] <https://builds.apache.org/job/HBase-1.2-IT/it.test=IntegrationTestBigLinkedList,jdk=latest1.7,label=yahoo-not-h2/ws/hbase-server/src/main/java/org/apache/hadoop/hbase/util/FSUtils.java>:[229,81]
SignalHandler is internal proprietary API and may be removed in a future release
[ERROR] <https://builds.apache.org/job/HBase-1.2-IT/it.test=IntegrationTestBigLinkedList,jdk=latest1.7,label=yahoo-not-h2/ws/hbase-server/src/main/java/org/apache/hadoop/hbase/regionserver/HRegionServer.java>:[609,24]
Signal is internal proprietary API and may be removed in a future release
[ERROR] <https://builds.apache.org/job/HBase-1.2-IT/it.test=IntegrationTestBigLinkedList,jdk=latest1.7,label=yahoo-not-h2/ws/hbase-server/src/main/java/org/apache/hadoop/hbase/regionserver/HRegionServer.java>:[609,43]
SignalHandler is internal proprietary API and may be removed in a future release
[ERROR] <https://builds.apache.org/job/HBase-1.2-IT/it.test=IntegrationTestBigLinkedList,jdk=latest1.7,label=yahoo-not-h2/ws/hbase-server/src/main/java/org/apache/hadoop/hbase/regionserver/HRegionServer.java>:[610,27]
Signal is internal proprietary API and may be removed in a future release
[ERROR] <https://builds.apache.org/job/HBase-1.2-IT/it.test=IntegrationTestBigLinkedList,jdk=latest1.7,label=yahoo-not-h2/ws/hbase-server/src/main/java/org/apache/hadoop/hbase/regionserver/HRegionServer.java>:[609,6]
Signal is internal proprietary API and may be removed in a future release
[ERROR] <https://builds.apache.org/job/HBase-1.2-IT/it.test=IntegrationTestBigLinkedList,jdk=latest1.7,label=yahoo-not-h2/ws/hbase-server/src/main/java/org/apache/hadoop/hbase/regionserver/RSDumpServlet.java>:[108,28]
error: method getOnlineRegions in class HRegionServer cannot be applied to given types;
[INFO] 7 errors 
[INFO] -------------------------------------------------------------
[INFO] ------------------------------------------------------------------------
[INFO] Reactor Summary:
[INFO] 
[INFO] Apache HBase ...................................... SUCCESS [1:41.661s]
[INFO] Apache HBase - Checkstyle ......................... SUCCESS [6.990s]
[INFO] Apache HBase - Resource Bundle .................... SUCCESS [0.285s]
[INFO] Apache HBase - Annotations ........................ SUCCESS [1.216s]
[INFO] Apache HBase - Protocol ........................... SUCCESS [18.590s]
[INFO] Apache HBase - Common ............................. SUCCESS [1:34.397s]
[INFO] Apache HBase - Procedure .......................... SUCCESS [1.399s]
[INFO] Apache HBase - Client ............................. SUCCESS [11.511s]
[INFO] Apache HBase - Hadoop Compatibility ............... SUCCESS [1.747s]
[INFO] Apache HBase - Hadoop Two Compatibility ........... SUCCESS [3.442s]
[INFO] Apache HBase - Prefix Tree ........................ SUCCESS [1.230s]
[INFO] Apache HBase - Server ............................. FAILURE [1:48.274s]
[INFO] Apache HBase - Testing Util ....................... SKIPPED
[INFO] Apache HBase - Thrift ............................. SKIPPED
[INFO] Apache HBase - Rest ............................... SKIPPED
[INFO] Apache HBase - Shell .............................. SKIPPED
[INFO] Apache HBase - Integration Tests .................. SKIPPED
[INFO] Apache HBase - Examples ........................... SKIPPED
[INFO] Apache HBase - External Block Cache ............... SKIPPED
[INFO] Apache HBase - Assembly ........................... SKIPPED
[INFO] Apache HBase - Shaded ............................. SKIPPED
[INFO] Apache HBase - Shaded - Client .................... SKIPPED
[INFO] Apache HBase - Shaded - Server .................... SKIPPED
[INFO] ------------------------------------------------------------------------
[INFO] BUILD FAILURE
[INFO] ------------------------------------------------------------------------
[INFO] Total time: 6:19.604s
[INFO] Finished at: Fri Apr 29 15:35:01 UTC 2016
[INFO] Final Memory: 90M/904M
[INFO] ------------------------------------------------------------------------
[ERROR] Failed to execute goal org.apache.maven.plugins:maven-compiler-plugin:2.5.1:compile
(default-compile) on project hbase-server: Compilation failure: Compilation failure:
[ERROR] <https://builds.apache.org/job/HBase-1.2-IT/it.test=IntegrationTestBigLinkedList,jdk=latest1.7,label=yahoo-not-h2/ws/hbase-server/src/main/java/org/apache/hadoop/hbase/util/FSUtils.java>:[229,57]
Signal is internal proprietary API and may be removed in a future release
[ERROR] <https://builds.apache.org/job/HBase-1.2-IT/it.test=IntegrationTestBigLinkedList,jdk=latest1.7,label=yahoo-not-h2/ws/hbase-server/src/main/java/org/apache/hadoop/hbase/util/FSUtils.java>:[229,81]
SignalHandler is internal proprietary API and may be removed in a future release
[ERROR] <https://builds.apache.org/job/HBase-1.2-IT/it.test=IntegrationTestBigLinkedList,jdk=latest1.7,label=yahoo-not-h2/ws/hbase-server/src/main/java/org/apache/hadoop/hbase/regionserver/HRegionServer.java>:[609,24]
Signal is internal proprietary API and may be removed in a future release
[ERROR] <https://builds.apache.org/job/HBase-1.2-IT/it.test=IntegrationTestBigLinkedList,jdk=latest1.7,label=yahoo-not-h2/ws/hbase-server/src/main/java/org/apache/hadoop/hbase/regionserver/HRegionServer.java>:[609,43]
SignalHandler is internal proprietary API and may be removed in a future release
[ERROR] <https://builds.apache.org/job/HBase-1.2-IT/it.test=IntegrationTestBigLinkedList,jdk=latest1.7,label=yahoo-not-h2/ws/hbase-server/src/main/java/org/apache/hadoop/hbase/regionserver/HRegionServer.java>:[610,27]
Signal is internal proprietary API and may be removed in a future release
[ERROR] <https://builds.apache.org/job/HBase-1.2-IT/it.test=IntegrationTestBigLinkedList,jdk=latest1.7,label=yahoo-not-h2/ws/hbase-server/src/main/java/org/apache/hadoop/hbase/regionserver/HRegionServer.java>:[609,6]
Signal is internal proprietary API and may be removed in a future release
[ERROR] <https://builds.apache.org/job/HBase-1.2-IT/it.test=IntegrationTestBigLinkedList,jdk=latest1.7,label=yahoo-not-h2/ws/hbase-server/src/main/java/org/apache/hadoop/hbase/regionserver/RSDumpServlet.java>:[108,28]
error: method getOnlineRegions in class HRegionServer cannot be applied to given types;
[ERROR] -> [Help 1]
[ERROR] 
[ERROR] To see the full stack trace of the errors, re-run Maven with the -e switch.
[ERROR] Re-run Maven using the -X switch to enable full debug logging.
[ERROR] 
[ERROR] For more information about the errors and possible solutions, please read the following
articles:
[ERROR] [Help 1] http://cwiki.apache.org/confluence/display/MAVEN/MojoFailureException
[ERROR] 
[ERROR] After correcting the problems, you can resume the build with the command
[ERROR]   mvn <goals> -rf :hbase-server
Build step 'Invoke top-level Maven targets' marked build as failure
Performing Post build task...
Match found for :.* : True
Logical operation result is TRUE
Running script  : # Post-build task script. TODO: Check this in and have all builds reference
check-in.
pwd && ls
# NOTE!!!! The below code has been copied and pasted from ./dev-tools/run-test.sh
# Do not change here without syncing there and vice-versa.
ZOMBIE_TESTS_COUNT=`jps -v | grep surefirebooter | grep -e '-Dhbase.test' | wc -l`
if [[ $ZOMBIE_TESTS_COUNT != 0 ]] ; then
 echo "Suspicious java process found - waiting 30s to see if there are just slow to stop"
 sleep 30
 ZOMBIE_TESTS_COUNT=`jps -v | grep surefirebooter | grep -e '-Dhbase.test' | wc -l`
 if [[ $ZOMBIE_TESTS_COUNT != 0 ]] ; then
   echo " {color:red}There appear to be $ZOMBIE_TESTS_COUNT zombie tests{color}, they should
have been killed by surefire but survived"
   jps -v | grep surefirebooter | grep -e '-Dhbase.test'
   jps -v | grep surefirebooter | grep -e '-Dhbase.test' | cut -d ' ' -f 1 | xargs -n 1 jstack
   # Exit with error
   exit 1
 else
   echo "We're ok: there is no zombie test, but some tests took some time to stop"
 fi
else
  echo "We're ok: there is no zombie test"
fi
[yahoo-not-h2] $ /bin/bash -xe /tmp/hudson7201717189209996916.sh
+ pwd
<https://builds.apache.org/job/HBase-1.2-IT/it.test=IntegrationTestBigLinkedList,jdk=latest1.7,label=yahoo-not-h2/ws/>
+ ls
bin
CHANGES.txt
conf
dev-support
hbase-annotations
hbase-assembly
hbase-checkstyle
hbase-client
hbase-common
hbase-examples
hbase-external-blockcache
hbase-hadoop2-compat
hbase-hadoop-compat
hbase-it
hbase-native-client
hbase-prefix-tree
hbase-procedure
hbase-protocol
hbase-resource-bundle
hbase-rest
hbase-server
hbase-shaded
hbase-shell
hbase-testing-util
hbase-thrift
LICENSE.txt
NOTICE.txt
pom.xml
README.txt
src
target
++ jps -v
++ grep surefirebooter
++ wc -l
++ grep -e -Dhbase.test
+ ZOMBIE_TESTS_COUNT=0
+ [[ 0 != 0 ]]
+ echo 'We'\''re ok: there is no zombie test'
We're ok: there is no zombie test
POST BUILD TASK : SUCCESS
END OF POST BUILD TASK : 0
Archiving artifacts

Mime
View raw message