hbase-builds mailing list archives

Site index · List index
Message view « Date » · « Thread »
Top « Date » · « Thread »
From Apache Jenkins Server <jenk...@builds.apache.org>
Subject Build failed in Jenkins: HBase-Trunk_matrix » latest1.7,yahoo-not-h2 #839
Date Mon, 11 Apr 2016 20:38:11 GMT
See <https://builds.apache.org/job/HBase-Trunk_matrix/jdk=latest1.7,label=yahoo-not-h2/839/changes>

Changes:

[tedyu] HBASE-15093 Replication can report incorrect size of log queue for the

[matteo.bertozzi] HBASE-15627 Miss space and closing quote in

------------------------------------------
[...truncated 5640 lines...]
Tests run: 6, Failures: 0, Errors: 0, Skipped: 0, Time elapsed: 22.313 sec - in org.apache.hadoop.hbase.mob.compactions.TestPartitionedMobCompactor
Tests run: 26, Failures: 0, Errors: 0, Skipped: 0, Time elapsed: 161.039 sec - in org.apache.hadoop.hbase.client.TestAdmin2
Running org.apache.hadoop.hbase.mob.mapreduce.TestMobSweepReducer
Running org.apache.hadoop.hbase.mob.mapreduce.TestMobSweepJob
Tests run: 3, Failures: 0, Errors: 0, Skipped: 0, Time elapsed: 5.234 sec - in org.apache.hadoop.hbase.mob.mapreduce.TestMobSweepJob
Tests run: 1, Failures: 0, Errors: 0, Skipped: 0, Time elapsed: 9.911 sec - in org.apache.hadoop.hbase.mob.mapreduce.TestMobSweepReducer
Running org.apache.hadoop.hbase.mob.TestExpiredMobFileCleaner
Tests run: 5, Failures: 0, Errors: 0, Skipped: 0, Time elapsed: 94.369 sec - in org.apache.hadoop.hbase.mob.compactions.TestMobCompactor
Running org.apache.hadoop.hbase.mob.TestDefaultMobStoreFlusher
Tests run: 1, Failures: 0, Errors: 0, Skipped: 0, Time elapsed: 44.203 sec - in org.apache.hadoop.hbase.mob.TestExpiredMobFileCleaner
Tests run: 2, Failures: 0, Errors: 0, Skipped: 0, Time elapsed: 9.355 sec - in org.apache.hadoop.hbase.mob.TestDefaultMobStoreFlusher
Running org.apache.hadoop.hbase.master.TestWarmupRegion
Running org.apache.hadoop.hbase.master.procedure.TestDisableTableProcedure
Running org.apache.hadoop.hbase.master.procedure.TestAddColumnFamilyProcedure
Tests run: 5, Failures: 0, Errors: 0, Skipped: 0, Time elapsed: 232.321 sec - in org.apache.hadoop.hbase.client.TestRestoreSnapshotFromClient
Tests run: 4, Failures: 0, Errors: 0, Skipped: 0, Time elapsed: 16.851 sec - in org.apache.hadoop.hbase.master.procedure.TestDisableTableProcedure
Tests run: 75, Failures: 0, Errors: 0, Skipped: 4, Time elapsed: 311.967 sec - in org.apache.hadoop.hbase.client.TestFromClientSideWithCoprocessor
Running org.apache.hadoop.hbase.master.procedure.TestServerCrashProcedure
Tests run: 6, Failures: 0, Errors: 0, Skipped: 0, Time elapsed: 28.65 sec - in org.apache.hadoop.hbase.master.procedure.TestAddColumnFamilyProcedure
Tests run: 1, Failures: 0, Errors: 0, Skipped: 0, Time elapsed: 71.663 sec - in org.apache.hadoop.hbase.master.TestWarmupRegion
Running org.apache.hadoop.hbase.master.procedure.TestCreateNamespaceProcedure
Running org.apache.hadoop.hbase.master.procedure.TestDeleteTableProcedure
Running org.apache.hadoop.hbase.master.procedure.TestProcedureAdmin
Tests run: 8, Failures: 0, Errors: 0, Skipped: 0, Time elapsed: 14.489 sec - in org.apache.hadoop.hbase.master.procedure.TestCreateNamespaceProcedure
Tests run: 7, Failures: 0, Errors: 0, Skipped: 0, Time elapsed: 18.851 sec - in org.apache.hadoop.hbase.master.procedure.TestDeleteTableProcedure
Running org.apache.hadoop.hbase.master.procedure.TestDeleteNamespaceProcedure
Tests run: 5, Failures: 0, Errors: 0, Skipped: 0, Time elapsed: 16.017 sec - in org.apache.hadoop.hbase.master.procedure.TestProcedureAdmin
Tests run: 7, Failures: 0, Errors: 0, Skipped: 0, Time elapsed: 17.595 sec - in org.apache.hadoop.hbase.master.procedure.TestDeleteNamespaceProcedure
Tests run: 1, Failures: 0, Errors: 0, Skipped: 0, Time elapsed: 74.453 sec - in org.apache.hadoop.hbase.master.procedure.TestServerCrashProcedure
Running org.apache.hadoop.hbase.master.procedure.TestDeleteColumnFamilyProcedure
Running org.apache.hadoop.hbase.master.procedure.TestCloneSnapshotProcedure
Running org.apache.hadoop.hbase.master.procedure.TestModifyNamespaceProcedure
Tests run: 6, Failures: 0, Errors: 0, Skipped: 0, Time elapsed: 10.003 sec - in org.apache.hadoop.hbase.master.procedure.TestModifyNamespaceProcedure
Running org.apache.hadoop.hbase.master.procedure.TestEnableTableProcedure
Running org.apache.hadoop.hbase.master.procedure.TestModifyTableProcedure
Tests run: 8, Failures: 0, Errors: 0, Skipped: 0, Time elapsed: 33.011 sec - in org.apache.hadoop.hbase.master.procedure.TestDeleteColumnFamilyProcedure
Tests run: 5, Failures: 0, Errors: 0, Skipped: 0, Time elapsed: 32.892 sec - in org.apache.hadoop.hbase.master.procedure.TestCloneSnapshotProcedure
Running org.apache.hadoop.hbase.master.procedure.TestMasterProcedureEvents
Tests run: 5, Failures: 0, Errors: 0, Skipped: 0, Time elapsed: 23.839 sec - in org.apache.hadoop.hbase.master.procedure.TestEnableTableProcedure
Running org.apache.hadoop.hbase.master.procedure.TestModifyColumnFamilyProcedure
Running org.apache.hadoop.hbase.master.procedure.TestCreateTableProcedure
Tests run: 2, Failures: 0, Errors: 0, Skipped: 0, Time elapsed: 16.212 sec - in org.apache.hadoop.hbase.master.procedure.TestMasterProcedureEvents
Running org.apache.hadoop.hbase.master.procedure.TestMasterFailoverWithProcedures
Running org.apache.hadoop.hbase.master.procedure.TestRestoreSnapshotProcedure
Tests run: 8, Failures: 0, Errors: 0, Skipped: 0, Time elapsed: 42.685 sec - in org.apache.hadoop.hbase.master.procedure.TestModifyTableProcedure
Running org.apache.hadoop.hbase.master.procedure.TestWALProcedureStoreOnHDFS
Tests run: 5, Failures: 0, Errors: 0, Skipped: 0, Time elapsed: 24.238 sec - in org.apache.hadoop.hbase.master.procedure.TestModifyColumnFamilyProcedure
Running org.apache.hadoop.hbase.master.procedure.TestTruncateTableProcedure
Tests run: 9, Failures: 0, Errors: 0, Skipped: 0, Time elapsed: 39.344 sec - in org.apache.hadoop.hbase.master.procedure.TestCreateTableProcedure
Running org.apache.hadoop.hbase.master.TestMasterFailoverBalancerPersistence
Tests run: 3, Failures: 0, Errors: 0, Skipped: 0, Time elapsed: 44.242 sec - in org.apache.hadoop.hbase.master.procedure.TestWALProcedureStoreOnHDFS
Running org.apache.hadoop.hbase.master.TestMasterFailover
Tests run: 6, Failures: 0, Errors: 0, Skipped: 0, Time elapsed: 35.212 sec - in org.apache.hadoop.hbase.master.procedure.TestTruncateTableProcedure
Tests run: 1, Failures: 0, Errors: 0, Skipped: 0, Time elapsed: 25.606 sec - in org.apache.hadoop.hbase.master.TestMasterFailoverBalancerPersistence
Tests run: 5, Failures: 0, Errors: 0, Skipped: 0, Time elapsed: 83.067 sec - in org.apache.hadoop.hbase.master.procedure.TestRestoreSnapshotProcedure
Running org.apache.hadoop.hbase.master.TestTableStateManager
Running org.apache.hadoop.hbase.master.TestMetaShutdownHandler
Running org.apache.hadoop.hbase.master.TestAssignmentManagerOnCluster
Tests run: 1, Failures: 0, Errors: 0, Skipped: 0, Time elapsed: 29.545 sec - in org.apache.hadoop.hbase.master.TestTableStateManager
Tests run: 3, Failures: 0, Errors: 0, Skipped: 0, Time elapsed: 69.048 sec - in org.apache.hadoop.hbase.master.TestMasterFailover
Running org.apache.hadoop.hbase.master.TestMasterShutdown
Tests run: 1, Failures: 0, Errors: 0, Skipped: 0, Time elapsed: 33.427 sec - in org.apache.hadoop.hbase.master.TestMetaShutdownHandler
Tests run: 8, Failures: 0, Errors: 0, Skipped: 0, Time elapsed: 136.455 sec - in org.apache.hadoop.hbase.master.procedure.TestMasterFailoverWithProcedures
Running org.apache.hadoop.hbase.master.TestMasterNoCluster
Running org.apache.hadoop.hbase.master.balancer.TestStochasticLoadBalancer
Running org.apache.hadoop.hbase.master.TestMasterFileSystem
Tests run: 2, Failures: 0, Errors: 0, Skipped: 0, Time elapsed: 1.896 sec - in org.apache.hadoop.hbase.master.TestMasterFileSystem
Running org.apache.hadoop.hbase.master.balancer.TestDefaultLoadBalancer
Tests run: 3, Failures: 0, Errors: 0, Skipped: 0, Time elapsed: 20.84 sec - in org.apache.hadoop.hbase.master.TestMasterNoCluster
Tests run: 2, Failures: 0, Errors: 0, Skipped: 0, Time elapsed: 35.3 sec - in org.apache.hadoop.hbase.master.TestMasterShutdown
Tests run: 1, Failures: 0, Errors: 0, Skipped: 0, Time elapsed: 4.357 sec - in org.apache.hadoop.hbase.master.balancer.TestDefaultLoadBalancer
Running org.apache.hadoop.hbase.master.balancer.TestStochasticLoadBalancer2
Running org.apache.hadoop.hbase.master.balancer.TestBaseLoadBalancer
Tests run: 6, Failures: 0, Errors: 0, Skipped: 0, Time elapsed: 0.913 sec - in org.apache.hadoop.hbase.master.balancer.TestBaseLoadBalancer
Running org.apache.hadoop.hbase.master.TestActiveMasterManager
Tests run: 2, Failures: 0, Errors: 0, Skipped: 0, Time elapsed: 2.207 sec - in org.apache.hadoop.hbase.master.TestActiveMasterManager
Running org.apache.hadoop.hbase.master.TestRestartCluster
Running org.apache.hadoop.hbase.master.TestRegionPlacement2
Tests run: 2, Failures: 0, Errors: 0, Skipped: 0, Time elapsed: 3.145 sec - in org.apache.hadoop.hbase.master.TestRegionPlacement2
Running org.apache.hadoop.hbase.master.TestMasterTransitions
Tests run: 3, Failures: 0, Errors: 0, Skipped: 3, Time elapsed: 0.002 sec - in org.apache.hadoop.hbase.master.TestMasterTransitions
Running org.apache.hadoop.hbase.master.TestTableLockManager
Tests run: 22, Failures: 0, Errors: 0, Skipped: 0, Time elapsed: 124.027 sec - in org.apache.hadoop.hbase.master.TestAssignmentManagerOnCluster
Tests run: 2, Failures: 0, Errors: 0, Skipped: 0, Time elapsed: 69.788 sec - in org.apache.hadoop.hbase.master.TestRestartCluster
Running org.apache.hadoop.hbase.master.handler.TestTableDescriptorModification
Running org.apache.hadoop.hbase.master.handler.TestTableDeleteFamilyHandler
Tests run: 7, Failures: 0, Errors: 0, Skipped: 0, Time elapsed: 42.164 sec - in org.apache.hadoop.hbase.master.handler.TestTableDescriptorModification
Running org.apache.hadoop.hbase.master.handler.TestEnableTableHandler
Tests run: 2, Failures: 0, Errors: 0, Skipped: 0, Time elapsed: 41.715 sec - in org.apache.hadoop.hbase.master.handler.TestTableDeleteFamilyHandler
Running org.apache.hadoop.hbase.master.TestGetLastFlushedSequenceId
Tests run: 4, Failures: 0, Errors: 0, Skipped: 0, Time elapsed: 160.873 sec - in org.apache.hadoop.hbase.master.TestTableLockManager
Running org.apache.hadoop.hbase.master.TestRollingRestart
Tests run: 1, Failures: 0, Errors: 0, Skipped: 0, Time elapsed: 39.213 sec - in org.apache.hadoop.hbase.master.TestGetLastFlushedSequenceId
Tests run: 2, Failures: 0, Errors: 0, Skipped: 0, Time elapsed: 61.126 sec - in org.apache.hadoop.hbase.master.handler.TestEnableTableHandler
Running org.apache.hadoop.hbase.master.TestHMasterRPCException
Running org.apache.hadoop.hbase.master.TestSplitLogManager
Tests run: 1, Failures: 0, Errors: 0, Skipped: 0, Time elapsed: 11.947 sec - in org.apache.hadoop.hbase.master.TestHMasterRPCException
Tests run: 1, Failures: 0, Errors: 0, Skipped: 0, Time elapsed: 64.966 sec - in org.apache.hadoop.hbase.master.TestRollingRestart
Running org.apache.hadoop.hbase.master.TestMaster
Running org.apache.hadoop.hbase.master.TestClusterStatusPublisher
Tests run: 3, Failures: 0, Errors: 0, Skipped: 0, Time elapsed: 0.81 sec - in org.apache.hadoop.hbase.master.TestClusterStatusPublisher
Running org.apache.hadoop.hbase.master.TestGetInfoPort
Tests run: 4, Failures: 0, Errors: 0, Skipped: 0, Time elapsed: 28.763 sec - in org.apache.hadoop.hbase.master.TestMaster
Tests run: 1, Failures: 0, Errors: 0, Skipped: 0, Time elapsed: 30.462 sec - in org.apache.hadoop.hbase.master.TestGetInfoPort
Running org.apache.hadoop.hbase.master.TestDeadServer
Tests run: 4, Failures: 0, Errors: 0, Skipped: 0, Time elapsed: 3.425 sec - in org.apache.hadoop.hbase.master.TestDeadServer
Running org.apache.hadoop.hbase.master.TestMasterStatusServlet
Tests run: 20, Failures: 0, Errors: 0, Skipped: 1, Time elapsed: 349.015 sec - in org.apache.hadoop.hbase.master.balancer.TestStochasticLoadBalancer
Running org.apache.hadoop.hbase.master.normalizer.TestSimpleRegionNormalizerOnCluster
Tests run: 4, Failures: 0, Errors: 0, Skipped: 0, Time elapsed: 5.908 sec - in org.apache.hadoop.hbase.master.TestMasterStatusServlet
Running org.apache.hadoop.hbase.master.cleaner.TestHFileLinkCleaner
Tests run: 1, Failures: 0, Errors: 0, Skipped: 0, Time elapsed: 13.403 sec - in org.apache.hadoop.hbase.master.cleaner.TestHFileLinkCleaner
Running org.apache.hadoop.hbase.master.cleaner.TestSnapshotFromMaster
Running org.apache.hadoop.hbase.master.cleaner.TestHFileCleaner
Tests run: 15, Failures: 0, Errors: 0, Skipped: 1, Time elapsed: 152.092 sec - in org.apache.hadoop.hbase.master.TestSplitLogManager
Tests run: 3, Failures: 0, Errors: 0, Skipped: 0, Time elapsed: 2.928 sec - in org.apache.hadoop.hbase.master.cleaner.TestHFileCleaner
Running org.apache.hadoop.hbase.master.cleaner.TestLogsCleaner
Tests run: 2, Failures: 0, Errors: 0, Skipped: 0, Time elapsed: 49.569 sec - in org.apache.hadoop.hbase.master.normalizer.TestSimpleRegionNormalizerOnCluster
Tests run: 3, Failures: 0, Errors: 0, Skipped: 0, Time elapsed: 15.656 sec - in org.apache.hadoop.hbase.master.cleaner.TestLogsCleaner
Running org.apache.hadoop.hbase.master.TestDistributedLogSplitting
Running org.apache.hadoop.hbase.master.TestMasterMetrics
Tests run: 3, Failures: 0, Errors: 0, Skipped: 0, Time elapsed: 2.392 sec - in org.apache.hadoop.hbase.master.TestMasterMetrics
Running org.apache.hadoop.hbase.master.TestMasterRestartAfterDisablingTable
Tests run: 4, Failures: 0, Errors: 0, Skipped: 0, Time elapsed: 64.198 sec - in org.apache.hadoop.hbase.master.cleaner.TestSnapshotFromMaster
Running org.apache.hadoop.hbase.master.TestMasterOperationsForRegionReplicas
Running org.apache.hadoop.hbase.master.TestRegionPlacement
Tests run: 2, Failures: 0, Errors: 0, Skipped: 2, Time elapsed: 0.028 sec - in org.apache.hadoop.hbase.master.TestRegionPlacement
Tests run: 1, Failures: 0, Errors: 0, Skipped: 0, Time elapsed: 49.471 sec - in org.apache.hadoop.hbase.master.TestMasterRestartAfterDisablingTable
Running org.apache.hadoop.hbase.master.TestAssignmentListener
Tests run: 2, Failures: 0, Errors: 0, Skipped: 0, Time elapsed: 46.953 sec - in org.apache.hadoop.hbase.master.TestMasterOperationsForRegionReplicas
Tests run: 18, Failures: 0, Errors: 0, Skipped: 15, Time elapsed: 78.861 sec - in org.apache.hadoop.hbase.master.TestDistributedLogSplitting
Tests run: 2, Failures: 0, Errors: 0, Skipped: 0, Time elapsed: 17.95 sec - in org.apache.hadoop.hbase.master.TestAssignmentListener
Running org.apache.hadoop.hbase.snapshot.TestSnapshotClientRetries
Running org.apache.hadoop.hbase.master.TestMasterMetricsWrapper
Running org.apache.hadoop.hbase.master.snapshot.TestSnapshotFileCache
Tests run: 1, Failures: 0, Errors: 0, Skipped: 0, Time elapsed: 5.044 sec - in org.apache.hadoop.hbase.master.TestMasterMetricsWrapper
Running org.apache.hadoop.hbase.snapshot.TestFlushSnapshotFromClient
Tests run: 2, Failures: 0, Errors: 0, Skipped: 0, Time elapsed: 47.433 sec - in org.apache.hadoop.hbase.snapshot.TestSnapshotClientRetries
Tests run: 4, Failures: 1, Errors: 0, Skipped: 0, Time elapsed: 549.832 sec <<< FAILURE!
- in org.apache.hadoop.hbase.master.balancer.TestStochasticLoadBalancer2
testRegionReplicasOnMidClusterHighReplication(org.apache.hadoop.hbase.master.balancer.TestStochasticLoadBalancer2)
 Time elapsed: 122.514 sec  <<< FAILURE!
java.lang.AssertionError: Two or more region replicas are hosted on the same host after balance
	at org.junit.Assert.fail(Assert.java:88)
	at org.apache.hadoop.hbase.master.balancer.BalancerTestBase.assertRegionReplicaPlacement(BalancerTestBase.java:225)
	at org.apache.hadoop.hbase.master.balancer.BalancerTestBase.testWithCluster(BalancerTestBase.java:450)
	at org.apache.hadoop.hbase.master.balancer.BalancerTestBase.testWithCluster(BalancerTestBase.java:422)
	at org.apache.hadoop.hbase.master.balancer.TestStochasticLoadBalancer2.testRegionReplicasOnMidClusterHighReplication(TestStochasticLoadBalancer2.java:73)

Running org.apache.hadoop.hbase.snapshot.TestExportSnapshot
Running org.apache.hadoop.hbase.snapshot.TestSnapshotDescriptionUtils
Tests run: 2, Failures: 0, Errors: 0, Skipped: 0, Time elapsed: 0.295 sec - in org.apache.hadoop.hbase.snapshot.TestSnapshotDescriptionUtils
Running org.apache.hadoop.hbase.snapshot.TestMobFlushSnapshotFromClient
Tests run: 4, Failures: 0, Errors: 0, Skipped: 0, Time elapsed: 75.215 sec - in org.apache.hadoop.hbase.master.snapshot.TestSnapshotFileCache
Running org.apache.hadoop.hbase.snapshot.TestMobSecureExportSnapshot
Running org.apache.hadoop.hbase.snapshot.TestMobRestoreFlushSnapshotFromClient
Tests run: 9, Failures: 0, Errors: 0, Skipped: 0, Time elapsed: 107.264 sec - in org.apache.hadoop.hbase.snapshot.TestMobFlushSnapshotFromClient
Running org.apache.hadoop.hbase.snapshot.TestMobExportSnapshot
Tests run: 5, Failures: 0, Errors: 0, Skipped: 0, Time elapsed: 157.029 sec - in org.apache.hadoop.hbase.snapshot.TestMobRestoreFlushSnapshotFromClient
Running org.apache.hadoop.hbase.snapshot.TestRestoreFlushSnapshotFromClient
Tests run: 5, Failures: 0, Errors: 0, Skipped: 0, Time elapsed: 84.916 sec - in org.apache.hadoop.hbase.snapshot.TestRestoreFlushSnapshotFromClient
Running org.apache.hadoop.hbase.snapshot.TestSecureExportSnapshot
Tests run: 9, Failures: 0, Errors: 0, Skipped: 0, Time elapsed: 482.169 sec - in org.apache.hadoop.hbase.snapshot.TestExportSnapshot
Tests run: 9, Failures: 0, Errors: 0, Skipped: 0, Time elapsed: 503.624 sec - in org.apache.hadoop.hbase.snapshot.TestMobSecureExportSnapshot
Tests run: 9, Failures: 0, Errors: 0, Skipped: 0, Time elapsed: 464.615 sec - in org.apache.hadoop.hbase.snapshot.TestMobExportSnapshot
Tests run: 9, Failures: 0, Errors: 0, Skipped: 0, Time elapsed: 406.823 sec - in org.apache.hadoop.hbase.snapshot.TestSecureExportSnapshot

Results :

Failed tests: 
  TestBlockEvictionFromClient.testReverseScanWithCompaction:857->testScanWithCompactionInternals:922
expected:<3> but was:<1>
  TestScannerFromBucketCache.testBasicScanWithOnheapBucketCache:269 null
  TestStochasticLoadBalancer2.testRegionReplicasOnMidClusterHighReplication:73->BalancerTestBase.testWithCluster:422->BalancerTestBase.testWithCluster:450->BalancerTestBase.assertRegionReplicaPlacement:225
Two or more region replicas are hosted on the same host after balance
Tests in error: 
  TestMetaCache.testPreserveMetaCacheOnException:125 » IllegalArgument Row lengt...
  TestMasterObserver.testStarted:1407 NullPointer
  TestMasterObserver.testTableNamesEnumeration:1894 NullPointer
  TestMasterObserver.testTableOperations:1460->Object.wait:-2 » TestTimedOut tes...

Tests run: 2748, Failures: 3, Errors: 4, Skipped: 65

[INFO] ------------------------------------------------------------------------
[INFO] Reactor Summary:
[INFO] 
[INFO] Apache HBase ...................................... SUCCESS [  4.392 s]
[INFO] Apache HBase - Checkstyle ......................... SUCCESS [  0.995 s]
[INFO] Apache HBase - Resource Bundle .................... SUCCESS [  0.324 s]
[INFO] Apache HBase - Annotations ........................ SUCCESS [  0.305 s]
[INFO] Apache HBase - Protocol ........................... SUCCESS [  3.933 s]
[INFO] Apache HBase - Common ............................. SUCCESS [01:56 min]
[INFO] Apache HBase - Procedure .......................... SUCCESS [02:50 min]
[INFO] Apache HBase - Client ............................. SUCCESS [ 53.605 s]
[INFO] Apache HBase - Hadoop Compatibility ............... SUCCESS [  8.740 s]
[INFO] Apache HBase - Hadoop Two Compatibility ........... SUCCESS [ 11.885 s]
[INFO] Apache HBase - Prefix Tree ........................ SUCCESS [ 15.255 s]
[INFO] Apache HBase - Server ............................. FAILURE [  02:17 h]
[INFO] Apache HBase - Testing Util ....................... SKIPPED
[INFO] Apache HBase - Thrift ............................. SKIPPED
[INFO] Apache HBase - RSGroup ............................ SKIPPED
[INFO] Apache HBase - Shell .............................. SKIPPED
[INFO] Apache HBase - Integration Tests .................. SKIPPED
[INFO] Apache HBase - Examples ........................... SKIPPED
[INFO] Apache HBase - Rest ............................... SKIPPED
[INFO] Apache HBase - External Block Cache ............... SKIPPED
[INFO] Apache HBase - Spark .............................. SKIPPED
[INFO] Apache HBase - Assembly ........................... SKIPPED
[INFO] Apache HBase - Shaded ............................. SKIPPED
[INFO] Apache HBase - Shaded - Client .................... SKIPPED
[INFO] Apache HBase - Shaded - Server .................... SKIPPED
[INFO] Apache HBase - Archetypes ......................... SKIPPED
[INFO] Apache HBase - Exemplar for hbase-client archetype  SKIPPED
[INFO] Apache HBase - Exemplar for hbase-shaded-client archetype  SKIPPED
[INFO] Apache HBase - Archetype builder .................. SKIPPED
[INFO] ------------------------------------------------------------------------
[INFO] BUILD FAILURE
[INFO] ------------------------------------------------------------------------
[INFO] Total time: 02:23 h
[INFO] Finished at: 2016-04-11T20:33:18+00:00
[INFO] Final Memory: 488M/653M
[INFO] ------------------------------------------------------------------------
[ERROR] Failed to execute goal org.apache.maven.plugins:maven-surefire-plugin:2.18.1:test
(secondPartTestsExecution) on project hbase-server: There was a timeout or other error in
the fork -> [Help 1]
[ERROR] 
[ERROR] To see the full stack trace of the errors, re-run Maven with the -e switch.
[ERROR] Re-run Maven using the -X switch to enable full debug logging.
[ERROR] 
[ERROR] For more information about the errors and possible solutions, please read the following
articles:
[ERROR] [Help 1] http://cwiki.apache.org/confluence/display/MAVEN/MojoFailureException
[ERROR] 
[ERROR] After correcting the problems, you can resume the build with the command
[ERROR]   mvn <goals> -rf :hbase-server
Build step 'Invoke top-level Maven targets' marked build as failure
Performing Post build task...
Match found for :.* : True
Logical operation result is TRUE
Running script  : # Run zombie detector script
./dev-support/zombie-detector.sh --jenkins ${BUILD_ID}
[yahoo-not-h2] $ /bin/bash -xe /tmp/hudson8443828317468823483.sh
+ ./dev-support/zombie-detector.sh --jenkins 839
Mon Apr 11 20:33:20 UTC 2016 Found 1 suspicious java process(es) listed below; waiting 30s
to see if just slow to stop
16372 surefirebooter22919251490432709.jar -enableassertions -Dhbase.build.id=839 -Xmx2800m
-XX:MaxPermSize=256m -Djava.security.egd=file:/dev/./urandom -Djava.net.preferIPv4Stack=true
-Djava.awt.headless=true
tail: cannot open '+2' for reading: No such file or directory
Mon Apr 11 20:33:50 UTC 2016 We're ok: there was a zombie candidate but it went away


    {color:green}+1 zombies{color}. No zombie tests found running at the end of the build
(There were candidates but they seem to have gone away).
POST BUILD TASK : SUCCESS
END OF POST BUILD TASK : 0
Archiving artifacts
Recording test results
[FINDBUGS] Skipping publisher since build result is FAILURE
[CHECKSTYLE] Skipping publisher since build result is FAILURE

Mime
View raw message