hbase-builds mailing list archives

Site index · List index
Message view « Date » · « Thread »
Top « Date » · « Thread »
From Apache Jenkins Server <jenk...@builds.apache.org>
Subject Build failed in Jenkins: HBase-1.2 » latest1.8,yahoo-not-h2 #612
Date Thu, 28 Apr 2016 08:24:48 GMT
See <https://builds.apache.org/job/HBase-1.2/jdk=latest1.8,label=yahoo-not-h2/612/changes>

Changes:

[chenheng] HBASE-15720 Print row locks at the debug dump page

[tedyu] HBASE-15676 FuzzyRowFilter fails and matches all the rows in the table

------------------------------------------
[...truncated 45839 lines...]
25/25 KB   5/5 KB   120/281 KB   20/20 KB   98/246 KB   
25/25 KB   5/5 KB   120/281 KB   20/20 KB   102/246 KB   
25/25 KB   5/5 KB   124/281 KB   20/20 KB   102/246 KB   
25/25 KB   5/5 KB   128/281 KB   20/20 KB   102/246 KB   
25/25 KB   5/5 KB   132/281 KB   20/20 KB   102/246 KB   
25/25 KB   5/5 KB   136/281 KB   20/20 KB   102/246 KB   
25/25 KB   5/5 KB   140/281 KB   20/20 KB   102/246 KB   
25/25 KB   5/5 KB   144/281 KB   20/20 KB   102/246 KB   
25/25 KB   5/5 KB   148/281 KB   20/20 KB   102/246 KB   
25/25 KB   5/5 KB   152/281 KB   20/20 KB   102/246 KB   
25/25 KB   5/5 KB   156/281 KB   20/20 KB   102/246 KB   
25/25 KB   5/5 KB   160/281 KB   20/20 KB   102/246 KB   
25/25 KB   5/5 KB   164/281 KB   20/20 KB   102/246 KB   
25/25 KB   5/5 KB   168/281 KB   20/20 KB   102/246 KB   
25/25 KB   5/5 KB   172/281 KB   20/20 KB   102/246 KB   
25/25 KB   5/5 KB   176/281 KB   20/20 KB   102/246 KB   
25/25 KB   5/5 KB   178/281 KB   20/20 KB   102/246 KB   
25/25 KB   5/5 KB   178/281 KB   20/20 KB   104/246 KB   
25/25 KB   5/5 KB   178/281 KB   20/20 KB   108/246 KB   
25/25 KB   5/5 KB   178/281 KB   20/20 KB   112/246 KB   
25/25 KB   5/5 KB   178/281 KB   20/20 KB   116/246 KB   
25/25 KB   5/5 KB   178/281 KB   20/20 KB   120/246 KB   
25/25 KB   5/5 KB   178/281 KB   20/20 KB   124/246 KB   
25/25 KB   5/5 KB   178/281 KB   20/20 KB   128/246 KB   
25/25 KB   5/5 KB   178/281 KB   20/20 KB   132/246 KB   
25/25 KB   5/5 KB   178/281 KB   20/20 KB   136/246 KB   
25/25 KB   5/5 KB   178/281 KB   20/20 KB   140/246 KB   
25/25 KB   5/5 KB   178/281 KB   20/20 KB   144/246 KB   
                                                         
Downloaded: http://repo.maven.apache.org/maven2/org/codehaus/plexus/plexus-compiler-api/1.8.1/plexus-compiler-api-1.8.1.jar
(20 KB at 158.5 KB/sec)
25/25 KB   5/5 KB   178/281 KB   148/246 KB              
25/25 KB   5/5 KB   178/281 KB   152/246 KB   
25/25 KB   5/5 KB   178/281 KB   156/246 KB   
25/25 KB   5/5 KB   178/281 KB   160/246 KB   
                                              
Downloaded: http://repo.maven.apache.org/maven2/org/jamon/jamon-api/2.3.0/jamon-api-2.3.0.jar
(5 KB at 35.9 KB/sec)
25/25 KB   178/281 KB   164/246 KB            
25/25 KB   178/281 KB   168/246 KB   
25/25 KB   178/281 KB   172/246 KB   
25/25 KB   178/281 KB   176/246 KB   
25/25 KB   178/281 KB   180/246 KB   
25/25 KB   178/281 KB   184/246 KB   
25/25 KB   182/281 KB   184/246 KB   
25/25 KB   182/281 KB   188/246 KB   
25/25 KB   186/281 KB   192/246 KB   
25/25 KB   186/281 KB   196/246 KB   
25/25 KB   186/281 KB   200/246 KB   
25/25 KB   186/281 KB   204/246 KB   
25/25 KB   186/281 KB   208/246 KB   
25/25 KB   186/281 KB   212/246 KB   
25/25 KB   186/281 KB   188/246 KB   
25/25 KB   190/281 KB   216/246 KB   
25/25 KB   194/281 KB   216/246 KB   
25/25 KB   198/281 KB   216/246 KB   
25/25 KB   202/281 KB   216/246 KB   
25/25 KB   206/281 KB   216/246 KB   
25/25 KB   210/281 KB   216/246 KB   
25/25 KB   214/281 KB   216/246 KB   
25/25 KB   218/281 KB   216/246 KB   
25/25 KB   222/281 KB   216/246 KB   
25/25 KB   226/281 KB   216/246 KB   
25/25 KB   230/281 KB   216/246 KB   
25/25 KB   234/281 KB   216/246 KB   
25/25 KB   238/281 KB   216/246 KB   
25/25 KB   242/281 KB   216/246 KB   
25/25 KB   246/281 KB   216/246 KB   
25/25 KB   250/281 KB   216/246 KB   
25/25 KB   254/281 KB   216/246 KB   
25/25 KB   258/281 KB   216/246 KB   
25/25 KB   262/281 KB   216/246 KB   
25/25 KB   266/281 KB   216/246 KB   
25/25 KB   270/281 KB   216/246 KB   
25/25 KB   270/281 KB   216/246 KB   
25/25 KB   270/281 KB   220/246 KB   
                                     
Downloaded: http://repo.maven.apache.org/maven2/org/jamon/jamon-runtime/2.4.0/jamon-runtime-2.4.0.jar
(25 KB at 180.1 KB/sec)
25/25 KB   274/281 KB   220/246 KB   
278/281 KB   224/246 KB   
281/281 KB   224/246 KB   
274/281 KB   224/246 KB              
281/281 KB   228/246 KB   
281/281 KB   232/246 KB   
281/281 KB   236/246 KB   
281/281 KB   240/246 KB   
281/281 KB   244/246 KB   
281/281 KB   246/246 KB   
                          
Downloaded: http://repo.maven.apache.org/maven2/org/codehaus/plexus/plexus-utils/1.5.5/plexus-utils-1.5.5.jar
(246 KB at 1312.2 KB/sec)
                          
Downloaded: http://repo.maven.apache.org/maven2/org/jamon/jamon-processor/2.4.1/jamon-processor-2.4.1.jar
(281 KB at 1438.8 KB/sec)
[INFO] Translating 10 templates from <https://builds.apache.org/job/HBase-1.2/jdk=latest1.8,label=yahoo-not-h2/ws/hbase-server/src/main/jamon>
to <https://builds.apache.org/job/HBase-1.2/jdk=latest1.8,label=yahoo-not-h2/ws/hbase-server/target/generated-jamon>
[INFO] 
[INFO] --- maven-antrun-plugin:1.6:run (generate) @ hbase-server ---
[INFO] Executing tasks

main:
    [mkdir] Created dir: <https://builds.apache.org/job/HBase-1.2/jdk=latest1.8,label=yahoo-not-h2/ws/hbase-server/target/hbase-webapps>
     [copy] Copying 20 files to <https://builds.apache.org/job/HBase-1.2/jdk=latest1.8,label=yahoo-not-h2/ws/hbase-server/target/hbase-webapps>
log4j:WARN No appenders could be found for logger (org.mortbay.log).
log4j:WARN Please initialize the log4j system properly.
log4j:WARN See http://logging.apache.org/log4j/1.2/faq.html#noconfig for more info.
    [mkdir] Created dir: <https://builds.apache.org/job/HBase-1.2/jdk=latest1.8,label=yahoo-not-h2/ws/hbase-server/target/hbase-webapps/master/WEB-INF>
    [mkdir] Created dir: <https://builds.apache.org/job/HBase-1.2/jdk=latest1.8,label=yahoo-not-h2/ws/hbase-server/target/hbase-webapps/regionserver/WEB-INF>
[INFO] Executed tasks
[INFO] 
[INFO] --- maven-remote-resources-plugin:1.5:process (default) @ hbase-server ---
[INFO] 
[INFO] --- maven-resources-plugin:2.6:resources (default-resources) @ hbase-server ---
[INFO] Using 'UTF-8' encoding to copy filtered resources.
[INFO] Copying 22 resources
[INFO] Copying 2 resources
[INFO] 
[INFO] --- maven-compiler-plugin:2.5.1:compile (default-compile) @ hbase-server ---
[INFO] Compiling 791 source files to <https://builds.apache.org/job/HBase-1.2/jdk=latest1.8,label=yahoo-not-h2/ws/hbase-server/target/classes>
[INFO] -------------------------------------------------------------
[ERROR] COMPILATION ERROR : 
[INFO] -------------------------------------------------------------
[ERROR] <https://builds.apache.org/job/HBase-1.2/jdk=latest1.8,label=yahoo-not-h2/ws/hbase-server/src/main/java/org/apache/hadoop/hbase/regionserver/HRegionServer.java>:[191,15]
Signal is internal proprietary API and may be removed in a future release
[ERROR] <https://builds.apache.org/job/HBase-1.2/jdk=latest1.8,label=yahoo-not-h2/ws/hbase-server/src/main/java/org/apache/hadoop/hbase/regionserver/HRegionServer.java>:[192,15]
SignalHandler is internal proprietary API and may be removed in a future release
[ERROR] <https://builds.apache.org/job/HBase-1.2/jdk=latest1.8,label=yahoo-not-h2/ws/hbase-server/src/main/java/org/apache/hadoop/hbase/regionserver/HRegionServer.java>:[609,24]
Signal is internal proprietary API and may be removed in a future release
[ERROR] <https://builds.apache.org/job/HBase-1.2/jdk=latest1.8,label=yahoo-not-h2/ws/hbase-server/src/main/java/org/apache/hadoop/hbase/regionserver/HRegionServer.java>:[609,43]
SignalHandler is internal proprietary API and may be removed in a future release
[ERROR] <https://builds.apache.org/job/HBase-1.2/jdk=latest1.8,label=yahoo-not-h2/ws/hbase-server/src/main/java/org/apache/hadoop/hbase/regionserver/HRegionServer.java>:[610,27]
Signal is internal proprietary API and may be removed in a future release
[ERROR] <https://builds.apache.org/job/HBase-1.2/jdk=latest1.8,label=yahoo-not-h2/ws/hbase-server/src/main/java/org/apache/hadoop/hbase/regionserver/HRegionServer.java>:[609,6]
Signal is internal proprietary API and may be removed in a future release
[ERROR] <https://builds.apache.org/job/HBase-1.2/jdk=latest1.8,label=yahoo-not-h2/ws/hbase-server/src/main/java/org/apache/hadoop/hbase/regionserver/RSDumpServlet.java>:[108,28]
error: method getOnlineRegions in class HRegionServer cannot be applied to given types;
[INFO] 7 errors 
[INFO] -------------------------------------------------------------
[INFO] ------------------------------------------------------------------------
[INFO] Reactor Summary:
[INFO] 
[INFO] Apache HBase ...................................... SUCCESS [2:10.421s]
[INFO] Apache HBase - Checkstyle ......................... SUCCESS [12.204s]
[INFO] Apache HBase - Resource Bundle .................... SUCCESS [0.962s]
[INFO] Apache HBase - Annotations ........................ SUCCESS [5.965s]
[INFO] Apache HBase - Protocol ........................... SUCCESS [1:12.390s]
[INFO] Apache HBase - Common ............................. SUCCESS [7:23.223s]
[INFO] Apache HBase - Procedure .......................... SUCCESS [7:19.436s]
[INFO] Apache HBase - Client ............................. SUCCESS [3:49.652s]
[INFO] Apache HBase - Hadoop Compatibility ............... SUCCESS [21.207s]
[INFO] Apache HBase - Hadoop Two Compatibility ........... SUCCESS [34.392s]
[INFO] Apache HBase - Prefix Tree ........................ SUCCESS [42.559s]
[INFO] Apache HBase - Server ............................. FAILURE [2:01.775s]
[INFO] Apache HBase - Testing Util ....................... SKIPPED
[INFO] Apache HBase - Thrift ............................. SKIPPED
[INFO] Apache HBase - Rest ............................... SKIPPED
[INFO] Apache HBase - Shell .............................. SKIPPED
[INFO] Apache HBase - Integration Tests .................. SKIPPED
[INFO] Apache HBase - Examples ........................... SKIPPED
[INFO] Apache HBase - External Block Cache ............... SKIPPED
[INFO] Apache HBase - Assembly ........................... SKIPPED
[INFO] Apache HBase - Shaded ............................. SKIPPED
[INFO] Apache HBase - Shaded - Client .................... SKIPPED
[INFO] Apache HBase - Shaded - Server .................... SKIPPED
[INFO] ------------------------------------------------------------------------
[INFO] BUILD FAILURE
[INFO] ------------------------------------------------------------------------
[INFO] Total time: 26:48.757s
[INFO] Finished at: Thu Apr 28 08:18:50 UTC 2016
[INFO] Final Memory: 101M/1720M
[INFO] ------------------------------------------------------------------------
[ERROR] Failed to execute goal org.apache.maven.plugins:maven-compiler-plugin:2.5.1:compile
(default-compile) on project hbase-server: Compilation failure: Compilation failure:
[ERROR] <https://builds.apache.org/job/HBase-1.2/jdk=latest1.8,label=yahoo-not-h2/ws/hbase-server/src/main/java/org/apache/hadoop/hbase/regionserver/HRegionServer.java>:[191,15]
Signal is internal proprietary API and may be removed in a future release
[ERROR] <https://builds.apache.org/job/HBase-1.2/jdk=latest1.8,label=yahoo-not-h2/ws/hbase-server/src/main/java/org/apache/hadoop/hbase/regionserver/HRegionServer.java>:[192,15]
SignalHandler is internal proprietary API and may be removed in a future release
[ERROR] <https://builds.apache.org/job/HBase-1.2/jdk=latest1.8,label=yahoo-not-h2/ws/hbase-server/src/main/java/org/apache/hadoop/hbase/regionserver/HRegionServer.java>:[609,24]
Signal is internal proprietary API and may be removed in a future release
[ERROR] <https://builds.apache.org/job/HBase-1.2/jdk=latest1.8,label=yahoo-not-h2/ws/hbase-server/src/main/java/org/apache/hadoop/hbase/regionserver/HRegionServer.java>:[609,43]
SignalHandler is internal proprietary API and may be removed in a future release
[ERROR] <https://builds.apache.org/job/HBase-1.2/jdk=latest1.8,label=yahoo-not-h2/ws/hbase-server/src/main/java/org/apache/hadoop/hbase/regionserver/HRegionServer.java>:[610,27]
Signal is internal proprietary API and may be removed in a future release
[ERROR] <https://builds.apache.org/job/HBase-1.2/jdk=latest1.8,label=yahoo-not-h2/ws/hbase-server/src/main/java/org/apache/hadoop/hbase/regionserver/HRegionServer.java>:[609,6]
Signal is internal proprietary API and may be removed in a future release
[ERROR] <https://builds.apache.org/job/HBase-1.2/jdk=latest1.8,label=yahoo-not-h2/ws/hbase-server/src/main/java/org/apache/hadoop/hbase/regionserver/RSDumpServlet.java>:[108,28]
error: method getOnlineRegions in class HRegionServer cannot be applied to given types;
[ERROR] -> [Help 1]
[ERROR] 
[ERROR] To see the full stack trace of the errors, re-run Maven with the -e switch.
[ERROR] Re-run Maven using the -X switch to enable full debug logging.
[ERROR] 
[ERROR] For more information about the errors and possible solutions, please read the following
articles:
[ERROR] [Help 1] http://cwiki.apache.org/confluence/display/MAVEN/MojoFailureException
[ERROR] 
[ERROR] After correcting the problems, you can resume the build with the command
[ERROR]   mvn <goals> -rf :hbase-server
Build step 'Invoke top-level Maven targets' marked build as failure
Performing Post build task...
Match found for :.* : True
Logical operation result is TRUE
Running script  : # Post-build task script. TODO: Check this in and have all builds reference
check-in.
pwd && ls
# NOTE!!!! The below code has been copied and pasted from ./dev-tools/run-test.sh
# Do not change here without syncing there and vice-versa.
ZOMBIE_TESTS_COUNT=`jps -v | grep surefirebooter | grep -e '-Dhbase.test' | wc -l`
if [[ $ZOMBIE_TESTS_COUNT != 0 ]] ; then
 echo "Suspicious java process found - waiting 30s to see if there are just slow to stop"
 sleep 30
 ZOMBIE_TESTS_COUNT=`jps -v | grep surefirebooter | grep -e '-Dhbase.test' | wc -l`
 if [[ $ZOMBIE_TESTS_COUNT != 0 ]] ; then
   echo " {color:red}There appear to be $ZOMBIE_TESTS_COUNT zombie tests{color}, they should
have been killed by surefire but survived"
   jps -v | grep surefirebooter | grep -e '-Dhbase.test'
   jps -v | grep surefirebooter | grep -e '-Dhbase.test' | cut -d ' ' -f 1 | xargs -n 1 jstack
   # Exit with error
   exit 1
 else
   echo "We're ok: there is no zombie test, but some tests took some time to stop"
 fi
else
  echo "We're ok: there is no zombie test"
fi
[yahoo-not-h2] $ /bin/bash -xe /tmp/hudson9217211825272795528.sh
+ pwd
<https://builds.apache.org/job/HBase-1.2/jdk=latest1.8,label=yahoo-not-h2/ws/>
+ ls
bin
CHANGES.txt
conf
dev-support
hbase-annotations
hbase-assembly
hbase-checkstyle
hbase-client
hbase-common
hbase-examples
hbase-external-blockcache
hbase-hadoop2-compat
hbase-hadoop-compat
hbase-it
hbase-native-client
hbase-prefix-tree
hbase-procedure
hbase-protocol
hbase-resource-bundle
hbase-rest
hbase-server
hbase-shaded
hbase-shell
hbase-testing-util
hbase-thrift
LICENSE.txt
NOTICE.txt
pom.xml
README.txt
src
target
++ wc -l
++ grep -e -Dhbase.test
++ grep surefirebooter
++ jps -v
+ ZOMBIE_TESTS_COUNT=0
+ [[ 0 != 0 ]]
+ echo 'We'\''re ok: there is no zombie test'
We're ok: there is no zombie test
POST BUILD TASK : SUCCESS
END OF POST BUILD TASK : 0
Archiving artifacts
Recording test results

Mime
View raw message