hbase-builds mailing list archives

Site index · List index
Message view « Date » · « Thread »
Top « Date » · « Thread »
From Apache Jenkins Server <jenk...@builds.apache.org>
Subject Build failed in Jenkins: HBase-1.2 » latest1.8,yahoo-not-h2 #614
Date Fri, 29 Apr 2016 20:28:00 GMT
See <https://builds.apache.org/job/HBase-1.2/jdk=latest1.8,label=yahoo-not-h2/614/changes>

Changes:

[antonov] HBASE-15551 Make call queue too big exception use servername

------------------------------------------
[...truncated 45876 lines...]
83/246 KB   188/281 KB   25/25 KB   5/5 KB   20/20 KB   
83/246 KB   192/281 KB   25/25 KB   5/5 KB   20/20 KB   
83/246 KB   195/281 KB   25/25 KB   5/5 KB   20/20 KB   
83/246 KB   196/281 KB   25/25 KB   5/5 KB   20/20 KB   
83/246 KB   200/281 KB   25/25 KB   5/5 KB   20/20 KB   
83/246 KB   204/281 KB   25/25 KB   5/5 KB   20/20 KB   
83/246 KB   208/281 KB   25/25 KB   5/5 KB   20/20 KB   
83/246 KB   212/281 KB   25/25 KB   5/5 KB   20/20 KB   
83/246 KB   216/281 KB   25/25 KB   5/5 KB   20/20 KB   
83/246 KB   220/281 KB   25/25 KB   5/5 KB   20/20 KB   
83/246 KB   224/281 KB   25/25 KB   5/5 KB   20/20 KB   
83/246 KB   228/281 KB   25/25 KB   5/5 KB   20/20 KB   
83/246 KB   232/281 KB   25/25 KB   5/5 KB   20/20 KB   
83/246 KB   236/281 KB   25/25 KB   5/5 KB   20/20 KB   
83/246 KB   240/281 KB   25/25 KB   5/5 KB   20/20 KB   
83/246 KB   244/281 KB   25/25 KB   5/5 KB   20/20 KB   
83/246 KB   248/281 KB   25/25 KB   5/5 KB   20/20 KB   
83/246 KB   252/281 KB   25/25 KB   5/5 KB   20/20 KB   
83/246 KB   256/281 KB   25/25 KB   5/5 KB   20/20 KB   
83/246 KB   260/281 KB   25/25 KB   5/5 KB   20/20 KB   
83/246 KB   264/281 KB   25/25 KB   5/5 KB   20/20 KB   
83/246 KB   268/281 KB   25/25 KB   5/5 KB   20/20 KB   
83/246 KB   272/281 KB   25/25 KB   5/5 KB   20/20 KB   
83/246 KB   276/281 KB   25/25 KB   5/5 KB   20/20 KB   
83/246 KB   280/281 KB   25/25 KB   5/5 KB   20/20 KB   
83/246 KB   281/281 KB   25/25 KB   5/5 KB   20/20 KB   
                                                        
Downloaded: http://repo.maven.apache.org/maven2/org/jamon/jamon-runtime/2.4.0/jamon-runtime-2.4.0.jar
(25 KB at 255.9 KB/sec)
                                                        
Downloaded: http://repo.maven.apache.org/maven2/org/jamon/jamon-api/2.3.0/jamon-api-2.3.0.jar
(5 KB at 47.3 KB/sec)
                                                        
Downloaded: http://repo.maven.apache.org/maven2/org/codehaus/plexus/plexus-compiler-api/1.8.1/plexus-compiler-api-1.8.1.jar
(20 KB at 203.1 KB/sec)
85/246 KB   281/281 KB                                  
89/246 KB   281/281 KB   
93/246 KB   281/281 KB   
97/246 KB   281/281 KB   
101/246 KB   281/281 KB   
105/246 KB   281/281 KB   
109/246 KB   281/281 KB   
113/246 KB   281/281 KB   
117/246 KB   281/281 KB   
121/246 KB   281/281 KB   
125/246 KB   281/281 KB   
129/246 KB   281/281 KB   
133/246 KB   281/281 KB   
137/246 KB   281/281 KB   
141/246 KB   281/281 KB   
145/246 KB   281/281 KB   
149/246 KB   281/281 KB   
153/246 KB   281/281 KB   
157/246 KB   281/281 KB   
161/246 KB   281/281 KB   
165/246 KB   281/281 KB   
169/246 KB   281/281 KB   
173/246 KB   281/281 KB   
177/246 KB   281/281 KB   
181/246 KB   281/281 KB   
185/246 KB   281/281 KB   
189/246 KB   281/281 KB   
193/246 KB   281/281 KB   
197/246 KB   281/281 KB   
201/246 KB   281/281 KB   
205/246 KB   281/281 KB   
209/246 KB   281/281 KB   
213/246 KB   281/281 KB   
217/246 KB   281/281 KB   
221/246 KB   281/281 KB   
225/246 KB   281/281 KB   
229/246 KB   281/281 KB   
233/246 KB   281/281 KB   
237/246 KB   281/281 KB   
241/246 KB   281/281 KB   
244/246 KB   281/281 KB   
                          
Downloaded: http://repo.maven.apache.org/maven2/org/jamon/jamon-processor/2.4.1/jamon-processor-2.4.1.jar
(281 KB at 1921.7 KB/sec)
246/246 KB                
             
Downloaded: http://repo.maven.apache.org/maven2/org/codehaus/plexus/plexus-utils/1.5.5/plexus-utils-1.5.5.jar
(246 KB at 1202.9 KB/sec)
[INFO] Translating 10 templates from <https://builds.apache.org/job/HBase-1.2/jdk=latest1.8,label=yahoo-not-h2/ws/hbase-server/src/main/jamon>
to <https://builds.apache.org/job/HBase-1.2/jdk=latest1.8,label=yahoo-not-h2/ws/hbase-server/target/generated-jamon>
[INFO] 
[INFO] --- maven-antrun-plugin:1.6:run (generate) @ hbase-server ---
[INFO] Executing tasks

main:
    [mkdir] Created dir: <https://builds.apache.org/job/HBase-1.2/jdk=latest1.8,label=yahoo-not-h2/ws/hbase-server/target/hbase-webapps>
     [copy] Copying 20 files to <https://builds.apache.org/job/HBase-1.2/jdk=latest1.8,label=yahoo-not-h2/ws/hbase-server/target/hbase-webapps>
log4j:WARN No appenders could be found for logger (org.mortbay.log).
log4j:WARN Please initialize the log4j system properly.
log4j:WARN See http://logging.apache.org/log4j/1.2/faq.html#noconfig for more info.
    [mkdir] Created dir: <https://builds.apache.org/job/HBase-1.2/jdk=latest1.8,label=yahoo-not-h2/ws/hbase-server/target/hbase-webapps/master/WEB-INF>
    [mkdir] Created dir: <https://builds.apache.org/job/HBase-1.2/jdk=latest1.8,label=yahoo-not-h2/ws/hbase-server/target/hbase-webapps/regionserver/WEB-INF>
[INFO] Executed tasks
[INFO] 
[INFO] --- maven-remote-resources-plugin:1.5:process (default) @ hbase-server ---
[INFO] 
[INFO] --- maven-resources-plugin:2.6:resources (default-resources) @ hbase-server ---
[INFO] Using 'UTF-8' encoding to copy filtered resources.
[INFO] Copying 22 resources
[INFO] Copying 2 resources
[INFO] 
[INFO] --- maven-compiler-plugin:2.5.1:compile (default-compile) @ hbase-server ---
[INFO] Compiling 791 source files to <https://builds.apache.org/job/HBase-1.2/jdk=latest1.8,label=yahoo-not-h2/ws/hbase-server/target/classes>
[INFO] -------------------------------------------------------------
[ERROR] COMPILATION ERROR : 
[INFO] -------------------------------------------------------------
[ERROR] <https://builds.apache.org/job/HBase-1.2/jdk=latest1.8,label=yahoo-not-h2/ws/hbase-server/src/main/java/org/apache/hadoop/hbase/regionserver/HRegionServer.java>:[191,15]
Signal is internal proprietary API and may be removed in a future release
[ERROR] <https://builds.apache.org/job/HBase-1.2/jdk=latest1.8,label=yahoo-not-h2/ws/hbase-server/src/main/java/org/apache/hadoop/hbase/regionserver/HRegionServer.java>:[192,15]
SignalHandler is internal proprietary API and may be removed in a future release
[ERROR] <https://builds.apache.org/job/HBase-1.2/jdk=latest1.8,label=yahoo-not-h2/ws/hbase-server/src/main/java/org/apache/hadoop/hbase/regionserver/HRegionServer.java>:[609,24]
Signal is internal proprietary API and may be removed in a future release
[ERROR] <https://builds.apache.org/job/HBase-1.2/jdk=latest1.8,label=yahoo-not-h2/ws/hbase-server/src/main/java/org/apache/hadoop/hbase/regionserver/HRegionServer.java>:[609,43]
SignalHandler is internal proprietary API and may be removed in a future release
[ERROR] <https://builds.apache.org/job/HBase-1.2/jdk=latest1.8,label=yahoo-not-h2/ws/hbase-server/src/main/java/org/apache/hadoop/hbase/regionserver/HRegionServer.java>:[610,27]
Signal is internal proprietary API and may be removed in a future release
[ERROR] <https://builds.apache.org/job/HBase-1.2/jdk=latest1.8,label=yahoo-not-h2/ws/hbase-server/src/main/java/org/apache/hadoop/hbase/regionserver/HRegionServer.java>:[609,6]
Signal is internal proprietary API and may be removed in a future release
[ERROR] <https://builds.apache.org/job/HBase-1.2/jdk=latest1.8,label=yahoo-not-h2/ws/hbase-server/src/main/java/org/apache/hadoop/hbase/regionserver/RSDumpServlet.java>:[108,28]
error: method getOnlineRegions in class HRegionServer cannot be applied to given types;
[INFO] 7 errors 
[INFO] -------------------------------------------------------------
[INFO] ------------------------------------------------------------------------
[INFO] Reactor Summary:
[INFO] 
[INFO] Apache HBase ...................................... SUCCESS [1:54.283s]
[INFO] Apache HBase - Checkstyle ......................... SUCCESS [10.483s]
[INFO] Apache HBase - Resource Bundle .................... SUCCESS [1.102s]
[INFO] Apache HBase - Annotations ........................ SUCCESS [6.333s]
[INFO] Apache HBase - Protocol ........................... SUCCESS [1:23.344s]
[INFO] Apache HBase - Common ............................. SUCCESS [6:47.575s]
[INFO] Apache HBase - Procedure .......................... SUCCESS [7:40.760s]
[INFO] Apache HBase - Client ............................. SUCCESS [3:42.527s]
[INFO] Apache HBase - Hadoop Compatibility ............... SUCCESS [21.784s]
[INFO] Apache HBase - Hadoop Two Compatibility ........... SUCCESS [35.869s]
[INFO] Apache HBase - Prefix Tree ........................ SUCCESS [42.090s]
[INFO] Apache HBase - Server ............................. FAILURE [1:32.815s]
[INFO] Apache HBase - Testing Util ....................... SKIPPED
[INFO] Apache HBase - Thrift ............................. SKIPPED
[INFO] Apache HBase - Rest ............................... SKIPPED
[INFO] Apache HBase - Shell .............................. SKIPPED
[INFO] Apache HBase - Integration Tests .................. SKIPPED
[INFO] Apache HBase - Examples ........................... SKIPPED
[INFO] Apache HBase - External Block Cache ............... SKIPPED
[INFO] Apache HBase - Assembly ........................... SKIPPED
[INFO] Apache HBase - Shaded ............................. SKIPPED
[INFO] Apache HBase - Shaded - Client .................... SKIPPED
[INFO] Apache HBase - Shaded - Server .................... SKIPPED
[INFO] ------------------------------------------------------------------------
[INFO] BUILD FAILURE
[INFO] ------------------------------------------------------------------------
[INFO] Total time: 25:40.956s
[INFO] Finished at: Fri Apr 29 20:26:09 UTC 2016
[INFO] Final Memory: 116M/2768M
[INFO] ------------------------------------------------------------------------
[ERROR] Failed to execute goal org.apache.maven.plugins:maven-compiler-plugin:2.5.1:compile
(default-compile) on project hbase-server: Compilation failure: Compilation failure:
[ERROR] <https://builds.apache.org/job/HBase-1.2/jdk=latest1.8,label=yahoo-not-h2/ws/hbase-server/src/main/java/org/apache/hadoop/hbase/regionserver/HRegionServer.java>:[191,15]
Signal is internal proprietary API and may be removed in a future release
[ERROR] <https://builds.apache.org/job/HBase-1.2/jdk=latest1.8,label=yahoo-not-h2/ws/hbase-server/src/main/java/org/apache/hadoop/hbase/regionserver/HRegionServer.java>:[192,15]
SignalHandler is internal proprietary API and may be removed in a future release
[ERROR] <https://builds.apache.org/job/HBase-1.2/jdk=latest1.8,label=yahoo-not-h2/ws/hbase-server/src/main/java/org/apache/hadoop/hbase/regionserver/HRegionServer.java>:[609,24]
Signal is internal proprietary API and may be removed in a future release
[ERROR] <https://builds.apache.org/job/HBase-1.2/jdk=latest1.8,label=yahoo-not-h2/ws/hbase-server/src/main/java/org/apache/hadoop/hbase/regionserver/HRegionServer.java>:[609,43]
SignalHandler is internal proprietary API and may be removed in a future release
[ERROR] <https://builds.apache.org/job/HBase-1.2/jdk=latest1.8,label=yahoo-not-h2/ws/hbase-server/src/main/java/org/apache/hadoop/hbase/regionserver/HRegionServer.java>:[610,27]
Signal is internal proprietary API and may be removed in a future release
[ERROR] <https://builds.apache.org/job/HBase-1.2/jdk=latest1.8,label=yahoo-not-h2/ws/hbase-server/src/main/java/org/apache/hadoop/hbase/regionserver/HRegionServer.java>:[609,6]
Signal is internal proprietary API and may be removed in a future release
[ERROR] <https://builds.apache.org/job/HBase-1.2/jdk=latest1.8,label=yahoo-not-h2/ws/hbase-server/src/main/java/org/apache/hadoop/hbase/regionserver/RSDumpServlet.java>:[108,28]
error: method getOnlineRegions in class HRegionServer cannot be applied to given types;
[ERROR] -> [Help 1]
[ERROR] 
[ERROR] To see the full stack trace of the errors, re-run Maven with the -e switch.
[ERROR] Re-run Maven using the -X switch to enable full debug logging.
[ERROR] 
[ERROR] For more information about the errors and possible solutions, please read the following
articles:
[ERROR] [Help 1] http://cwiki.apache.org/confluence/display/MAVEN/MojoFailureException
[ERROR] 
[ERROR] After correcting the problems, you can resume the build with the command
[ERROR]   mvn <goals> -rf :hbase-server
Build step 'Invoke top-level Maven targets' marked build as failure
Performing Post build task...
Match found for :.* : True
Logical operation result is TRUE
Running script  : # Post-build task script. TODO: Check this in and have all builds reference
check-in.
pwd && ls
# NOTE!!!! The below code has been copied and pasted from ./dev-tools/run-test.sh
# Do not change here without syncing there and vice-versa.
ZOMBIE_TESTS_COUNT=`jps -v | grep surefirebooter | grep -e '-Dhbase.test' | wc -l`
if [[ $ZOMBIE_TESTS_COUNT != 0 ]] ; then
 echo "Suspicious java process found - waiting 30s to see if there are just slow to stop"
 sleep 30
 ZOMBIE_TESTS_COUNT=`jps -v | grep surefirebooter | grep -e '-Dhbase.test' | wc -l`
 if [[ $ZOMBIE_TESTS_COUNT != 0 ]] ; then
   echo " {color:red}There appear to be $ZOMBIE_TESTS_COUNT zombie tests{color}, they should
have been killed by surefire but survived"
   jps -v | grep surefirebooter | grep -e '-Dhbase.test'
   jps -v | grep surefirebooter | grep -e '-Dhbase.test' | cut -d ' ' -f 1 | xargs -n 1 jstack
   # Exit with error
   exit 1
 else
   echo "We're ok: there is no zombie test, but some tests took some time to stop"
 fi
else
  echo "We're ok: there is no zombie test"
fi
[yahoo-not-h2] $ /bin/bash -xe /tmp/hudson2820229433425460848.sh
+ pwd
<https://builds.apache.org/job/HBase-1.2/jdk=latest1.8,label=yahoo-not-h2/ws/>
+ ls
bin
CHANGES.txt
conf
dev-support
hbase-annotations
hbase-assembly
hbase-checkstyle
hbase-client
hbase-common
hbase-examples
hbase-external-blockcache
hbase-hadoop2-compat
hbase-hadoop-compat
hbase-it
hbase-native-client
hbase-prefix-tree
hbase-procedure
hbase-protocol
hbase-resource-bundle
hbase-rest
hbase-server
hbase-shaded
hbase-shell
hbase-testing-util
hbase-thrift
LICENSE.txt
NOTICE.txt
pom.xml
README.txt
src
target
++ wc -l
++ grep -e -Dhbase.test
++ grep surefirebooter
++ jps -v
+ ZOMBIE_TESTS_COUNT=1
+ [[ 1 != 0 ]]
+ echo 'Suspicious java process found - waiting 30s to see if there are just slow to stop'
Suspicious java process found - waiting 30s to see if there are just slow to stop
+ sleep 30
++ wc -l
++ grep -e -Dhbase.test
++ grep surefirebooter
++ jps -v
+ ZOMBIE_TESTS_COUNT=1
+ [[ 1 != 0 ]]
+ echo ' {color:red}There appear to be 1 zombie tests{color}, they should have been killed
by surefire but survived'
 {color:red}There appear to be 1 zombie tests{color}, they should have been killed by surefire
but survived
+ jps -v
+ grep surefirebooter
+ grep -e -Dhbase.test
POST BUILD TASK : FAILURE
END OF POST BUILD TASK : 0
Archiving artifacts
Recording test results

Mime
View raw message