hbase-builds mailing list archives

Site index · List index
Message view « Date » · « Thread »
Top « Date » · « Thread »
From Apache Jenkins Server <jenk...@builds.apache.org>
Subject Build failed in Jenkins: HBase-1.4 » latest1.8,yahoo-not-h2 #58
Date Tue, 29 Mar 2016 07:48:50 GMT
See <https://builds.apache.org/job/HBase-1.4/jdk=latest1.8,label=yahoo-not-h2/58/changes>

Changes:

[enis] HBASE-15295 MutateTableAccess.multiMutate() does not get high priority

[chenheng] HBASE-15384 Avoid using '/tmp' directory in TestBulkLoad

------------------------------------------
[...truncated 53846 lines...]
Java HotSpot(TM) 64-Bit Server VM warning: ignoring option MaxPermSize=256m; support was removed
in 8.0
Tests run: 12, Failures: 0, Errors: 0, Skipped: 0, Time elapsed: 111.099 sec - in org.apache.hadoop.hbase.client.TestIncrementFromClientSideWithCoprocessor
Java HotSpot(TM) 64-Bit Server VM warning: ignoring option MaxPermSize=256m; support was removed
in 8.0
Running org.apache.hadoop.hbase.client.TestTableSnapshotScanner
Tests run: 9, Failures: 0, Errors: 0, Skipped: 0, Time elapsed: 172.357 sec - in org.apache.hadoop.hbase.client.TestSnapshotFromClientWithRegionReplicas
Java HotSpot(TM) 64-Bit Server VM warning: ignoring option MaxPermSize=256m; support was removed
in 8.0
Running org.apache.hadoop.hbase.client.TestHCM
Tests run: 76, Failures: 0, Errors: 0, Skipped: 4, Time elapsed: 506.944 sec - in org.apache.hadoop.hbase.client.TestFromClientSide
Java HotSpot(TM) 64-Bit Server VM warning: ignoring option MaxPermSize=256m; support was removed
in 8.0
Running org.apache.hadoop.hbase.client.TestHTablePool$TestHTableReusablePool
Tests run: 9, Failures: 0, Errors: 0, Skipped: 0, Time elapsed: 19.975 sec - in org.apache.hadoop.hbase.client.TestHTablePool$TestHTableReusablePool
Java HotSpot(TM) 64-Bit Server VM warning: ignoring option MaxPermSize=256m; support was removed
in 8.0
Running org.apache.hadoop.hbase.client.TestSplitOrMergeStatus
Running org.apache.hadoop.hbase.client.TestHTableUtil
Tests run: 2, Failures: 0, Errors: 0, Skipped: 0, Time elapsed: 15.38 sec - in org.apache.hadoop.hbase.client.TestHTableUtil
Java HotSpot(TM) 64-Bit Server VM warning: ignoring option MaxPermSize=256m; support was removed
in 8.0
Tests run: 3, Failures: 0, Errors: 0, Skipped: 0, Time elapsed: 68.412 sec - in org.apache.hadoop.hbase.client.TestSplitOrMergeStatus
Java HotSpot(TM) 64-Bit Server VM warning: ignoring option MaxPermSize=256m; support was removed
in 8.0
Tests run: 3, Failures: 0, Errors: 0, Skipped: 0, Time elapsed: 253.13 sec - in org.apache.hadoop.hbase.client.TestTableSnapshotScanner
Java HotSpot(TM) 64-Bit Server VM warning: ignoring option MaxPermSize=256m; support was removed
in 8.0
Tests run: 21, Failures: 0, Errors: 0, Skipped: 3, Time elapsed: 260.893 sec - in org.apache.hadoop.hbase.client.TestHCM
Java HotSpot(TM) 64-Bit Server VM warning: ignoring option MaxPermSize=256m; support was removed
in 8.0
Running org.apache.hadoop.hbase.client.TestHTableMultiplexerFlushCache
Running org.apache.hadoop.hbase.client.TestIncrementsFromClientSide
Running org.apache.hadoop.hbase.client.TestAdmin1
Tests run: 2, Failures: 0, Errors: 0, Skipped: 0, Time elapsed: 62.127 sec - in org.apache.hadoop.hbase.client.TestHTableMultiplexerFlushCache
Java HotSpot(TM) 64-Bit Server VM warning: ignoring option MaxPermSize=256m; support was removed
in 8.0
Running org.apache.hadoop.hbase.client.TestSnapshotMetadata
Running org.apache.hadoop.hbase.client.TestAdmin2
Tests run: 12, Failures: 0, Errors: 0, Skipped: 0, Time elapsed: 155.239 sec - in org.apache.hadoop.hbase.client.TestIncrementsFromClientSide
Java HotSpot(TM) 64-Bit Server VM warning: ignoring option MaxPermSize=256m; support was removed
in 8.0
Running org.apache.hadoop.hbase.client.TestSizeFailures
Tests run: 4, Failures: 0, Errors: 0, Skipped: 0, Time elapsed: 116.469 sec - in org.apache.hadoop.hbase.client.TestSnapshotMetadata
Java HotSpot(TM) 64-Bit Server VM warning: ignoring option MaxPermSize=256m; support was removed
in 8.0
Running org.apache.hadoop.hbase.client.TestRestoreSnapshotFromClientWithRegionReplicas
Running org.apache.hadoop.hbase.client.TestPutWithDelete
Tests run: 1, Failures: 0, Errors: 0, Skipped: 0, Time elapsed: 10.364 sec - in org.apache.hadoop.hbase.client.TestPutWithDelete
Java HotSpot(TM) 64-Bit Server VM warning: ignoring option MaxPermSize=256m; support was removed
in 8.0
Running org.apache.hadoop.hbase.client.TestCloneSnapshotFromClientWithRegionReplicas
Tests run: 2, Failures: 0, Errors: 0, Skipped: 0, Time elapsed: 320.48 sec - in org.apache.hadoop.hbase.client.TestSizeFailures
Java HotSpot(TM) 64-Bit Server VM warning: ignoring option MaxPermSize=256m; support was removed
in 8.0
Tests run: 27, Failures: 0, Errors: 0, Skipped: 0, Time elapsed: 383.046 sec - in org.apache.hadoop.hbase.client.TestAdmin2
Java HotSpot(TM) 64-Bit Server VM warning: ignoring option MaxPermSize=256m; support was removed
in 8.0
Tests run: 28, Failures: 0, Errors: 0, Skipped: 0, Time elapsed: 533.09 sec - in org.apache.hadoop.hbase.client.TestAdmin1
Java HotSpot(TM) 64-Bit Server VM warning: ignoring option MaxPermSize=256m; support was removed
in 8.0
Java HotSpot(TM) 64-Bit Server VM warning: ignoring option MaxPermSize=256m; support was removed
in 8.0
Running org.apache.hadoop.hbase.client.TestMultiParallel
Running org.apache.hadoop.hbase.client.TestFromClientSide3
Running org.apache.hadoop.hbase.client.TestFromClientSideWithCoprocessor
Tests run: 12, Failures: 0, Errors: 0, Skipped: 1, Time elapsed: 82.627 sec - in org.apache.hadoop.hbase.client.TestMultiParallel
Java HotSpot(TM) 64-Bit Server VM warning: ignoring option MaxPermSize=256m; support was removed
in 8.0
Running org.apache.hadoop.hbase.client.TestHTablePool$TestHTableReusablePool
Tests run: 5, Failures: 0, Errors: 0, Skipped: 0, Time elapsed: 598.668 sec - in org.apache.hadoop.hbase.client.TestRestoreSnapshotFromClientWithRegionReplicas
Java HotSpot(TM) 64-Bit Server VM warning: ignoring option MaxPermSize=256m; support was removed
in 8.0
Tests run: 9, Failures: 0, Errors: 0, Skipped: 0, Time elapsed: 51.648 sec - in org.apache.hadoop.hbase.client.TestHTablePool$TestHTableReusablePool
Running org.apache.hadoop.hbase.client.TestHTablePool$TestHTableThreadLocalPool
Tests run: 9, Failures: 0, Errors: 0, Skipped: 0, Time elapsed: 25.579 sec - in org.apache.hadoop.hbase.client.TestHTablePool$TestHTableThreadLocalPool
Java HotSpot(TM) 64-Bit Server VM warning: ignoring option MaxPermSize=256m; support was removed
in 8.0
Java HotSpot(TM) 64-Bit Server VM warning: ignoring option MaxPermSize=256m; support was removed
in 8.0
Java HotSpot(TM) 64-Bit Server VM warning: ignoring option MaxPermSize=256m; support was removed
in 8.0
Running org.apache.hadoop.hbase.client.TestMultiRespectsLimits
Tests run: 8, Failures: 0, Errors: 0, Skipped: 0, Time elapsed: 338.475 sec - in org.apache.hadoop.hbase.client.TestFromClientSide3
Java HotSpot(TM) 64-Bit Server VM warning: ignoring option MaxPermSize=256m; support was removed
in 8.0
Running org.apache.hadoop.hbase.client.TestReplicaWithCluster
Tests run: 5, Failures: 0, Errors: 0, Skipped: 0, Time elapsed: 642.149 sec - in org.apache.hadoop.hbase.client.TestCloneSnapshotFromClientWithRegionReplicas
Java HotSpot(TM) 64-Bit Server VM warning: ignoring option MaxPermSize=256m; support was removed
in 8.0
Running org.apache.hadoop.hbase.client.TestCloneSnapshotFromClient
Tests run: 2, Failures: 0, Errors: 0, Skipped: 0, Time elapsed: 158.278 sec - in org.apache.hadoop.hbase.client.TestMultiRespectsLimits
Java HotSpot(TM) 64-Bit Server VM warning: ignoring option MaxPermSize=256m; support was removed
in 8.0
Running org.apache.hadoop.hbase.client.TestMetaCache
Tests run: 1, Failures: 0, Errors: 0, Skipped: 0, Time elapsed: 29.055 sec - in org.apache.hadoop.hbase.client.TestMetaCache
Java HotSpot(TM) 64-Bit Server VM warning: ignoring option MaxPermSize=256m; support was removed
in 8.0
Tests run: 4, Failures: 0, Errors: 0, Skipped: 0, Time elapsed: 179.458 sec - in org.apache.hadoop.hbase.client.TestReplicaWithCluster
Java HotSpot(TM) 64-Bit Server VM warning: ignoring option MaxPermSize=256m; support was removed
in 8.0
Running org.apache.hadoop.hbase.client.TestScannerTimeout

Results :

Failed tests: 
org.apache.hadoop.hbase.regionserver.throttle.TestFlushWithThroughputController.testFlushControl(org.apache.hadoop.hbase.regionserver.throttle.TestFlushWithThroughputController)
  Run 1: TestFlushWithThroughputController.testFlushControl:144->testFlushWithThroughputLimit:117
null
  Run 2: TestFlushWithThroughputController.testFlushControl:144->testFlushWithThroughputLimit:117
null
  Run 3: TestFlushWithThroughputController.testFlushControl:144->testFlushWithThroughputLimit:117
null

org.apache.hadoop.hbase.regionserver.throttle.TestFlushWithThroughputController.testFlushControlForStripedStore(org.apache.hadoop.hbase.regionserver.throttle.TestFlushWithThroughputController)
  Run 1: TestFlushWithThroughputController.testFlushControlForStripedStore:218->testFlushControl:144->testFlushWithThroughputLimit:117
null
  Run 2: TestFlushWithThroughputController.testFlushControlForStripedStore:218->testFlushControl:144->testFlushWithThroughputLimit:117
null
  Run 3: TestFlushWithThroughputController.testFlushControlForStripedStore:218->testFlushControl:144->testFlushWithThroughputLimit:117
null

Tests in error: 
  TestHRegionServerBulkLoad.testAtomicBulkLoad:352->runAtomicBulkloadTest:377 » Runtime
  TestRegionReplicaFailover.testLotsOfRegionReplicas:373 » TestTimedOut test tim...
org.apache.hadoop.hbase.security.token.TestGenerateDelegationToken.org.apache.hadoop.hbase.security.token.TestGenerateDelegationToken
  Run 1: TestGenerateDelegationToken.org.apache.hadoop.hbase.security.token.TestGenerateDelegationToken
» Bind
  Run 2: TestGenerateDelegationToken.tearDown:137 NullPointer

Flaked tests: 
org.apache.hadoop.hbase.regionserver.TestPerColumnFamilyFlush.testCompareStoreFileCount(org.apache.hadoop.hbase.regionserver.TestPerColumnFamilyFlush)
  Run 1: TestPerColumnFamilyFlush.testCompareStoreFileCount:601->doPut:559->Object.wait:-2
» TestTimedOut
  Run 2: PASS

org.apache.hadoop.hbase.regionserver.TestPerColumnFamilyFlush.testFlushingWhenLogRolling(org.apache.hadoop.hbase.regionserver.TestPerColumnFamilyFlush)
  Run 1: TestPerColumnFamilyFlush.testFlushingWhenLogRolling:467 » IllegalState A mini-...
  Run 2: PASS

org.apache.hadoop.hbase.regionserver.TestPerColumnFamilyFlush.testLogReplayWithDistributedLogSplit(org.apache.hadoop.hbase.regionserver.TestPerColumnFamilyFlush)
  Run 1: TestPerColumnFamilyFlush.testLogReplayWithDistributedLogSplit:431->doTestLogReplay:342
» IllegalState
  Run 2: PASS

org.apache.hadoop.hbase.regionserver.TestRecoveredEdits.testReplayWorksThoughLotsOfFlushing(org.apache.hadoop.hbase.regionserver.TestRecoveredEdits)
  Run 1: TestRecoveredEdits.testReplayWorksThoughLotsOfFlushing:134->verifyAllEditsMadeItIn:170
» TestTimedOut
  Run 2: PASS

org.apache.hadoop.hbase.regionserver.TestRegionServerHostname.testInvalidRegionServerHostnameAbortsServer(org.apache.hadoop.hbase.regionserver.TestRegionServerHostname)
  Run 1: TestRegionServerHostname.testInvalidRegionServerHostnameAbortsServer:53 » TestTimedOut
  Run 2: TestRegionServerHostname.testInvalidRegionServerHostnameAbortsServer:53 » IllegalState
  Run 3: PASS

org.apache.hadoop.hbase.regionserver.TestRegionServerHostname.testRegionServerHostname(org.apache.hadoop.hbase.regionserver.TestRegionServerHostname)
  Run 1: TestRegionServerHostname.testRegionServerHostname:86 » IllegalState A mini-clu...
  Run 2: PASS


Tests run: 1818, Failures: 2, Errors: 3, Skipped: 29, Flakes: 6

[INFO] ------------------------------------------------------------------------
[INFO] Reactor Summary:
[INFO] 
[INFO] Apache HBase ...................................... SUCCESS [1:09.521s]
[INFO] Apache HBase - Checkstyle ......................... SUCCESS [5.055s]
[INFO] Apache HBase - Resource Bundle .................... SUCCESS [0.445s]
[INFO] Apache HBase - Annotations ........................ SUCCESS [2.475s]
[INFO] Apache HBase - Protocol ........................... SUCCESS [37.526s]
[INFO] Apache HBase - Common ............................. SUCCESS [3:46.457s]
[INFO] Apache HBase - Procedure .......................... SUCCESS [5:05.715s]
[INFO] Apache HBase - Client ............................. SUCCESS [2:26.231s]
[INFO] Apache HBase - Hadoop Compatibility ............... SUCCESS [15.004s]
[INFO] Apache HBase - Hadoop Two Compatibility ........... SUCCESS [24.615s]
[INFO] Apache HBase - Prefix Tree ........................ SUCCESS [24.188s]
[INFO] Apache HBase - Server ............................. FAILURE [3:23:59.233s]
[INFO] Apache HBase - Testing Util ....................... SKIPPED
[INFO] Apache HBase - Thrift ............................. SKIPPED
[INFO] Apache HBase - Rest ............................... SKIPPED
[INFO] Apache HBase - Shell .............................. SKIPPED
[INFO] Apache HBase - Integration Tests .................. SKIPPED
[INFO] Apache HBase - Examples ........................... SKIPPED
[INFO] Apache HBase - External Block Cache ............... SKIPPED
[INFO] Apache HBase - Assembly ........................... SKIPPED
[INFO] Apache HBase - Shaded ............................. SKIPPED
[INFO] Apache HBase - Shaded - Client .................... SKIPPED
[INFO] Apache HBase - Shaded - Server .................... SKIPPED
[INFO] ------------------------------------------------------------------------
[INFO] BUILD FAILURE
[INFO] ------------------------------------------------------------------------
[INFO] Total time: 3:38:41.011s
[INFO] Finished at: Tue Mar 29 07:39:11 UTC 2016
[INFO] Final Memory: 398M/2813M
[INFO] ------------------------------------------------------------------------
[ERROR] Failed to execute goal org.apache.maven.plugins:maven-surefire-plugin:2.18.1:test
(secondPartTestsExecution) on project hbase-server: ExecutionException: java.lang.RuntimeException:
java.lang.RuntimeException: org.apache.maven.surefire.report.ReporterException: When writing
xml report stdout/stderr: /tmp/stderr7126069239460359411deferred (No such file or directory)
-> [Help 1]
[ERROR] 
[ERROR] To see the full stack trace of the errors, re-run Maven with the -e switch.
[ERROR] Re-run Maven using the -X switch to enable full debug logging.
[ERROR] 
[ERROR] For more information about the errors and possible solutions, please read the following
articles:
[ERROR] [Help 1] http://cwiki.apache.org/confluence/display/MAVEN/MojoFailureException
[ERROR] 
[ERROR] After correcting the problems, you can resume the build with the command
[ERROR]   mvn <goals> -rf :hbase-server
Build step 'Invoke top-level Maven targets' marked build as failure
Performing Post build task...
Match found for :.* : True
Logical operation result is TRUE
Running script  : # Post-build task script. TODO: Check this in and have all builds reference
check-in.
pwd && ls
# NOTE!!!! The below code has been copied and pasted from ./dev-tools/run-test.sh
# Do not change here without syncing there and vice-versa.
ZOMBIE_TESTS_COUNT=`jps -v | grep surefirebooter | grep -e '-Dhbase.test' | wc -l`
if [[ $ZOMBIE_TESTS_COUNT != 0 ]] ; then
 echo "Suspicious java process found - waiting 30s to see if there are just slow to stop"
 sleep 30
 ZOMBIE_TESTS_COUNT=`jps -v | grep surefirebooter | grep -e '-Dhbase.test' | wc -l`
 if [[ $ZOMBIE_TESTS_COUNT != 0 ]] ; then
   echo " {color:red}There appear to be $ZOMBIE_TESTS_COUNT zombie tests{color}, they should
have been killed by surefire but survived"
   jps -v | grep surefirebooter | grep -e '-Dhbase.test'
   jps -v | grep surefirebooter | grep -e '-Dhbase.test' | cut -d ' ' -f 1 | xargs -n 1 jstack
   # Exit with error
   exit 1
 else
   echo "We're ok: there is no zombie test, but some tests took some time to stop"
 fi
else
  echo "We're ok: there is no zombie test"
fi
[yahoo-not-h2] $ /bin/bash -xe /tmp/hudson2558189029810025481.sh
+ pwd
<https://builds.apache.org/job/HBase-1.4/jdk=latest1.8,label=yahoo-not-h2/ws/>
+ ls
bin
CHANGES.txt
conf
dev-support
hbase-annotations
hbase-assembly
hbase-checkstyle
hbase-client
hbase-common
hbase-examples
hbase-external-blockcache
hbase-hadoop2-compat
hbase-hadoop-compat
hbase-it
hbase-native-client
hbase-prefix-tree
hbase-procedure
hbase-protocol
hbase-resource-bundle
hbase-rest
hbase-server
hbase-shaded
hbase-shell
hbase-testing-util
hbase-thrift
LICENSE.txt
NOTICE.txt
pom.xml
README.txt
src
target
++ grep -e -Dhbase.test
++ wc -l
++ jps -v
++ grep surefirebooter
+ ZOMBIE_TESTS_COUNT=3
+ [[ 3 != 0 ]]
+ echo 'Suspicious java process found - waiting 30s to see if there are just slow to stop'
Suspicious java process found - waiting 30s to see if there are just slow to stop
+ sleep 30
++ wc -l
++ grep -e -Dhbase.test
++ grep surefirebooter
++ jps -v
+ ZOMBIE_TESTS_COUNT=0
+ [[ 0 != 0 ]]
+ echo 'We'\''re ok: there is no zombie test, but some tests took some time to stop'
We're ok: there is no zombie test, but some tests took some time to stop
POST BUILD TASK : SUCCESS
END OF POST BUILD TASK : 0
Archiving artifacts
Recording test results

Mime
View raw message