hbase-builds mailing list archives

Site index · List index
Message view « Date » · « Thread »
Top « Date » · « Thread »
From Apache Jenkins Server <jenk...@builds.apache.org>
Subject Build failed in Jenkins: HBase-1.4 » latest1.7,yahoo-not-h2 #60
Date Tue, 29 Mar 2016 22:15:56 GMT
See <https://builds.apache.org/job/HBase-1.4/jdk=latest1.7,label=yahoo-not-h2/60/changes>

Changes:

[tedyu] HBASE-15191 CopyTable and VerifyReplication - Option to specify batch

------------------------------------------
[...truncated 46267 lines...]
	at org.apache.hadoop.hbase.master.TestMasterNoCluster.testFailover(TestMasterNoCluster.java:244)

Tests run: 7, Failures: 0, Errors: 0, Skipped: 0, Time elapsed: 102.231 sec - in org.apache.hadoop.hbase.master.TestMasterFailover
Tests run: 1, Failures: 0, Errors: 1, Skipped: 0, Time elapsed: 50.806 sec <<< FAILURE!
- in org.apache.hadoop.hbase.master.TestMasterNoCluster
testFailover(org.apache.hadoop.hbase.master.TestMasterNoCluster)  Time elapsed: 19.997 sec
 <<< ERROR!
org.apache.zookeeper.KeeperException$SessionExpiredException: KeeperErrorCode = Session expired
for /hbase/region-in-transition/1588230740
	at org.apache.zookeeper.KeeperException.create(KeeperException.java:127)
	at org.apache.zookeeper.KeeperException.create(KeeperException.java:51)
	at org.apache.zookeeper.ZooKeeper.getData(ZooKeeper.java:1155)
	at org.apache.hadoop.hbase.zookeeper.RecoverableZooKeeper.getData(RecoverableZooKeeper.java:359)
	at org.apache.hadoop.hbase.zookeeper.ZKUtil.getDataNoWatch(ZKUtil.java:714)
	at org.apache.hadoop.hbase.zookeeper.ZKAssign.transitionNode(ZKAssign.java:814)
	at org.apache.hadoop.hbase.zookeeper.ZKAssign.transitionNode(ZKAssign.java:795)
	at org.apache.hadoop.hbase.zookeeper.ZKAssign.transitionNodeClosed(ZKAssign.java:566)
	at org.apache.hadoop.hbase.master.TestMasterNoCluster.testFailover(TestMasterNoCluster.java:244)

Running org.apache.hadoop.hbase.master.balancer.TestBaseLoadBalancer
Tests run: 7, Failures: 0, Errors: 0, Skipped: 0, Time elapsed: 0.887 sec - in org.apache.hadoop.hbase.master.balancer.TestBaseLoadBalancer
Tests run: 1, Failures: 0, Errors: 1, Skipped: 0, Time elapsed: 71.155 sec <<< FAILURE!
- in org.apache.hadoop.hbase.master.TestMasterNoCluster
testFailover(org.apache.hadoop.hbase.master.TestMasterNoCluster)  Time elapsed: 20.011 sec
 <<< ERROR!
org.apache.zookeeper.KeeperException$SessionExpiredException: KeeperErrorCode = Session expired
for /hbase/region-in-transition/1588230740
	at org.apache.zookeeper.KeeperException.create(KeeperException.java:127)
	at org.apache.zookeeper.KeeperException.create(KeeperException.java:51)
	at org.apache.zookeeper.ZooKeeper.getData(ZooKeeper.java:1155)
	at org.apache.hadoop.hbase.zookeeper.RecoverableZooKeeper.getData(RecoverableZooKeeper.java:359)
	at org.apache.hadoop.hbase.zookeeper.ZKUtil.getDataNoWatch(ZKUtil.java:714)
	at org.apache.hadoop.hbase.zookeeper.ZKAssign.transitionNode(ZKAssign.java:814)
	at org.apache.hadoop.hbase.zookeeper.ZKAssign.transitionNode(ZKAssign.java:795)
	at org.apache.hadoop.hbase.zookeeper.ZKAssign.transitionNodeClosed(ZKAssign.java:566)
	at org.apache.hadoop.hbase.master.TestMasterNoCluster.testFailover(TestMasterNoCluster.java:244)

Running org.apache.hadoop.hbase.master.TestActiveMasterManager
Tests run: 2, Failures: 0, Errors: 0, Skipped: 0, Time elapsed: 1.896 sec - in org.apache.hadoop.hbase.master.TestActiveMasterManager
Running org.apache.hadoop.hbase.master.TestRegionPlacement2
Running org.apache.hadoop.hbase.master.TestRestartCluster
Tests run: 2, Failures: 0, Errors: 0, Skipped: 0, Time elapsed: 2.418 sec - in org.apache.hadoop.hbase.master.TestRegionPlacement2
Running org.apache.hadoop.hbase.master.TestMasterTransitions
Tests run: 3, Failures: 0, Errors: 0, Skipped: 3, Time elapsed: 0.004 sec - in org.apache.hadoop.hbase.master.TestMasterTransitions
Running org.apache.hadoop.hbase.master.TestTableLockManager
Tests run: 21, Failures: 0, Errors: 0, Skipped: 0, Time elapsed: 121.228 sec - in org.apache.hadoop.hbase.master.TestAssignmentManagerOnCluster
Running org.apache.hadoop.hbase.master.handler.TestTableDescriptorModification
Tests run: 3, Failures: 0, Errors: 0, Skipped: 0, Time elapsed: 57.364 sec - in org.apache.hadoop.hbase.master.TestRestartCluster
Tests run: 7, Failures: 0, Errors: 0, Skipped: 0, Time elapsed: 36.865 sec - in org.apache.hadoop.hbase.master.handler.TestTableDescriptorModification
Running org.apache.hadoop.hbase.master.handler.TestEnableTableHandler
Running org.apache.hadoop.hbase.master.handler.TestTableDeleteFamilyHandler
Tests run: 2, Failures: 0, Errors: 0, Skipped: 0, Time elapsed: 19.866 sec - in org.apache.hadoop.hbase.master.handler.TestTableDeleteFamilyHandler
Running org.apache.hadoop.hbase.master.handler.TestCreateTableHandler
Tests run: 4, Failures: 0, Errors: 0, Skipped: 0, Time elapsed: 104.251 sec - in org.apache.hadoop.hbase.master.TestTableLockManager
Running org.apache.hadoop.hbase.master.TestGetLastFlushedSequenceId
Tests run: 3, Failures: 0, Errors: 0, Skipped: 0, Time elapsed: 55.404 sec - in org.apache.hadoop.hbase.master.handler.TestEnableTableHandler
Running org.apache.hadoop.hbase.master.TestRollingRestart
Tests run: 1, Failures: 0, Errors: 0, Skipped: 0, Time elapsed: 22.561 sec - in org.apache.hadoop.hbase.master.TestGetLastFlushedSequenceId
Tests run: 3, Failures: 0, Errors: 0, Skipped: 0, Time elapsed: 35.428 sec - in org.apache.hadoop.hbase.master.handler.TestCreateTableHandler
Running org.apache.hadoop.hbase.master.TestHMasterRPCException
Running org.apache.hadoop.hbase.master.TestSplitLogManager
Tests run: 1, Failures: 0, Errors: 0, Skipped: 0, Time elapsed: 5.307 sec - in org.apache.hadoop.hbase.master.TestHMasterRPCException
Running org.apache.hadoop.hbase.master.TestMaster
Tests run: 1, Failures: 0, Errors: 0, Skipped: 0, Time elapsed: 36.647 sec - in org.apache.hadoop.hbase.master.TestRollingRestart
Running org.apache.hadoop.hbase.master.TestClusterStatusPublisher
Tests run: 3, Failures: 0, Errors: 0, Skipped: 0, Time elapsed: 0.601 sec - in org.apache.hadoop.hbase.master.TestClusterStatusPublisher
Running org.apache.hadoop.hbase.master.TestGetInfoPort
Tests run: 4, Failures: 0, Errors: 0, Skipped: 0, Time elapsed: 16.217 sec - in org.apache.hadoop.hbase.master.TestMaster
Tests run: 1, Failures: 0, Errors: 0, Skipped: 0, Time elapsed: 16.08 sec - in org.apache.hadoop.hbase.master.TestGetInfoPort
Running org.apache.hadoop.hbase.master.TestDeadServer
Tests run: 4, Failures: 0, Errors: 0, Skipped: 0, Time elapsed: 3.097 sec - in org.apache.hadoop.hbase.master.TestDeadServer
Running org.apache.hadoop.hbase.master.normalizer.TestSimpleRegionNormalizerOnCluster
Running org.apache.hadoop.hbase.master.TestZKBasedOpenCloseRegion
Tests run: 3, Failures: 0, Errors: 0, Skipped: 0, Time elapsed: 3.107 sec - in org.apache.hadoop.hbase.master.TestZKBasedOpenCloseRegion
Running org.apache.hadoop.hbase.master.TestMasterStatusServlet
Tests run: 4, Failures: 0, Errors: 0, Skipped: 0, Time elapsed: 3.012 sec - in org.apache.hadoop.hbase.master.TestMasterStatusServlet
Tests run: 2, Failures: 0, Errors: 0, Skipped: 0, Time elapsed: 29.813 sec - in org.apache.hadoop.hbase.master.normalizer.TestSimpleRegionNormalizerOnCluster
Tests run: 20, Failures: 0, Errors: 0, Skipped: 1, Time elapsed: 310.5 sec - in org.apache.hadoop.hbase.master.balancer.TestStochasticLoadBalancer
Running org.apache.hadoop.hbase.master.cleaner.TestHFileCleaner
Running org.apache.hadoop.hbase.master.cleaner.TestSnapshotFromMaster
Tests run: 3, Failures: 0, Errors: 0, Skipped: 0, Time elapsed: 1.352 sec - in org.apache.hadoop.hbase.master.cleaner.TestHFileCleaner
Running org.apache.hadoop.hbase.master.cleaner.TestLogsCleaner
Running org.apache.hadoop.hbase.master.TestMasterMetrics
Tests run: 2, Failures: 0, Errors: 0, Skipped: 0, Time elapsed: 12.697 sec - in org.apache.hadoop.hbase.master.cleaner.TestLogsCleaner
Tests run: 3, Failures: 0, Errors: 0, Skipped: 0, Time elapsed: 1.912 sec - in org.apache.hadoop.hbase.master.TestMasterMetrics
Running org.apache.hadoop.hbase.master.TestDistributedLogSplitting
Running org.apache.hadoop.hbase.master.TestMasterOperationsForRegionReplicas
Tests run: 15, Failures: 0, Errors: 0, Skipped: 1, Time elapsed: 137.477 sec - in org.apache.hadoop.hbase.master.TestSplitLogManager
Tests run: 4, Failures: 0, Errors: 0, Skipped: 0, Time elapsed: 37.29 sec - in org.apache.hadoop.hbase.master.cleaner.TestSnapshotFromMaster
Running org.apache.hadoop.hbase.master.TestMasterRestartAfterDisablingTable
Running org.apache.hadoop.hbase.master.TestRegionPlacement
Tests run: 2, Failures: 0, Errors: 0, Skipped: 2, Time elapsed: 0.001 sec - in org.apache.hadoop.hbase.master.TestRegionPlacement
Running org.apache.hadoop.hbase.master.TestAssignmentListener
Tests run: 1, Failures: 0, Errors: 0, Skipped: 0, Time elapsed: 25.641 sec - in org.apache.hadoop.hbase.master.TestMasterRestartAfterDisablingTable
Tests run: 2, Failures: 0, Errors: 0, Skipped: 0, Time elapsed: 28.961 sec - in org.apache.hadoop.hbase.master.TestMasterOperationsForRegionReplicas
Tests run: 2, Failures: 0, Errors: 0, Skipped: 0, Time elapsed: 11.414 sec - in org.apache.hadoop.hbase.master.TestAssignmentListener
Running org.apache.hadoop.hbase.master.TestMasterPriorityRpc
Tests run: 18, Failures: 0, Errors: 0, Skipped: 15, Time elapsed: 48.446 sec - in org.apache.hadoop.hbase.master.TestDistributedLogSplitting
Tests run: 3, Failures: 0, Errors: 0, Skipped: 0, Time elapsed: 4.391 sec - in org.apache.hadoop.hbase.master.TestMasterPriorityRpc
Running org.apache.hadoop.hbase.master.snapshot.TestSnapshotFileCache
Running org.apache.hadoop.hbase.snapshot.TestSnapshotClientRetries
Running org.apache.hadoop.hbase.master.TestMasterMetricsWrapper
Tests run: 1, Failures: 0, Errors: 0, Skipped: 0, Time elapsed: 3.187 sec - in org.apache.hadoop.hbase.master.TestMasterMetricsWrapper
Running org.apache.hadoop.hbase.snapshot.TestFlushSnapshotFromClient
Tests run: 2, Failures: 0, Errors: 0, Skipped: 0, Time elapsed: 27.456 sec - in org.apache.hadoop.hbase.snapshot.TestSnapshotClientRetries
Running org.apache.hadoop.hbase.snapshot.TestSnapshotDescriptionUtils
Tests run: 2, Failures: 0, Errors: 0, Skipped: 0, Time elapsed: 0.353 sec - in org.apache.hadoop.hbase.snapshot.TestSnapshotDescriptionUtils
Running org.apache.hadoop.hbase.snapshot.TestExportSnapshot
Tests run: 4, Failures: 0, Errors: 0, Skipped: 0, Time elapsed: 47.835 sec - in org.apache.hadoop.hbase.master.snapshot.TestSnapshotFileCache
Running org.apache.hadoop.hbase.snapshot.TestRestoreFlushSnapshotFromClient
Running org.apache.hadoop.hbase.snapshot.TestSecureExportSnapshot
Tests run: 9, Failures: 0, Errors: 0, Skipped: 0, Time elapsed: 96.172 sec - in org.apache.hadoop.hbase.snapshot.TestFlushSnapshotFromClient
Tests run: 5, Failures: 0, Errors: 0, Skipped: 0, Time elapsed: 88.584 sec - in org.apache.hadoop.hbase.snapshot.TestRestoreFlushSnapshotFromClient
Tests run: 4, Failures: 0, Errors: 0, Skipped: 0, Time elapsed: 554.461 sec - in org.apache.hadoop.hbase.master.balancer.TestStochasticLoadBalancer2
Tests run: 9, Failures: 0, Errors: 0, Skipped: 0, Time elapsed: 406.462 sec - in org.apache.hadoop.hbase.snapshot.TestExportSnapshot
Tests run: 9, Failures: 0, Errors: 0, Skipped: 0, Time elapsed: 400.089 sec - in org.apache.hadoop.hbase.snapshot.TestSecureExportSnapshot

Results :

Tests in error: 
org.apache.hadoop.hbase.master.TestMasterNoCluster.testFailover(org.apache.hadoop.hbase.master.TestMasterNoCluster)
  Run 1: TestMasterNoCluster.testFailover:244 » SessionExpired KeeperErrorCode = Sessio...
  Run 2: TestMasterNoCluster.testFailover:244 » SessionExpired KeeperErrorCode = Sessio...
  Run 3: TestMasterNoCluster.testFailover:244 » SessionExpired KeeperErrorCode = Sessio...

Flaked tests: 
org.apache.hadoop.hbase.coprocessor.TestRowProcessorEndpoint.testMultipleRows(org.apache.hadoop.hbase.coprocessor.TestRowProcessorEndpoint)
  Run 1: TestRowProcessorEndpoint.testMultipleRows:246 expected:<3> but was:<2>
  Run 2: PASS

org.apache.hadoop.hbase.regionserver.TestAtomicOperation.testMultiRowMutationMultiThreads(org.apache.hadoop.hbase.regionserver.TestAtomicOperation)
  Run 1: TestAtomicOperation.teardown:107 » DroppedSnapshot Failed clearing memory afte...
  Run 2: PASS


Tests run: 2547, Failures: 0, Errors: 1, Skipped: 63, Flakes: 2

[INFO] ------------------------------------------------------------------------
[INFO] Reactor Summary:
[INFO] 
[INFO] Apache HBase ...................................... SUCCESS [1:09.377s]
[INFO] Apache HBase - Checkstyle ......................... SUCCESS [6.221s]
[INFO] Apache HBase - Resource Bundle .................... SUCCESS [0.265s]
[INFO] Apache HBase - Annotations ........................ SUCCESS [1.231s]
[INFO] Apache HBase - Protocol ........................... SUCCESS [17.960s]
[INFO] Apache HBase - Common ............................. SUCCESS [2:35.694s]
[INFO] Apache HBase - Procedure .......................... SUCCESS [3:38.410s]
[INFO] Apache HBase - Client ............................. SUCCESS [1:31.459s]
[INFO] Apache HBase - Hadoop Compatibility ............... SUCCESS [9.124s]
[INFO] Apache HBase - Hadoop Two Compatibility ........... SUCCESS [11.385s]
[INFO] Apache HBase - Prefix Tree ........................ SUCCESS [12.191s]
[INFO] Apache HBase - Server ............................. FAILURE [1:43:26.825s]
[INFO] Apache HBase - Testing Util ....................... SKIPPED
[INFO] Apache HBase - Thrift ............................. SKIPPED
[INFO] Apache HBase - Rest ............................... SKIPPED
[INFO] Apache HBase - Shell .............................. SKIPPED
[INFO] Apache HBase - Integration Tests .................. SKIPPED
[INFO] Apache HBase - Examples ........................... SKIPPED
[INFO] Apache HBase - External Block Cache ............... SKIPPED
[INFO] Apache HBase - Assembly ........................... SKIPPED
[INFO] Apache HBase - Shaded ............................. SKIPPED
[INFO] Apache HBase - Shaded - Client .................... SKIPPED
[INFO] Apache HBase - Shaded - Server .................... SKIPPED
[INFO] ------------------------------------------------------------------------
[INFO] BUILD FAILURE
[INFO] ------------------------------------------------------------------------
[INFO] Total time: 1:53:39.919s
[INFO] Finished at: Tue Mar 29 22:12:45 UTC 2016
[INFO] Final Memory: 94M/695M
[INFO] ------------------------------------------------------------------------
[ERROR] Failed to execute goal org.apache.maven.plugins:maven-surefire-plugin:2.18.1:test
(secondPartTestsExecution) on project hbase-server: There are test failures.
[ERROR] 
[ERROR] Please refer to <https://builds.apache.org/job/HBase-1.4/jdk=latest1.7,label=yahoo-not-h2/ws/hbase-server/target/surefire-reports>
for the individual test results.
[ERROR] -> [Help 1]
[ERROR] 
[ERROR] To see the full stack trace of the errors, re-run Maven with the -e switch.
[ERROR] Re-run Maven using the -X switch to enable full debug logging.
[ERROR] 
[ERROR] For more information about the errors and possible solutions, please read the following
articles:
[ERROR] [Help 1] http://cwiki.apache.org/confluence/display/MAVEN/MojoFailureException
[ERROR] 
[ERROR] After correcting the problems, you can resume the build with the command
[ERROR]   mvn <goals> -rf :hbase-server
Build step 'Invoke top-level Maven targets' marked build as failure
Performing Post build task...
Match found for :.* : True
Logical operation result is TRUE
Running script  : # Post-build task script. TODO: Check this in and have all builds reference
check-in.
pwd && ls
# NOTE!!!! The below code has been copied and pasted from ./dev-tools/run-test.sh
# Do not change here without syncing there and vice-versa.
ZOMBIE_TESTS_COUNT=`jps -v | grep surefirebooter | grep -e '-Dhbase.test' | wc -l`
if [[ $ZOMBIE_TESTS_COUNT != 0 ]] ; then
 echo "Suspicious java process found - waiting 30s to see if there are just slow to stop"
 sleep 30
 ZOMBIE_TESTS_COUNT=`jps -v | grep surefirebooter | grep -e '-Dhbase.test' | wc -l`
 if [[ $ZOMBIE_TESTS_COUNT != 0 ]] ; then
   echo " {color:red}There appear to be $ZOMBIE_TESTS_COUNT zombie tests{color}, they should
have been killed by surefire but survived"
   jps -v | grep surefirebooter | grep -e '-Dhbase.test'
   jps -v | grep surefirebooter | grep -e '-Dhbase.test' | cut -d ' ' -f 1 | xargs -n 1 jstack
   # Exit with error
   exit 1
 else
   echo "We're ok: there is no zombie test, but some tests took some time to stop"
 fi
else
  echo "We're ok: there is no zombie test"
fi
[yahoo-not-h2] $ /bin/bash -xe /tmp/hudson2919652651149077898.sh
+ pwd
<https://builds.apache.org/job/HBase-1.4/jdk=latest1.7,label=yahoo-not-h2/ws/>
+ ls
bin
CHANGES.txt
conf
dev-support
hbase-annotations
hbase-assembly
hbase-checkstyle
hbase-client
hbase-common
hbase-examples
hbase-external-blockcache
hbase-hadoop2-compat
hbase-hadoop-compat
hbase-it
hbase-native-client
hbase-prefix-tree
hbase-procedure
hbase-protocol
hbase-resource-bundle
hbase-rest
hbase-server
hbase-shaded
hbase-shell
hbase-testing-util
hbase-thrift
LICENSE.txt
NOTICE.txt
pom.xml
README.txt
src
target
++ jps -v
++ grep surefirebooter
++ grep -e -Dhbase.test
++ wc -l
+ ZOMBIE_TESTS_COUNT=0
+ [[ 0 != 0 ]]
+ echo 'We'\''re ok: there is no zombie test'
We're ok: there is no zombie test
POST BUILD TASK : SUCCESS
END OF POST BUILD TASK : 0
Archiving artifacts
Recording test results

Mime
View raw message