hbase-builds mailing list archives

Site index · List index
Message view « Date » · « Thread »
Top « Date » · « Thread »
From Apache Jenkins Server <jenk...@builds.apache.org>
Subject Build failed in Jenkins: HBase-1.4 » latest1.7,yahoo-not-h2 #25
Date Thu, 17 Mar 2016 09:58:57 GMT
See <https://builds.apache.org/job/HBase-1.4/jdk=latest1.7,label=yahoo-not-h2/25/changes>

Changes:

[tedyu] HBASE-12940 Expose listPeerConfigs and getPeerConfig to the HBase shell

------------------------------------------
[...truncated 45751 lines...]
Running org.apache.hadoop.hbase.snapshot.TestSecureExportSnapshot
Running org.apache.hadoop.hbase.snapshot.TestExportSnapshot
Tests run: 5, Failures: 0, Errors: 0, Skipped: 0, Time elapsed: 78.319 sec - in org.apache.hadoop.hbase.snapshot.TestRestoreFlushSnapshotFromClient
Tests run: 9, Failures: 0, Errors: 0, Skipped: 0, Time elapsed: 78.186 sec - in org.apache.hadoop.hbase.snapshot.TestFlushSnapshotFromClient
Running org.apache.hadoop.hbase.security.access.TestTablePermissions
Running org.apache.hadoop.hbase.security.access.TestAccessController
Tests run: 7, Failures: 0, Errors: 0, Skipped: 0, Time elapsed: 19.082 sec - in org.apache.hadoop.hbase.security.access.TestTablePermissions
Running org.apache.hadoop.hbase.security.access.TestAccessController3
Tests run: 1, Failures: 0, Errors: 0, Skipped: 0, Time elapsed: 3.466 sec - in org.apache.hadoop.hbase.security.access.TestAccessController3
Running org.apache.hadoop.hbase.security.access.TestCellACLs
Tests run: 2, Failures: 0, Errors: 0, Skipped: 0, Time elapsed: 12.806 sec - in org.apache.hadoop.hbase.security.access.TestCellACLs
Tests run: 22, Failures: 0, Errors: 0, Skipped: 0, Time elapsed: 215.583 sec - in org.apache.hadoop.hbase.mapreduce.TestLoadIncrementalHFiles
Tests run: 58, Failures: 0, Errors: 0, Skipped: 0, Time elapsed: 75.843 sec - in org.apache.hadoop.hbase.security.access.TestAccessController
Running org.apache.hadoop.hbase.security.access.TestScanEarlyTermination
Tests run: 1, Failures: 0, Errors: 0, Skipped: 0, Time elapsed: 7.106 sec - in org.apache.hadoop.hbase.security.access.TestScanEarlyTermination
Running org.apache.hadoop.hbase.security.access.TestWithDisabledAuthorization
Running org.apache.hadoop.hbase.security.access.TestAccessControlFilter
Tests run: 1, Failures: 0, Errors: 0, Skipped: 0, Time elapsed: 3.986 sec - in org.apache.hadoop.hbase.security.access.TestAccessControlFilter
Running org.apache.hadoop.hbase.security.access.TestNamespaceCommands
Running org.apache.hadoop.hbase.security.access.TestAccessController2
Tests run: 7, Failures: 0, Errors: 0, Skipped: 0, Time elapsed: 10.339 sec - in org.apache.hadoop.hbase.security.access.TestNamespaceCommands
Tests run: 6, Failures: 0, Errors: 0, Skipped: 0, Time elapsed: 36.996 sec - in org.apache.hadoop.hbase.security.access.TestWithDisabledAuthorization
Running org.apache.hadoop.hbase.security.access.TestCellACLWithMultipleVersions
Running org.apache.hadoop.hbase.security.access.TestZKPermissionsWatcher
Tests run: 1, Failures: 0, Errors: 0, Skipped: 0, Time elapsed: 3.475 sec - in org.apache.hadoop.hbase.security.access.TestZKPermissionsWatcher
Tests run: 6, Failures: 0, Errors: 0, Skipped: 0, Time elapsed: 51.11 sec - in org.apache.hadoop.hbase.security.access.TestAccessController2
Running org.apache.hadoop.hbase.security.token.TestZKSecretWatcher
Running org.apache.hadoop.hbase.security.token.TestGenerateDelegationToken
Tests run: 1, Failures: 0, Errors: 0, Skipped: 0, Time elapsed: 1.951 sec - in org.apache.hadoop.hbase.security.token.TestGenerateDelegationToken
Tests run: 8, Failures: 0, Errors: 0, Skipped: 0, Time elapsed: 46.645 sec - in org.apache.hadoop.hbase.security.access.TestCellACLWithMultipleVersions
Running org.apache.hadoop.hbase.security.token.TestTokenAuthentication
Tests run: 3, Failures: 0, Errors: 0, Skipped: 0, Time elapsed: 0.769 sec - in org.apache.hadoop.hbase.security.token.TestTokenAuthentication
Tests run: 1, Failures: 0, Errors: 0, Skipped: 0, Time elapsed: 13.345 sec - in org.apache.hadoop.hbase.security.token.TestZKSecretWatcher
Running org.apache.hadoop.hbase.security.visibility.TestVisibilityLabelsReplication
Running org.apache.hadoop.hbase.security.visibility.TestVisibilityLabelsWithSLGStack
Tests run: 1, Failures: 0, Errors: 0, Skipped: 0, Time elapsed: 3.202 sec - in org.apache.hadoop.hbase.security.visibility.TestVisibilityLabelsWithSLGStack
Running org.apache.hadoop.hbase.security.visibility.TestVisibilityLabelsWithACL
Tests run: 5, Failures: 0, Errors: 0, Skipped: 0, Time elapsed: 9.562 sec - in org.apache.hadoop.hbase.security.visibility.TestVisibilityLabelsWithACL
Running org.apache.hadoop.hbase.security.visibility.TestWithDisabledAuthorization
Tests run: 1, Failures: 0, Errors: 0, Skipped: 0, Time elapsed: 30.779 sec - in org.apache.hadoop.hbase.security.visibility.TestVisibilityLabelsReplication
Tests run: 2, Failures: 0, Errors: 0, Skipped: 0, Time elapsed: 4.288 sec - in org.apache.hadoop.hbase.security.visibility.TestWithDisabledAuthorization
Running org.apache.hadoop.hbase.security.visibility.TestVisibilityLabelsWithCustomVisLabService
Running org.apache.hadoop.hbase.security.visibility.TestDefaultScanLabelGeneratorStack
Running org.apache.hadoop.hbase.security.visibility.TestVisibilityLabelsWithDefaultVisLabelService
Tests run: 1, Failures: 0, Errors: 0, Skipped: 0, Time elapsed: 2.486 sec - in org.apache.hadoop.hbase.security.visibility.TestDefaultScanLabelGeneratorStack
Running org.apache.hadoop.hbase.security.visibility.TestEnforcingScanLabelGenerator
Tests run: 1, Failures: 0, Errors: 0, Skipped: 0, Time elapsed: 2.946 sec - in org.apache.hadoop.hbase.security.visibility.TestEnforcingScanLabelGenerator
Running org.apache.hadoop.hbase.security.visibility.TestVisibilityLablesWithGroups
Tests run: 1, Failures: 0, Errors: 0, Skipped: 0, Time elapsed: 3.525 sec - in org.apache.hadoop.hbase.security.visibility.TestVisibilityLablesWithGroups
Running org.apache.hadoop.hbase.security.visibility.TestVisibilityLabelsWithDeletes
Tests run: 9, Failures: 0, Errors: 0, Skipped: 0, Time elapsed: 390.859 sec - in org.apache.hadoop.hbase.snapshot.TestSecureExportSnapshot
Running org.apache.hadoop.hbase.security.visibility.TestVisibilityLabelsOpWithDifferentUsersNoACL
Tests run: 9, Failures: 0, Errors: 0, Skipped: 0, Time elapsed: 395.198 sec - in org.apache.hadoop.hbase.snapshot.TestExportSnapshot
Tests run: 1, Failures: 0, Errors: 0, Skipped: 0, Time elapsed: 1.558 sec - in org.apache.hadoop.hbase.security.visibility.TestVisibilityLabelsOpWithDifferentUsersNoACL
Running org.apache.hadoop.hbase.security.visibility.TestVisibilityLabelReplicationWithExpAsString
Tests run: 21, Failures: 0, Errors: 0, Skipped: 0, Time elapsed: 107.904 sec - in org.apache.hadoop.hbase.security.visibility.TestVisibilityLabelsWithCustomVisLabService
Running org.apache.hadoop.hbase.TestGlobalMemStoreSize
Running org.apache.hadoop.hbase.security.visibility.TestVisibilityWithCheckAuths
Tests run: 2, Failures: 0, Errors: 0, Skipped: 0, Time elapsed: 4.496 sec - in org.apache.hadoop.hbase.security.visibility.TestVisibilityWithCheckAuths
Tests run: 26, Failures: 0, Errors: 0, Skipped: 0, Time elapsed: 116.762 sec - in org.apache.hadoop.hbase.security.visibility.TestVisibilityLabelsWithDefaultVisLabelService
Tests run: 1, Failures: 0, Errors: 0, Skipped: 0, Time elapsed: 18.883 sec - in org.apache.hadoop.hbase.TestGlobalMemStoreSize
Tests run: 1, Failures: 0, Errors: 0, Skipped: 0, Time elapsed: 30.812 sec - in org.apache.hadoop.hbase.security.visibility.TestVisibilityLabelReplicationWithExpAsString
Running org.apache.hadoop.hbase.constraint.TestConstraint
Running org.apache.hadoop.hbase.TestNamespace
Running org.apache.hadoop.hbase.filter.TestFuzzyRowAndColumnRangeFilter
Tests run: 1, Failures: 0, Errors: 0, Skipped: 0, Time elapsed: 3.53 sec - in org.apache.hadoop.hbase.filter.TestFuzzyRowAndColumnRangeFilter
Running org.apache.hadoop.hbase.filter.TestFilterWrapper
Tests run: 1, Failures: 0, Errors: 0, Skipped: 0, Time elapsed: 3.56 sec - in org.apache.hadoop.hbase.filter.TestFilterWrapper
Running org.apache.hadoop.hbase.filter.TestMultiRowRangeFilter
Tests run: 5, Failures: 0, Errors: 0, Skipped: 0, Time elapsed: 23.139 sec - in org.apache.hadoop.hbase.constraint.TestConstraint
Tests run: 44, Failures: 0, Errors: 0, Skipped: 0, Time elapsed: 96.862 sec - in org.apache.hadoop.hbase.security.visibility.TestVisibilityLabelsWithDeletes
Running org.apache.hadoop.hbase.filter.TestColumnRangeFilter
Tests run: 8, Failures: 0, Errors: 0, Skipped: 0, Time elapsed: 38.598 sec - in org.apache.hadoop.hbase.TestNamespace
Running org.apache.hadoop.hbase.filter.TestScanRowPrefix
Tests run: 20, Failures: 0, Errors: 0, Skipped: 0, Time elapsed: 20.254 sec - in org.apache.hadoop.hbase.filter.TestMultiRowRangeFilter
Running org.apache.hadoop.hbase.filter.TestFuzzyRowFilterEndToEnd
Tests run: 1, Failures: 0, Errors: 0, Skipped: 0, Time elapsed: 9.296 sec - in org.apache.hadoop.hbase.filter.TestColumnRangeFilter
Tests run: 1, Failures: 0, Errors: 0, Skipped: 0, Time elapsed: 7.048 sec - in org.apache.hadoop.hbase.filter.TestScanRowPrefix
Running org.apache.hadoop.hbase.TestHBaseTestingUtility
Running org.apache.hadoop.hbase.filter.TestFilterListOrOperatorWithBlkCnt
Running org.apache.hadoop.hbase.filter.TestFilterWithScanLimits
Running org.apache.hadoop.hbase.quotas.TestQuotaThrottle
Tests run: 1, Failures: 0, Errors: 0, Skipped: 0, Time elapsed: 15.527 sec - in org.apache.hadoop.hbase.filter.TestFilterListOrOperatorWithBlkCnt
Running org.apache.hadoop.hbase.quotas.TestQuotaAdmin
Tests run: 3, Failures: 0, Errors: 0, Skipped: 0, Time elapsed: 4.094 sec - in org.apache.hadoop.hbase.quotas.TestQuotaAdmin
Tests run: 12, Failures: 0, Errors: 0, Skipped: 0, Time elapsed: 27.596 sec - in org.apache.hadoop.hbase.quotas.TestQuotaThrottle

Results :

Failed tests: 
  TestCorruptedRegionStoreFile.testLosingFileAfterScannerInit:186 expected one file lost:
rowCount=16062 lostRows=3938
  TestCorruptedRegionStoreFile.testLosingFileDuringScan:160 expected one file lost: rowCount=4062
lostRows=15938
org.apache.hadoop.hbase.regionserver.TestFSErrorsExposed.testFullSystemBubblesFSErrors(org.apache.hadoop.hbase.regionserver.TestFSErrorsExposed)
  Run 1: TestFSErrorsExposed.testFullSystemBubblesFSErrors:212 Did not fail to count after
removing data
  Run 2: TestFSErrorsExposed.testFullSystemBubblesFSErrors:212 Did not fail to count after
removing data
  Run 3: TestFSErrorsExposed.testFullSystemBubblesFSErrors:212 Did not fail to count after
removing data

org.apache.hadoop.hbase.regionserver.TestScannerRetriableFailure.testFaultyScanner(org.apache.hadoop.hbase.regionserver.TestScannerRetriableFailure)
  Run 1: TestScannerRetriableFailure.testFaultyScanner:117->checkTableRows:155 null
  Run 2: TestScannerRetriableFailure.testFaultyScanner:117->checkTableRows:155 null
  Run 3: TestScannerRetriableFailure.testFaultyScanner:117->checkTableRows:155 null

Tests in error: 
  TestHCM.testOperationTimeout:315 » TestTimedOut test timed out after 10 minute...
  TestMultiParallel.testBatchWithPut:343->Object.wait:-2 » TestTimedOut test tim...
  TestMultiParallel.testFlushCommitsWithAbort:257->doTestFlushCommits:293->Object.wait:-2
» TestTimedOut
  TestScannerTimeout.test2772:149->Object.wait:461->Object.wait:-2 » TestTimedOut
  TestScannerTimeout.test3686a:191->Object.wait:461->Object.wait:-2 » TestTimedOut
org.apache.hadoop.hbase.regionserver.TestPerColumnFamilyFlush.testLogReplayWithDistributedLogSplit(org.apache.hadoop.hbase.regionserver.TestPerColumnFamilyFlush)
  Run 1: TestPerColumnFamilyFlush.testLogReplayWithDistributedLogSplit:431->doTestLogReplay:406->verifyEdit:116
» TestTimedOut
  Run 2: TestPerColumnFamilyFlush.testLogReplayWithDistributedLogSplit:431->doTestLogReplay:342
» IllegalState
  Run 3: TestPerColumnFamilyFlush.testLogReplayWithDistributedLogSplit:431->doTestLogReplay:406->verifyEdit:116
» TestTimedOut

  TestRegionReplicaFailover.testLotsOfRegionReplicas:368->Object.wait:503->Object.wait:-2
» TestTimedOut
  TestRegionReplicaFailover.testPrimaryRegionKill:199->verifyNumericRowsWithTimeout:213->Object.wait:503->Object.wait:-2
» TestTimedOut
  TestRegionReplicaFailover.testSecondaryRegionKillWhilePrimaryIsAcceptingWrites:334->verifyNumericRowsWithTimeout:213->Object.wait:503->Object.wait:-2
» TestTimedOut
Flaked tests: 
org.apache.hadoop.hbase.TestFullLogReconstruction.testReconstruction(org.apache.hadoop.hbase.TestFullLogReconstruction)
  Run 1: TestFullLogReconstruction.testReconstruction:107 expected:<17576> but was:<9842>
  Run 2: TestFullLogReconstruction.testReconstruction:106 » Runtime org.apache.hadoop.h...
  Run 3: PASS


Tests run: 2028, Failures: 4, Errors: 9, Skipped: 41, Flakes: 1

[INFO] ------------------------------------------------------------------------
[INFO] Reactor Summary:
[INFO] 
[INFO] Apache HBase ...................................... SUCCESS [1:34.212s]
[INFO] Apache HBase - Checkstyle ......................... SUCCESS [8.552s]
[INFO] Apache HBase - Resource Bundle .................... SUCCESS [0.235s]
[INFO] Apache HBase - Annotations ........................ SUCCESS [1.148s]
[INFO] Apache HBase - Protocol ........................... SUCCESS [21.834s]
[INFO] Apache HBase - Common ............................. SUCCESS [2:38.147s]
[INFO] Apache HBase - Procedure .......................... SUCCESS [3:24.052s]
[INFO] Apache HBase - Client ............................. SUCCESS [1:22.976s]
[INFO] Apache HBase - Hadoop Compatibility ............... SUCCESS [9.417s]
[INFO] Apache HBase - Hadoop Two Compatibility ........... SUCCESS [9.518s]
[INFO] Apache HBase - Prefix Tree ........................ SUCCESS [10.044s]
[INFO] Apache HBase - Server ............................. FAILURE [2:10:50.636s]
[INFO] Apache HBase - Testing Util ....................... SKIPPED
[INFO] Apache HBase - Thrift ............................. SKIPPED
[INFO] Apache HBase - Rest ............................... SKIPPED
[INFO] Apache HBase - Shell .............................. SKIPPED
[INFO] Apache HBase - Integration Tests .................. SKIPPED
[INFO] Apache HBase - Examples ........................... SKIPPED
[INFO] Apache HBase - External Block Cache ............... SKIPPED
[INFO] Apache HBase - Assembly ........................... SKIPPED
[INFO] Apache HBase - Shaded ............................. SKIPPED
[INFO] Apache HBase - Shaded - Client .................... SKIPPED
[INFO] Apache HBase - Shaded - Server .................... SKIPPED
[INFO] ------------------------------------------------------------------------
[INFO] BUILD FAILURE
[INFO] ------------------------------------------------------------------------
[INFO] Total time: 2:21:22.862s
[INFO] Finished at: Thu Mar 17 09:51:55 UTC 2016
[INFO] Final Memory: 470M/661M
[INFO] ------------------------------------------------------------------------
[ERROR] Failed to execute goal org.apache.maven.plugins:maven-surefire-plugin:2.18.1:test
(secondPartTestsExecution) on project hbase-server: ExecutionException: java.lang.RuntimeException:
java.lang.RuntimeException: org.apache.maven.surefire.report.ReporterException: When writing
xml report stdout/stderr: /tmp/stderr1395094373215533246deferred (No such file or directory)
-> [Help 1]
[ERROR] 
[ERROR] To see the full stack trace of the errors, re-run Maven with the -e switch.
[ERROR] Re-run Maven using the -X switch to enable full debug logging.
[ERROR] 
[ERROR] For more information about the errors and possible solutions, please read the following
articles:
[ERROR] [Help 1] http://cwiki.apache.org/confluence/display/MAVEN/MojoFailureException
[ERROR] 
[ERROR] After correcting the problems, you can resume the build with the command
[ERROR]   mvn <goals> -rf :hbase-server
Build step 'Invoke top-level Maven targets' marked build as failure
Performing Post build task...
Match found for :.* : True
Logical operation result is TRUE
Running script  : # Post-build task script. TODO: Check this in and have all builds reference
check-in.
pwd && ls
# NOTE!!!! The below code has been copied and pasted from ./dev-tools/run-test.sh
# Do not change here without syncing there and vice-versa.
ZOMBIE_TESTS_COUNT=`jps -v | grep surefirebooter | grep -e '-Dhbase.test' | wc -l`
if [[ $ZOMBIE_TESTS_COUNT != 0 ]] ; then
 echo "Suspicious java process found - waiting 30s to see if there are just slow to stop"
 sleep 30
 ZOMBIE_TESTS_COUNT=`jps -v | grep surefirebooter | grep -e '-Dhbase.test' | wc -l`
 if [[ $ZOMBIE_TESTS_COUNT != 0 ]] ; then
   echo " {color:red}There appear to be $ZOMBIE_TESTS_COUNT zombie tests{color}, they should
have been killed by surefire but survived"
   jps -v | grep surefirebooter | grep -e '-Dhbase.test'
   jps -v | grep surefirebooter | grep -e '-Dhbase.test' | cut -d ' ' -f 1 | xargs -n 1 jstack
   # Exit with error
   exit 1
 else
   echo "We're ok: there is no zombie test, but some tests took some time to stop"
 fi
else
  echo "We're ok: there is no zombie test"
fi
[yahoo-not-h2] $ /bin/bash -xe /tmp/hudson1191194652604266459.sh
+ pwd
<https://builds.apache.org/job/HBase-1.4/jdk=latest1.7,label=yahoo-not-h2/ws/>
+ ls
bin
CHANGES.txt
conf
dev-support
hbase-annotations
hbase-assembly
hbase-checkstyle
hbase-client
hbase-common
hbase-examples
hbase-external-blockcache
hbase-hadoop2-compat
hbase-hadoop-compat
hbase-it
hbase-native-client
hbase-prefix-tree
hbase-procedure
hbase-protocol
hbase-resource-bundle
hbase-rest
hbase-server
hbase-shaded
hbase-shell
hbase-testing-util
hbase-thrift
LICENSE.txt
NOTICE.txt
pom.xml
README.txt
src
target
++ jps -v
++ wc -l
++ grep surefirebooter
++ grep -e -Dhbase.test
+ ZOMBIE_TESTS_COUNT=8
+ [[ 8 != 0 ]]
+ echo 'Suspicious java process found - waiting 30s to see if there are just slow to stop'
Suspicious java process found - waiting 30s to see if there are just slow to stop
+ sleep 30
++ jps -v
++ grep -e -Dhbase.test
++ grep surefirebooter
++ wc -l
+ ZOMBIE_TESTS_COUNT=0
+ [[ 0 != 0 ]]
+ echo 'We'\''re ok: there is no zombie test, but some tests took some time to stop'
We're ok: there is no zombie test, but some tests took some time to stop
POST BUILD TASK : SUCCESS
END OF POST BUILD TASK : 0
Archiving artifacts
Recording test results

Mime
View raw message