hbase-builds mailing list archives

Site index · List index
Message view « Date » · « Thread »
Top « Date » · « Thread »
From Apache Jenkins Server <jenk...@builds.apache.org>
Subject Build failed in Jenkins: HBase-Trunk_matrix » latest1.7,yahoo-not-h2 #806
Date Fri, 25 Mar 2016 05:36:26 GMT
See <https://builds.apache.org/job/HBase-Trunk_matrix/jdk=latest1.7,label=yahoo-not-h2/806/changes>

Changes:

[tedyu] HBASE-15526 Make SnapshotManager accessible through MasterServices

------------------------------------------
[...truncated 5537 lines...]
Tests run: 3, Failures: 0, Errors: 0, Skipped: 0, Time elapsed: 25.034 sec - in org.apache.hadoop.hbase.regionserver.TestRegionIncrement
Tests run: 2, Failures: 0, Errors: 0, Skipped: 0, Time elapsed: 27.221 sec - in org.apache.hadoop.hbase.regionserver.TestEncryptionKeyRotation
Tests run: 26, Failures: 0, Errors: 0, Skipped: 0, Time elapsed: 36.697 sec - in org.apache.hadoop.hbase.regionserver.TestHRegionReplayEvents
Tests run: 5, Failures: 0, Errors: 0, Skipped: 0, Time elapsed: 311.391 sec - in org.apache.hadoop.hbase.regionserver.wal.TestLogRolling
Running org.apache.hadoop.hbase.regionserver.TestDeleteMobTable
Running org.apache.hadoop.hbase.regionserver.TestWALLockup
Running org.apache.hadoop.hbase.regionserver.throttle.TestFlushWithThroughputController
Tests run: 1, Failures: 0, Errors: 0, Skipped: 0, Time elapsed: 9.24 sec - in org.apache.hadoop.hbase.regionserver.TestWALLockup
Running org.apache.hadoop.hbase.regionserver.TestMobStoreScanner
Running org.apache.hadoop.hbase.regionserver.throttle.TestCompactionWithThroughputController
Tests run: 3, Failures: 0, Errors: 0, Skipped: 0, Time elapsed: 24.806 sec - in org.apache.hadoop.hbase.regionserver.TestDeleteMobTable
Running org.apache.hadoop.hbase.regionserver.TestCompactionState
Tests run: 6, Failures: 0, Errors: 0, Skipped: 0, Time elapsed: 58.24 sec - in org.apache.hadoop.hbase.regionserver.TestMobStoreScanner
Running org.apache.hadoop.hbase.regionserver.TestFSErrorsExposed
Tests run: 3, Failures: 0, Errors: 0, Skipped: 0, Time elapsed: 107.356 sec - in org.apache.hadoop.hbase.regionserver.throttle.TestCompactionWithThroughputController
Running org.apache.hadoop.hbase.regionserver.TestCorruptedRegionStoreFile
Tests run: 5, Failures: 0, Errors: 0, Skipped: 0, Time elapsed: 85.861 sec - in org.apache.hadoop.hbase.regionserver.TestCompactionState
Running org.apache.hadoop.hbase.regionserver.TestDefaultMemStore
Tests run: 3, Failures: 0, Errors: 0, Skipped: 0, Time elapsed: 66.739 sec - in org.apache.hadoop.hbase.regionserver.TestFSErrorsExposed
Tests run: 3, Failures: 0, Errors: 0, Skipped: 0, Time elapsed: 163.036 sec - in org.apache.hadoop.hbase.regionserver.throttle.TestFlushWithThroughputController
Running org.apache.hadoop.hbase.regionserver.TestRegionServerMetrics
Running org.apache.hadoop.hbase.regionserver.TestGetClosestAtOrBefore
Tests run: 3, Failures: 0, Errors: 0, Skipped: 0, Time elapsed: 7.387 sec - in org.apache.hadoop.hbase.regionserver.TestGetClosestAtOrBefore
Running org.apache.hadoop.hbase.regionserver.TestRSKilledWhenInitializing
Tests run: 7, Failures: 0, Errors: 0, Skipped: 0, Time elapsed: 242.033 sec - in org.apache.hadoop.hbase.regionserver.TestRegionReplicas
Tests run: 23, Failures: 0, Errors: 0, Skipped: 0, Time elapsed: 53.49 sec - in org.apache.hadoop.hbase.regionserver.TestDefaultMemStore
Running org.apache.hadoop.hbase.regionserver.TestReversibleScanners
Tests run: 5, Failures: 0, Errors: 0, Skipped: 0, Time elapsed: 13.073 sec - in org.apache.hadoop.hbase.regionserver.TestReversibleScanners
Running org.apache.hadoop.hbase.regionserver.TestMobStoreCompaction
Running org.apache.hadoop.hbase.regionserver.TestRecoveredEdits
Tests run: 4, Failures: 0, Errors: 0, Skipped: 0, Time elapsed: 10.637 sec - in org.apache.hadoop.hbase.regionserver.TestMobStoreCompaction
Tests run: 1, Failures: 0, Errors: 0, Skipped: 0, Time elapsed: 42.239 sec - in org.apache.hadoop.hbase.regionserver.TestRSKilledWhenInitializing
Tests run: 16, Failures: 0, Errors: 0, Skipped: 1, Time elapsed: 55.864 sec - in org.apache.hadoop.hbase.regionserver.TestRegionServerMetrics
Tests run: 1, Failures: 0, Errors: 0, Skipped: 0, Time elapsed: 23.822 sec - in org.apache.hadoop.hbase.regionserver.TestRecoveredEdits
Running org.apache.hadoop.hbase.regionserver.TestScannerRetriableFailure
Running org.apache.hadoop.hbase.regionserver.TestRegionServerNoMaster
Running org.apache.hadoop.hbase.regionserver.TestClusterId
Running org.apache.hadoop.hbase.regionserver.TestScannerWithBulkload
Tests run: 4, Failures: 0, Errors: 0, Skipped: 0, Time elapsed: 18.4 sec - in org.apache.hadoop.hbase.regionserver.TestRegionServerNoMaster
Running org.apache.hadoop.hbase.regionserver.TestRegionServerHostname
Tests run: 3, Failures: 0, Errors: 0, Skipped: 0, Time elapsed: 19.738 sec - in org.apache.hadoop.hbase.regionserver.TestScannerWithBulkload
Running org.apache.hadoop.hbase.regionserver.TestCompaction
Tests run: 1, Failures: 0, Errors: 0, Skipped: 0, Time elapsed: 38.528 sec - in org.apache.hadoop.hbase.regionserver.TestScannerRetriableFailure
Running org.apache.hadoop.hbase.regionserver.TestSplitWalDataLoss
Tests run: 2, Failures: 0, Errors: 0, Skipped: 0, Time elapsed: 49.623 sec - in org.apache.hadoop.hbase.regionserver.TestClusterId
Running org.apache.hadoop.hbase.regionserver.TestPerColumnFamilyFlush
Tests run: 2, Failures: 0, Errors: 0, Skipped: 0, Time elapsed: 37.028 sec - in org.apache.hadoop.hbase.regionserver.TestRegionServerHostname
Tests run: 5, Failures: 0, Errors: 0, Skipped: 0, Time elapsed: 30.822 sec - in org.apache.hadoop.hbase.regionserver.TestCompaction
Tests run: 2, Failures: 0, Errors: 0, Skipped: 0, Time elapsed: 214.185 sec - in org.apache.hadoop.hbase.regionserver.TestCorruptedRegionStoreFile
Tests run: 1, Failures: 0, Errors: 0, Skipped: 0, Time elapsed: 36.995 sec - in org.apache.hadoop.hbase.regionserver.TestSplitWalDataLoss
Running org.apache.hadoop.hbase.regionserver.compactions.TestFIFOCompactionPolicy
Running org.apache.hadoop.hbase.regionserver.compactions.TestCompactedHFilesDischarger
Running org.apache.hadoop.hbase.regionserver.TestServerCustomProtocol
Tests run: 3, Failures: 0, Errors: 0, Skipped: 0, Time elapsed: 8.055 sec - in org.apache.hadoop.hbase.regionserver.compactions.TestCompactedHFilesDischarger
Running org.apache.hadoop.hbase.regionserver.TestRegionFavoredNodes
Running org.apache.hadoop.hbase.regionserver.TestSeekOptimizations
Tests run: 6, Failures: 0, Errors: 0, Skipped: 0, Time elapsed: 18.028 sec - in org.apache.hadoop.hbase.regionserver.TestSeekOptimizations
Running org.apache.hadoop.hbase.regionserver.TestHRegion
Tests run: 1, Failures: 0, Errors: 0, Skipped: 0, Time elapsed: 26.666 sec - in org.apache.hadoop.hbase.regionserver.TestRegionFavoredNodes
Running org.apache.hadoop.hbase.regionserver.TestAtomicOperation
Tests run: 7, Failures: 0, Errors: 0, Skipped: 0, Time elapsed: 53.478 sec - in org.apache.hadoop.hbase.regionserver.TestServerCustomProtocol
Tests run: 4, Failures: 0, Errors: 0, Skipped: 0, Time elapsed: 71.978 sec - in org.apache.hadoop.hbase.regionserver.compactions.TestFIFOCompactionPolicy
Running org.apache.hadoop.hbase.regionserver.TestCompactionWithCoprocessor
Running org.apache.hadoop.hbase.regionserver.TestSplitTransactionOnCluster
Tests run: 5, Failures: 0, Errors: 0, Skipped: 0, Time elapsed: 34.788 sec - in org.apache.hadoop.hbase.regionserver.TestCompactionWithCoprocessor
Running org.apache.hadoop.hbase.regionserver.TestHRegionServerBulkLoad
Tests run: 8, Failures: 0, Errors: 0, Skipped: 0, Time elapsed: 80.432 sec - in org.apache.hadoop.hbase.regionserver.TestAtomicOperation
Tests run: 6, Failures: 0, Errors: 0, Skipped: 1, Time elapsed: 164.346 sec - in org.apache.hadoop.hbase.regionserver.TestPerColumnFamilyFlush
Running org.apache.hadoop.hbase.regionserver.TestRemoveRegionMetrics
Running org.apache.hadoop.hbase.regionserver.TestScannerHeartbeatMessages
Tests run: 102, Failures: 0, Errors: 0, Skipped: 0, Time elapsed: 183.723 sec - in org.apache.hadoop.hbase.regionserver.TestHRegion
Tests run: 2, Failures: 0, Errors: 0, Skipped: 0, Time elapsed: 125.232 sec - in org.apache.hadoop.hbase.regionserver.TestHRegionServerBulkLoad
Tests run: 15, Failures: 0, Errors: 0, Skipped: 0, Time elapsed: 147.217 sec - in org.apache.hadoop.hbase.regionserver.TestSplitTransactionOnCluster
Running org.apache.hadoop.hbase.regionserver.TestRegionServerOnlineConfigChange
Running org.apache.hadoop.hbase.regionserver.TestEndToEndSplitTransaction
Tests run: 2, Failures: 0, Errors: 0, Skipped: 0, Time elapsed: 1.949 sec - in org.apache.hadoop.hbase.regionserver.TestRegionServerOnlineConfigChange
Running org.apache.hadoop.hbase.regionserver.TestEncryptionRandomKeying
Tests run: 1, Failures: 0, Errors: 0, Skipped: 0, Time elapsed: 2.264 sec - in org.apache.hadoop.hbase.regionserver.TestEncryptionRandomKeying
Running org.apache.hadoop.hbase.TestRegionRebalancing
Tests run: 2, Failures: 0, Errors: 0, Skipped: 0, Time elapsed: 27.24 sec - in org.apache.hadoop.hbase.regionserver.TestEndToEndSplitTransaction
Running org.apache.hadoop.hbase.TestPartialResultsFromClientSide
Tests run: 1, Failures: 0, Errors: 0, Skipped: 0, Time elapsed: 163.417 sec - in org.apache.hadoop.hbase.regionserver.TestRemoveRegionMetrics
Running org.apache.hadoop.hbase.quotas.TestQuotaThrottle
Tests run: 1, Failures: 0, Errors: 0, Skipped: 0, Time elapsed: 176.728 sec - in org.apache.hadoop.hbase.regionserver.TestScannerHeartbeatMessages
Running org.apache.hadoop.hbase.quotas.TestQuotaAdmin
Tests run: 2, Failures: 0, Errors: 0, Skipped: 0, Time elapsed: 83.903 sec - in org.apache.hadoop.hbase.TestRegionRebalancing
Tests run: 3, Failures: 0, Errors: 0, Skipped: 0, Time elapsed: 9.374 sec - in org.apache.hadoop.hbase.quotas.TestQuotaAdmin
Running org.apache.hadoop.hbase.io.encoding.TestEncodedSeekers
Running org.apache.hadoop.hbase.io.encoding.TestDataBlockEncoders
Tests run: 12, Failures: 0, Errors: 0, Skipped: 0, Time elapsed: 45.861 sec - in org.apache.hadoop.hbase.quotas.TestQuotaThrottle
Running org.apache.hadoop.hbase.quotas.TestQuotaTableUtil
Tests run: 3, Failures: 0, Errors: 0, Skipped: 0, Time elapsed: 3.877 sec - in org.apache.hadoop.hbase.quotas.TestQuotaTableUtil
Running org.apache.hadoop.hbase.io.encoding.TestLoadAndSwitchEncodeOnDisk
Running org.apache.hadoop.hbase.io.encoding.TestChangingEncoding
Tests run: 1, Failures: 0, Errors: 0, Skipped: 0, Time elapsed: 66.995 sec - in org.apache.hadoop.hbase.io.encoding.TestLoadAndSwitchEncodeOnDisk
Tests run: 18, Failures: 0, Errors: 0, Skipped: 0, Time elapsed: 153.636 sec - in org.apache.hadoop.hbase.TestPartialResultsFromClientSide
Running org.apache.hadoop.hbase.io.encoding.TestBufferedDataBlockEncoder
Running org.apache.hadoop.hbase.io.hfile.TestCacheOnWrite
Tests run: 2, Failures: 0, Errors: 0, Skipped: 0, Time elapsed: 28.173 sec - in org.apache.hadoop.hbase.io.encoding.TestBufferedDataBlockEncoder
Running org.apache.hadoop.hbase.io.hfile.TestSeekBeforeWithInlineBlocks
Tests run: 1, Failures: 0, Errors: 0, Skipped: 0, Time elapsed: 31.36 sec - in org.apache.hadoop.hbase.io.hfile.TestSeekBeforeWithInlineBlocks
Running org.apache.hadoop.hbase.io.hfile.TestCacheConfig
Tests run: 7, Failures: 0, Errors: 0, Skipped: 0, Time elapsed: 4.659 sec - in org.apache.hadoop.hbase.io.hfile.TestCacheConfig
Running org.apache.hadoop.hbase.io.hfile.TestHFileSeek
Tests run: 1, Failures: 0, Errors: 0, Skipped: 0, Time elapsed: 5.926 sec - in org.apache.hadoop.hbase.io.hfile.TestHFileSeek
Running org.apache.hadoop.hbase.io.hfile.TestHFileBlock
Tests run: 56, Failures: 0, Errors: 0, Skipped: 0, Time elapsed: 193.658 sec - in org.apache.hadoop.hbase.io.encoding.TestDataBlockEncoders
Running org.apache.hadoop.hbase.io.hfile.TestForceCacheImportantBlocks
Tests run: 20, Failures: 0, Errors: 0, Skipped: 0, Time elapsed: 227.615 sec - in org.apache.hadoop.hbase.io.encoding.TestEncodedSeekers
Running org.apache.hadoop.hbase.io.hfile.TestScannerFromBucketCache
Tests run: 3, Failures: 0, Errors: 0, Skipped: 0, Time elapsed: 215.881 sec - in org.apache.hadoop.hbase.io.encoding.TestChangingEncoding
Tests run: 4, Failures: 0, Errors: 0, Skipped: 0, Time elapsed: 14.157 sec - in org.apache.hadoop.hbase.io.hfile.TestScannerFromBucketCache
Running org.apache.hadoop.hbase.io.hfile.TestScannerSelectionUsingTTL
Running org.apache.hadoop.hbase.io.hfile.TestHFileBlockIndex
Tests run: 2, Failures: 0, Errors: 0, Skipped: 0, Time elapsed: 54.704 sec - in org.apache.hadoop.hbase.io.hfile.TestForceCacheImportantBlocks
Running org.apache.hadoop.hbase.io.TestFileLink
Tests run: 10, Failures: 0, Errors: 0, Skipped: 0, Time elapsed: 28.688 sec - in org.apache.hadoop.hbase.io.hfile.TestHFileBlockIndex
Tests run: 28, Failures: 0, Errors: 0, Skipped: 0, Time elapsed: 106.751 sec - in org.apache.hadoop.hbase.io.hfile.TestHFileBlock
Tests run: 5, Failures: 0, Errors: 0, Skipped: 0, Time elapsed: 42.633 sec - in org.apache.hadoop.hbase.io.TestFileLink
Tests run: 6, Failures: 0, Errors: 0, Skipped: 0, Time elapsed: 70.941 sec - in org.apache.hadoop.hbase.io.hfile.TestScannerSelectionUsingTTL
Running org.apache.hadoop.hbase.security.access.TestAccessController
Running org.apache.hadoop.hbase.security.access.TestTablePermissions
Running org.apache.hadoop.hbase.security.access.TestAccessController3
Tests run: 1, Failures: 0, Errors: 0, Skipped: 0, Time elapsed: 8.508 sec - in org.apache.hadoop.hbase.security.access.TestAccessController3
Running org.apache.hadoop.hbase.security.access.TestCellACLs
Tests run: 7, Failures: 0, Errors: 0, Skipped: 0, Time elapsed: 29.586 sec - in org.apache.hadoop.hbase.security.access.TestTablePermissions
Tests run: 2, Failures: 0, Errors: 0, Skipped: 0, Time elapsed: 24.291 sec - in org.apache.hadoop.hbase.security.access.TestCellACLs
Running org.apache.hadoop.hbase.security.access.TestAccessControlFilter
Tests run: 1, Failures: 0, Errors: 0, Skipped: 0, Time elapsed: 5.976 sec - in org.apache.hadoop.hbase.security.access.TestAccessControlFilter
Running org.apache.hadoop.hbase.security.access.TestNamespaceCommands
Running org.apache.hadoop.hbase.security.access.TestCellACLWithMultipleVersions
Running org.apache.hadoop.hbase.security.access.TestAccessController2
Tests run: 7, Failures: 0, Errors: 0, Skipped: 0, Time elapsed: 16.693 sec - in org.apache.hadoop.hbase.security.access.TestNamespaceCommands
Running org.apache.hadoop.hbase.security.access.TestZKPermissionsWatcher
Tests run: 1, Failures: 0, Errors: 0, Skipped: 0, Time elapsed: 3.903 sec - in org.apache.hadoop.hbase.security.access.TestZKPermissionsWatcher
Tests run: 64, Failures: 0, Errors: 0, Skipped: 0, Time elapsed: 138.369 sec - in org.apache.hadoop.hbase.security.access.TestAccessController
Running org.apache.hadoop.hbase.security.access.TestWithDisabledAuthorization
Tests run: 8, Failures: 0, Errors: 0, Skipped: 0, Time elapsed: 72.461 sec - in org.apache.hadoop.hbase.security.access.TestCellACLWithMultipleVersions
Tests run: 72, Failures: 0, Errors: 0, Skipped: 0, Time elapsed: 376.033 sec - in org.apache.hadoop.hbase.io.hfile.TestCacheOnWrite
Running org.apache.hadoop.hbase.security.access.TestScanEarlyTermination
Tests run: 1, Failures: 0, Errors: 0, Skipped: 0, Time elapsed: 10.877 sec - in org.apache.hadoop.hbase.security.access.TestScanEarlyTermination
Tests run: 6, Failures: 0, Errors: 0, Skipped: 0, Time elapsed: 85.812 sec - in org.apache.hadoop.hbase.security.access.TestAccessController2
Running org.apache.hadoop.hbase.security.visibility.TestVisibilityLablesWithGroups
Running org.apache.hadoop.hbase.security.visibility.TestVisibilityLabelsWithDeletes
Tests run: 1, Failures: 0, Errors: 0, Skipped: 0, Time elapsed: 6.57 sec - in org.apache.hadoop.hbase.security.visibility.TestVisibilityLablesWithGroups
Tests run: 6, Failures: 0, Errors: 0, Skipped: 0, Time elapsed: 59.158 sec - in org.apache.hadoop.hbase.security.access.TestWithDisabledAuthorization
Running org.apache.hadoop.hbase.security.visibility.TestVisibilityLabelsWithCustomVisLabService
Running org.apache.hadoop.hbase.security.visibility.TestVisibilityLabelsWithDefaultVisLabelService
Running org.apache.hadoop.hbase.security.visibility.TestDefaultScanLabelGeneratorStack
Tests run: 1, Failures: 0, Errors: 0, Skipped: 0, Time elapsed: 5.953 sec - in org.apache.hadoop.hbase.security.visibility.TestDefaultScanLabelGeneratorStack
Running org.apache.hadoop.hbase.security.visibility.TestVisibilityWithCheckAuths
Tests run: 2, Failures: 0, Errors: 0, Skipped: 0, Time elapsed: 9.223 sec - in org.apache.hadoop.hbase.security.visibility.TestVisibilityWithCheckAuths
Running org.apache.hadoop.hbase.security.visibility.TestVisibilityLabelsOpWithDifferentUsersNoACL
Tests run: 1, Failures: 0, Errors: 0, Skipped: 0, Time elapsed: 3.466 sec - in org.apache.hadoop.hbase.security.visibility.TestVisibilityLabelsOpWithDifferentUsersNoACL
Tests run: 21, Failures: 0, Errors: 0, Skipped: 0, Time elapsed: 54.47 sec - in org.apache.hadoop.hbase.security.visibility.TestVisibilityLabelsWithCustomVisLabService
Running org.apache.hadoop.hbase.security.visibility.TestVisibilityLabelsReplication
Tests run: 26, Failures: 0, Errors: 0, Skipped: 0, Time elapsed: 65.125 sec - in org.apache.hadoop.hbase.security.visibility.TestVisibilityLabelsWithDefaultVisLabelService
Running org.apache.hadoop.hbase.security.visibility.TestVisibilityLabelReplicationWithExpAsString
Running org.apache.hadoop.hbase.security.visibility.TestVisibilityLabelsWithSLGStack
Tests run: 1, Failures: 0, Errors: 0, Skipped: 0, Time elapsed: 4.33 sec - in org.apache.hadoop.hbase.security.visibility.TestVisibilityLabelsWithSLGStack
Running org.apache.hadoop.hbase.security.visibility.TestEnforcingScanLabelGenerator
Tests run: 1, Failures: 0, Errors: 0, Skipped: 0, Time elapsed: 5.393 sec - in org.apache.hadoop.hbase.security.visibility.TestEnforcingScanLabelGenerator
Tests run: 1, Failures: 0, Errors: 0, Skipped: 0, Time elapsed: 50.734 sec - in org.apache.hadoop.hbase.security.visibility.TestVisibilityLabelsReplication
Running org.apache.hadoop.hbase.security.visibility.TestVisibilityLabelsWithACL
Running org.apache.hadoop.hbase.security.token.TestZKSecretWatcher
Tests run: 1, Failures: 0, Errors: 0, Skipped: 0, Time elapsed: 53.134 sec - in org.apache.hadoop.hbase.security.visibility.TestVisibilityLabelReplicationWithExpAsString
Running org.apache.hadoop.hbase.security.visibility.TestWithDisabledAuthorization
Tests run: 2, Failures: 0, Errors: 0, Skipped: 0, Time elapsed: 7.297 sec - in org.apache.hadoop.hbase.security.visibility.TestWithDisabledAuthorization
Tests run: 5, Failures: 0, Errors: 0, Skipped: 0, Time elapsed: 18.821 sec - in org.apache.hadoop.hbase.security.visibility.TestVisibilityLabelsWithACL
Tests run: 1, Failures: 0, Errors: 0, Skipped: 0, Time elapsed: 14.212 sec - in org.apache.hadoop.hbase.security.token.TestZKSecretWatcher
Running org.apache.hadoop.hbase.security.token.TestTokenAuthentication
Tests run: 3, Failures: 0, Errors: 0, Skipped: 0, Time elapsed: 1.967 sec - in org.apache.hadoop.hbase.security.token.TestTokenAuthentication
Running org.apache.hadoop.hbase.TestHBaseOnOtherDfsCluster
Tests run: 44, Failures: 0, Errors: 0, Skipped: 0, Time elapsed: 187.163 sec - in org.apache.hadoop.hbase.security.visibility.TestVisibilityLabelsWithDeletes
Tests run: 1, Failures: 0, Errors: 0, Skipped: 0, Time elapsed: 31.61 sec - in org.apache.hadoop.hbase.TestHBaseOnOtherDfsCluster
Running org.apache.hadoop.hbase.security.token.TestGenerateDelegationToken
Tests run: 1, Failures: 0, Errors: 0, Skipped: 0, Time elapsed: 7.736 sec - in org.apache.hadoop.hbase.security.token.TestGenerateDelegationToken

Results :

Tests run: 2679, Failures: 0, Errors: 0, Skipped: 65

[INFO] ------------------------------------------------------------------------
[INFO] Reactor Summary:
[INFO] 
[INFO] Apache HBase ...................................... SUCCESS [  5.385 s]
[INFO] Apache HBase - Checkstyle ......................... SUCCESS [  1.586 s]
[INFO] Apache HBase - Resource Bundle .................... SUCCESS [  0.437 s]
[INFO] Apache HBase - Annotations ........................ SUCCESS [  0.482 s]
[INFO] Apache HBase - Protocol ........................... SUCCESS [  5.008 s]
[INFO] Apache HBase - Common ............................. SUCCESS [02:33 min]
[INFO] Apache HBase - Procedure .......................... SUCCESS [03:26 min]
[INFO] Apache HBase - Client ............................. SUCCESS [01:05 min]
[INFO] Apache HBase - Hadoop Compatibility ............... SUCCESS [ 10.594 s]
[INFO] Apache HBase - Hadoop Two Compatibility ........... SUCCESS [ 15.678 s]
[INFO] Apache HBase - Prefix Tree ........................ SUCCESS [ 20.350 s]
[INFO] Apache HBase - Server ............................. FAILURE [  02:43 h]
[INFO] Apache HBase - Testing Util ....................... SKIPPED
[INFO] Apache HBase - Thrift ............................. SKIPPED
[INFO] Apache HBase - RSGroup ............................ SKIPPED
[INFO] Apache HBase - Shell .............................. SKIPPED
[INFO] Apache HBase - Integration Tests .................. SKIPPED
[INFO] Apache HBase - Examples ........................... SKIPPED
[INFO] Apache HBase - Rest ............................... SKIPPED
[INFO] Apache HBase - External Block Cache ............... SKIPPED
[INFO] Apache HBase - Spark .............................. SKIPPED
[INFO] Apache HBase - Assembly ........................... SKIPPED
[INFO] Apache HBase - Shaded ............................. SKIPPED
[INFO] Apache HBase - Shaded - Client .................... SKIPPED
[INFO] Apache HBase - Shaded - Server .................... SKIPPED
[INFO] Apache HBase - Archetypes ......................... SKIPPED
[INFO] Apache HBase - Exemplar for hbase-client archetype  SKIPPED
[INFO] Apache HBase - Exemplar for hbase-shaded-client archetype  SKIPPED
[INFO] Apache HBase - Archetype builder .................. SKIPPED
[INFO] ------------------------------------------------------------------------
[INFO] BUILD FAILURE
[INFO] ------------------------------------------------------------------------
[INFO] Total time: 02:52 h
[INFO] Finished at: 2016-03-25T05:19:52+00:00
[INFO] Final Memory: 69M/757M
[INFO] ------------------------------------------------------------------------
[ERROR] Failed to execute goal org.apache.maven.plugins:maven-surefire-plugin:2.18.1:test
(secondPartTestsExecution) on project hbase-server: There was a timeout or other error in
the fork -> [Help 1]
[ERROR] 
[ERROR] To see the full stack trace of the errors, re-run Maven with the -e switch.
[ERROR] Re-run Maven using the -X switch to enable full debug logging.
[ERROR] 
[ERROR] For more information about the errors and possible solutions, please read the following
articles:
[ERROR] [Help 1] http://cwiki.apache.org/confluence/display/MAVEN/MojoFailureException
[ERROR] 
[ERROR] After correcting the problems, you can resume the build with the command
[ERROR]   mvn <goals> -rf :hbase-server
Build step 'Invoke top-level Maven targets' marked build as failure
Performing Post build task...
Match found for :.* : True
Logical operation result is TRUE
Running script  : # Run zombie detector script
./dev-support/zombie-detector.sh --jenkins ${BUILD_ID}
[yahoo-not-h2] $ /bin/bash -xe /tmp/hudson7271996123760672291.sh
+ ./dev-support/zombie-detector.sh --jenkins 806
Fri Mar 25 05:19:54 UTC 2016 We're ok: there is no zombie test


    {color:green}+1 zombies{color}. No zombie tests found running at the end of the build.
POST BUILD TASK : SUCCESS
END OF POST BUILD TASK : 0
Archiving artifacts
Recording test results
[FINDBUGS] Skipping publisher since build result is FAILURE
[CHECKSTYLE] Skipping publisher since build result is FAILURE

Mime
View raw message