hbase-builds mailing list archives

Site index · List index
Message view « Date » · « Thread »
Top « Date » · « Thread »
From Apache Jenkins Server <jenk...@builds.apache.org>
Subject Build failed in Jenkins: HBase-1.3-IT » IntegrationTestBigLinkedList,latest1.8,yahoo-not-h2 #558
Date Thu, 17 Mar 2016 08:24:13 GMT
See <https://builds.apache.org/job/HBase-1.3-IT/it.test=IntegrationTestBigLinkedList,jdk=latest1.8,label=yahoo-not-h2/558/changes>

Changes:

[tedyu] HBASE-12940 Expose listPeerConfigs and getPeerConfig to the HBase shell

------------------------------------------
[...truncated 2380 lines...]
     bool UseSHM                                    = false                              
{product}
     intx UseSSE                                    = 4                                  
{product}
     bool UseSSE42Intrinsics                        = true                               
{product}
     bool UseSerialGC                               = false                              
{product}
     bool UseSharedSpaces                           = false                              
{product}
     bool UseSignalChaining                         = true                               
{product}
     bool UseStoreImmI16                            = false                              
{ARCH product}
     bool UseStringDeduplication                    = false                              
{product}
     bool UseSuperWord                              = true                               
{C2 product}
     bool UseTLAB                                   = true                               
{pd product}
     bool UseThreadPriorities                       = true                               
{pd product}
     bool UseTransparentHugePages                   = false                              
{product}
     bool UseTypeProfile                            = true                               
{product}
     bool UseTypeSpeculation                        = true                               
{C2 product}
     bool UseUnalignedLoadStores                    = true                               
{ARCH product}
     bool UseVMInterruptibleIO                      = false                              
{product}
     bool UseXMMForArrayCopy                        = true                               
{product}
     bool UseXmmI2D                                 = false                              
{ARCH product}
     bool UseXmmI2F                                 = false                              
{ARCH product}
     bool UseXmmLoadAndClearUpper                   = true                               
{ARCH product}
     bool UseXmmRegToRegMoveAll                     = true                               
{ARCH product}
     bool VMThreadHintNoPreempt                     = false                              
{product}
     intx VMThreadPriority                          = -1                                 
{product}
     intx VMThreadStackSize                         = 1024                               
{pd product}
     intx ValueMapInitialSize                       = 11                                 
{C1 product}
     intx ValueMapMaxLoopSize                       = 8                                  
{C1 product}
     intx ValueSearchLimit                          = 1000                               
{C2 product}
     bool VerifyMergedCPBytecodes                   = true                               
{product}
     bool VerifySharedSpaces                        = false                              
{product}
     intx WorkAroundNPTLTimedWaitHang               = 1                                  
{product}
    uintx YoungGenerationSizeIncrement              = 20                                 
{product}
    uintx YoungGenerationSizeSupplement             = 80                                 
{product}
    uintx YoungGenerationSizeSupplementDecay        = 8                                  
{product}
    uintx YoungPLABSize                             = 4096                               
{product}
     bool ZeroTLAB                                  = false                              
{product}
     intx hashCode                                  = 5                                  
{product}
Running org.apache.hadoop.hbase.test.IntegrationTestBigLinkedList
SUREFIRE-859: [GC (Allocation Failure)  193536K->67316K(741888K), 0.2120696 secs]
SUREFIRE-859: [GC (Metadata GC Threshold)  106045K->43386K(935424K), 0.0334102 secs]
SUREFIRE-859: [Full GC (Metadata GC Threshold)  43386K->8262K(747520K), 0.1676895 secs]
SUREFIRE-859: [GC (Allocation Failure)  395334K->96343K(747520K), 0.2012024 secs]
SUREFIRE-859: [GC (Metadata GC Threshold)  150393K->106827K(985600K), 0.1254751 secs]
SUREFIRE-859: [Full GC (Metadata GC Threshold)  106827K->101662K(1216000K), 0.3373648 secs]
SUREFIRE-859: [GC (Metadata GC Threshold)  659502K->148150K(1216000K), 0.1306012 secs]
SUREFIRE-859: [Full GC (Metadata GC Threshold)  148150K->136761K(1350656K), 0.5533600 secs]
SUREFIRE-859: [GC (GCLocker Initiated GC)  761958K->176580K(1675264K), 0.1207667 secs]
SUREFIRE-859: [GC (Allocation Failure)  1103814K->299387K(1712128K), 0.4957166 secs]
SUREFIRE-859: [GC (Allocation Failure)  1225032K->430648K(1829376K), 0.5255967 secs]
SUREFIRE-859: [GC (Allocation Failure)  1423320K->632913K(1888768K), 0.8408561 secs]
SUREFIRE-859: [GC (Allocation Failure)  1626193K->749627K(1586688K), 0.7069173 secs]
SUREFIRE-859: [Full GC (Ergonomics)  749627K->667377K(2312192K), 2.2788640 secs]
SUREFIRE-859: [GC (Allocation Failure)  1358577K->772069K(2463232K), 0.1776260 secs]
SUREFIRE-859: [GC (Allocation Failure)  1463269K->888253K(2413056K), 0.3154946 secs]
SUREFIRE-859: [GC (Allocation Failure)  1596527K->916284K(2446848K), 0.7923174 secs]
SUREFIRE-859: [GC (Allocation Failure)  1624888K->989115K(2468864K), 0.1602900 secs]
SUREFIRE-859: [GC (Allocation Failure)  1755850K->1078218K(2487296K), 0.4175798 secs]
SUREFIRE-859: [GC (Allocation Failure)  1845706K->1169677K(2481664K), 0.3767392 secs]
SUREFIRE-859: [GC (Allocation Failure)  1979661K->1351803K(2500608K), 0.4836165 secs]
SUREFIRE-859: [GC (Allocation Failure)  2160398K->1501403K(2536960K), 0.6614379 secs]
SUREFIRE-859: [Full GC (Ergonomics)  1501403K->637230K(2620416K), 1.7352419 secs]
SUREFIRE-859: [GC (Allocation Failure)  1495854K->784530K(2626560K), 0.2404493 secs]
SUREFIRE-859: [GC (Allocation Failure)  1643154K->992008K(2590720K), 0.5392735 secs]
SUREFIRE-859: [GC (Allocation Failure)  1819400K->1081980K(2614784K), 0.4293782 secs]
SUREFIRE-859: [GC (Allocation Failure)  1909372K->1195236K(2593792K), 0.4737226 secs]
SUREFIRE-859: [GC (Allocation Failure)  2031332K->1256363K(2608640K), 0.1714302 secs]
SUREFIRE-859: [GC (Allocation Failure)  2092459K->1389121K(2613760K), 0.2565270 secs]
SUREFIRE-859: [Full GC (Ergonomics)  1389121K->505643K(2613248K), 1.2892638 secs]
SUREFIRE-859: [GC (Allocation Failure)  1364267K->569873K(2621952K), 0.1669631 secs]
SUREFIRE-859: [GC (Allocation Failure)  1428442K->577375K(2634240K), 0.2464660 secs]
SUREFIRE-859: [GC (Allocation Failure)  1456991K->622755K(2637824K), 0.1659721 secs]
SUREFIRE-859: [GC (Allocation Failure)  1502371K->674583K(2627072K), 0.1991618 secs]
SUREFIRE-859: [GC (Allocation Failure)  1565463K->678403K(2633728K), 0.1655489 secs]
SUREFIRE-859: [GC (Allocation Failure)  1569283K->750412K(2626560K), 0.2359598 secs]
SUREFIRE-859: [GC (Allocation Failure)  1667916K->833737K(2643456K), 0.2070974 secs]
SUREFIRE-859: [GC (Allocation Failure)  1751241K->923597K(2646016K), 0.2852447 secs]
SUREFIRE-859: [GC (Allocation Failure)  1882061K->1014814K(2664448K), 0.4211417 secs]
SUREFIRE-859: [GC (Allocation Failure)  1973278K->1247585K(2553344K), 0.5631389 secs]
SUREFIRE-859: [GC (Allocation Failure)  2105697K->1359162K(2629632K), 0.5356757 secs]
SUREFIRE-859: [GC (Allocation Failure)  2217227K->1445069K(2615296K), 0.5759283 secs]
SUREFIRE-859: [Full GC (Ergonomics)  1445069K->340717K(2566656K), 0.9686867 secs]
SUREFIRE-859: [GC (Allocation Failure)  1211117K->379425K(2579968K), 0.1624974 secs]
SUREFIRE-859: [GC (Allocation Failure)  1249825K->392891K(2578944K), 0.1079281 secs]
SUREFIRE-859: [GC (Allocation Failure)  1282747K->383781K(2589184K), 0.1282779 secs]
SUREFIRE-859: [GC (Allocation Failure)  1273637K->392305K(2588672K), 0.1645331 secs]
SUREFIRE-859: [GC (Allocation Failure)  1301105K->384061K(2598400K), 0.1601119 secs]
SUREFIRE-859: [GC (Allocation Failure)  1292861K->393765K(2596864K), 0.0855491 secs]
SUREFIRE-859: [GC (Allocation Failure)  1322533K->398676K(2607616K), 0.1307405 secs]
SUREFIRE-859: [GC (Allocation Failure)  1327444K->398138K(2605056K), 0.1411825 secs]
SUREFIRE-859: [GC (Allocation Failure)  1352506K->784542K(2616320K), 0.2677429 secs]
SUREFIRE-859: [GC (Allocation Failure)  1738909K->934125K(2287616K), 0.2621378 secs]
SUREFIRE-859: [GC (Allocation Failure)  1534189K->936314K(2451968K), 0.1109637 secs]
SUREFIRE-859: [GC (Allocation Failure)  1536378K->951093K(2409472K), 0.1485234 secs]
SUREFIRE-859: [GC (Allocation Failure)  1573173K->963630K(2441728K), 0.1036136 secs]
SUREFIRE-859: [GC (Allocation Failure)  1585710K->967980K(2451456K), 0.1454412 secs]
SUREFIRE-859: [GC (Allocation Failure)  1645356K->987850K(2472448K), 0.1575594 secs]
SUREFIRE-859: [GC (Allocation Failure)  1665226K->1012761K(2454528K), 0.1802473 secs]
SUREFIRE-859: [GC (Allocation Failure)  1737241K->1005198K(2483200K), 0.1058118 secs]
SUREFIRE-859: [GC (Allocation Failure)  1729678K->1013307K(2484736K), 0.1224094 secs]
SUREFIRE-859: [GC (Allocation Failure)  1791035K->1015027K(2500608K), 0.1177020 secs]
SUREFIRE-859: [GC (Allocation Failure)  1792755K->1011174K(2511872K), 0.1040997 secs]
SUREFIRE-859: [GC (Allocation Failure)  1846758K->1017000K(2526720K), 0.2063995 secs]
SUREFIRE-859: [GC (Allocation Failure)  1852584K->1014565K(2559488K), 0.1926234 secs]
SUREFIRE-859: [GC (Allocation Failure)  1919781K->1018915K(2568192K), 0.2015987 secs]
SUREFIRE-859: [GC (Allocation Failure)  1924131K->1019727K(2612224K), 0.1277304 secs]
SUREFIRE-859: [GC (Allocation Failure)  2005327K->1017761K(2623488K), 0.0925445 secs]
SUREFIRE-859: [GC (Allocation Failure)  2003361K->1023599K(2643968K), 0.1193864 secs]
SUREFIRE-859: [GC (Allocation Failure)  2062447K->1024175K(2655232K), 0.1726651 secs]
SUREFIRE-859: [GC (Allocation Failure)  2063023K->1024829K(2668544K), 0.1415143 secs]
SUREFIRE-859: [GC (Allocation Failure)  2104637K->1017606K(2679296K), 0.0814900 secs]
SUREFIRE-859: [GC (Allocation Failure)  2097414K->1023850K(2689024K), 0.1442286 secs]
SUREFIRE-859: [GC (Allocation Failure)  2135402K->1022139K(2698752K), 0.1563612 secs]
SUREFIRE-859: [GC (Allocation Failure)  2133691K->1032504K(2708992K), 0.1543610 secs]
SUREFIRE-859: [GC (Allocation Failure)  2162488K->1035677K(2713088K), 0.1472006 secs]
SUREFIRE-859: [GC (Allocation Failure)  2165661K->1037519K(2712576K), 0.0855225 secs]
SUREFIRE-859: [GC (Allocation Failure)  2179279K->1037928K(2716672K), 0.1233646 secs]
SUREFIRE-859: [GC (Allocation Failure)  2179688K->1038508K(2720768K), 0.1691974 secs]
SUREFIRE-859: [GC (Allocation Failure)  2196652K->1039289K(2724864K), 0.1182654 secs]
SUREFIRE-859: [GC (Allocation Failure)  2197433K->1037050K(2730496K), 0.1130264 secs]
SUREFIRE-859: [GC (Allocation Failure)  2211066K->1034002K(2734080K), 0.1126541 secs]
SUREFIRE-859: [GC (Allocation Failure)  2208018K->1039775K(2735616K), 0.1559646 secs]
SUREFIRE-859: [GC (Allocation Failure)  2226079K->1045296K(2740224K), 0.1868680 secs]
SUREFIRE-859: [GC (Allocation Failure)  2231600K->1046420K(2741760K), 0.1279749 secs]
SUREFIRE-859: [GC (Allocation Failure)  2247060K->1047291K(2745856K), 0.0980979 secs]
SUREFIRE-859: [GC (Allocation Failure)  2247931K->1046775K(2751488K), 0.0979473 secs]
SUREFIRE-859: [GC (Allocation Failure)  2264311K->1049042K(2755072K), 0.1470674 secs]

Results :

Tests run: 0, Failures: 0, Errors: 0, Skipped: 0

[WARNING] File encoding has not been set, using platform encoding ISO-8859-1, i.e. build is
platform dependent! The file encoding for reports output files should be provided by the POM
property ${project.reporting.outputEncoding}.
[INFO] 
[INFO] --- maven-failsafe-plugin:2.18.1:verify (verify) @ hbase-it ---
[INFO] Failsafe report directory: <https://builds.apache.org/job/HBase-1.3-IT/it.test=IntegrationTestBigLinkedList,jdk=latest1.8,label=yahoo-not-h2/ws/hbase-it/target/failsafe-reports>
[WARNING] File encoding has not been set, using platform encoding ISO-8859-1, i.e. build is
platform dependent! The file encoding for reports output files should be provided by the POM
property ${project.reporting.outputEncoding}.
[INFO] ------------------------------------------------------------------------
[INFO] Reactor Summary:
[INFO] 
[INFO] Apache HBase ...................................... SUCCESS [8.442s]
[INFO] Apache HBase - Checkstyle ......................... SUCCESS [4.098s]
[INFO] Apache HBase - Resource Bundle .................... SUCCESS [0.647s]
[INFO] Apache HBase - Annotations ........................ SUCCESS [3.025s]
[INFO] Apache HBase - Protocol ........................... SUCCESS [31.543s]
[INFO] Apache HBase - Common ............................. SUCCESS [18.106s]
[INFO] Apache HBase - Procedure .......................... SUCCESS [3.841s]
[INFO] Apache HBase - Client ............................. SUCCESS [13.569s]
[INFO] Apache HBase - Hadoop Compatibility ............... SUCCESS [0.886s]
[INFO] Apache HBase - Hadoop Two Compatibility ........... SUCCESS [2.888s]
[INFO] Apache HBase - Prefix Tree ........................ SUCCESS [2.934s]
[INFO] Apache HBase - Server ............................. SUCCESS [1:05.530s]
[INFO] Apache HBase - Testing Util ....................... SUCCESS [2.443s]
[INFO] Apache HBase - Thrift ............................. SUCCESS [11.036s]
[INFO] Apache HBase - Rest ............................... SUCCESS [5.651s]
[INFO] Apache HBase - Shell .............................. SUCCESS [1.766s]
[INFO] Apache HBase - Integration Tests .................. FAILURE [30:05.890s]
[INFO] Apache HBase - Examples ........................... SKIPPED
[INFO] Apache HBase - External Block Cache ............... SKIPPED
[INFO] Apache HBase - Assembly ........................... SKIPPED
[INFO] Apache HBase - Shaded ............................. SKIPPED
[INFO] Apache HBase - Shaded - Client .................... SKIPPED
[INFO] Apache HBase - Shaded - Server .................... SKIPPED
[INFO] ------------------------------------------------------------------------
[INFO] BUILD FAILURE
[INFO] ------------------------------------------------------------------------
[INFO] Total time: 33:06.308s
[INFO] Finished at: Thu Mar 17 08:23:52 UTC 2016
[INFO] Final Memory: 188M/3843M
[INFO] ------------------------------------------------------------------------
[ERROR] Failed to execute goal org.apache.maven.plugins:maven-failsafe-plugin:2.18.1:verify
(verify) on project hbase-it: There was a timeout or other error in the fork -> [Help 1]
[ERROR] 
[ERROR] To see the full stack trace of the errors, re-run Maven with the -e switch.
[ERROR] Re-run Maven using the -X switch to enable full debug logging.
[ERROR] 
[ERROR] For more information about the errors and possible solutions, please read the following
articles:
[ERROR] [Help 1] http://cwiki.apache.org/confluence/display/MAVEN/MojoFailureException
[ERROR] 
[ERROR] After correcting the problems, you can resume the build with the command
[ERROR]   mvn <goals> -rf :hbase-it
Build step 'Invoke top-level Maven targets' marked build as failure
Performing Post build task...
Match found for :.* : True
Logical operation result is TRUE
Running script  : # Post-build task script. TODO: Check this in and have all builds reference
check-in.
pwd && ls
# NOTE!!!! The below code has been copied and pasted from ./dev-tools/run-test.sh
# Do not change here without syncing there and vice-versa.
ZOMBIE_TESTS_COUNT=`jps -v | grep surefirebooter | grep -e '-Dhbase.test' | wc -l`
if [[ $ZOMBIE_TESTS_COUNT != 0 ]] ; then
 echo "Suspicious java process found - waiting 30s to see if there are just slow to stop"
 sleep 30
 ZOMBIE_TESTS_COUNT=`jps -v | grep surefirebooter | grep -e '-Dhbase.test' | wc -l`
 if [[ $ZOMBIE_TESTS_COUNT != 0 ]] ; then
   echo " {color:red}There appear to be $ZOMBIE_TESTS_COUNT zombie tests{color}, they should
have been killed by surefire but survived"
   jps -v | grep surefirebooter | grep -e '-Dhbase.test'
   jps -v | grep surefirebooter | grep -e '-Dhbase.test' | cut -d ' ' -f 1 | xargs -n 1 jstack
   # Exit with error
   exit 1
 else
   echo "We're ok: there is no zombie test, but some tests took some time to stop"
 fi
else
  echo "We're ok: there is no zombie test"
fi
[yahoo-not-h2] $ /bin/bash -xe /tmp/hudson7149458616455233808.sh
+ pwd
<https://builds.apache.org/job/HBase-1.3-IT/it.test=IntegrationTestBigLinkedList,jdk=latest1.8,label=yahoo-not-h2/ws/>
+ ls
bin
CHANGES.txt
conf
dev-support
hbase-annotations
hbase-assembly
hbase-checkstyle
hbase-client
hbase-common
hbase-examples
hbase-external-blockcache
hbase-hadoop2-compat
hbase-hadoop-compat
hbase-it
hbase-native-client
hbase-prefix-tree
hbase-procedure
hbase-protocol
hbase-resource-bundle
hbase-rest
hbase-server
hbase-shaded
hbase-shell
hbase-testing-util
hbase-thrift
LICENSE.txt
NOTICE.txt
pom.xml
README.txt
src
target
++ wc -l
++ jps -v
++ grep -e -Dhbase.test
++ grep surefirebooter
+ ZOMBIE_TESTS_COUNT=0
+ [[ 0 != 0 ]]
+ echo 'We'\''re ok: there is no zombie test'
We're ok: there is no zombie test
POST BUILD TASK : SUCCESS
END OF POST BUILD TASK : 0
Archiving artifacts

Mime
View raw message