hbase-builds mailing list archives

Site index · List index
Message view « Date » · « Thread »
Top « Date » · « Thread »
From Apache Jenkins Server <jenk...@builds.apache.org>
Subject Build failed in Jenkins: HBase-1.3-IT » IntegrationTestBigLinkedList,latest1.8,yahoo-not-h2 #586
Date Tue, 29 Mar 2016 10:48:09 GMT
See <https://builds.apache.org/job/HBase-1.3-IT/it.test=IntegrationTestBigLinkedList,jdk=latest1.8,label=yahoo-not-h2/586/changes>

Changes:

[chenheng] HBASE-15384 Avoid using '/tmp' directory in TestBulkLoad

------------------------------------------
[...truncated 50117 lines...]
     bool UseGCOverheadLimit                        = true                               
{product}
     bool UseGCTaskAffinity                         = false                              
{product}
     bool UseHeavyMonitors                          = false                              
{product}
     bool UseHugeTLBFS                              = false                              
{product}
     bool UseInlineCaches                           = true                               
{product}
     bool UseInterpreter                            = true                               
{product}
     bool UseJumpTables                             = true                               
{C2 product}
     bool UseLWPSynchronization                     = true                               
{product}
     bool UseLargePages                             = false                              
{pd product}
     bool UseLargePagesInMetaspace                  = false                              
{product}
     bool UseLargePagesIndividualAllocation         = false                              
{pd product}
     bool UseLinuxPosixThreadCPUClocks              = true                               
{product}
     bool UseLockedTracing                          = false                              
{product}
     bool UseLoopCounter                            = true                               
{product}
     bool UseLoopInvariantCodeMotion                = true                               
{C1 product}
     bool UseLoopPredicate                          = true                               
{C2 product}
     bool UseMathExactIntrinsics                    = true                               
{C2 product}
     bool UseMaximumCompactionOnSystemGC            = true                               
{product}
     bool UseMembar                                 = false                              
{pd product}
     bool UseMultiplyToLenIntrinsic                 = true                               
{C2 product}
     bool UseNUMA                                   = false                              
{product}
     bool UseNUMAInterleaving                       = false                              
{product}
     bool UseNewLongLShift                          = false                              
{ARCH product}
     bool UseOSErrorReporting                       = false                              
{pd product}
     bool UseOldInlining                            = true                               
{C2 product}
     bool UseOnStackReplacement                     = true                               
{pd product}
     bool UseOnlyInlinedBimorphic                   = true                               
{C2 product}
     bool UseOprofile                               = false                              
{product}
     bool UseOptoBiasInlining                       = true                               
{C2 product}
     bool UsePSAdaptiveSurvivorSizePolicy           = true                               
{product}
     bool UseParNewGC                               = false                              
{product}
     bool UseParallelGC                            := true                               
{product}
     bool UseParallelOldGC                          = true                               
{product}
     bool UsePerfData                               = true                               
{product}
     bool UsePopCountInstruction                    = true                               
{product}
     bool UseRDPCForConstantTableBase               = false                              
{C2 product}
     bool UseRTMDeopt                               = false                              
{ARCH product}
     bool UseRTMLocking                             = false                              
{ARCH product}
     bool UseSHA                                    = false                              
{product}
     bool UseSHA1Intrinsics                         = false                              
{product}
     bool UseSHA256Intrinsics                       = false                              
{product}
     bool UseSHA512Intrinsics                       = false                              
{product}
     bool UseSHM                                    = false                              
{product}
     intx UseSSE                                    = 4                                  
{product}
     bool UseSSE42Intrinsics                        = true                               
{product}
     bool UseSerialGC                               = false                              
{product}
     bool UseSharedSpaces                           = false                              
{product}
     bool UseSignalChaining                         = true                               
{product}
     bool UseStoreImmI16                            = false                              
{ARCH product}
     bool UseStringDeduplication                    = false                              
{product}
     bool UseSuperWord                              = true                               
{C2 product}
     bool UseTLAB                                   = true                               
{pd product}
     bool UseThreadPriorities                       = true                               
{pd product}
     bool UseTransparentHugePages                   = false                              
{product}
     bool UseTypeProfile                            = true                               
{product}
     bool UseTypeSpeculation                        = true                               
{C2 product}
     bool UseUnalignedLoadStores                    = true                               
{ARCH product}
     bool UseVMInterruptibleIO                      = false                              
{product}
     bool UseXMMForArrayCopy                        = true                               
{product}
     bool UseXmmI2D                                 = false                              
{ARCH product}
     bool UseXmmI2F                                 = false                              
{ARCH product}
     bool UseXmmLoadAndClearUpper                   = true                               
{ARCH product}
     bool UseXmmRegToRegMoveAll                     = true                               
{ARCH product}
     bool VMThreadHintNoPreempt                     = false                              
{product}
     intx VMThreadPriority                          = -1                                 
{product}
     intx VMThreadStackSize                         = 1024                               
{pd product}
     intx ValueMapInitialSize                       = 11                                 
{C1 product}
     intx ValueMapMaxLoopSize                       = 8                                  
{C1 product}
     intx ValueSearchLimit                          = 1000                               
{C2 product}
     bool VerifyMergedCPBytecodes                   = true                               
{product}
     bool VerifySharedSpaces                        = false                              
{product}
     intx WorkAroundNPTLTimedWaitHang               = 1                                  
{product}
    uintx YoungGenerationSizeIncrement              = 20                                 
{product}
    uintx YoungGenerationSizeSupplement             = 80                                 
{product}
    uintx YoungGenerationSizeSupplementDecay        = 8                                  
{product}
    uintx YoungPLABSize                             = 4096                               
{product}
     bool ZeroTLAB                                  = false                              
{product}
     intx hashCode                                  = 5                                  
{product}
Running org.apache.hadoop.hbase.test.IntegrationTestBigLinkedList
SUREFIRE-859: [GC (Allocation Failure)  60928K->6594K(231936K), 0.0152745 secs]
SUREFIRE-859: [GC (Allocation Failure)  90162K->41792K(292864K), 0.0256964 secs]
SUREFIRE-859: [GC (Metadata GC Threshold)  102074K->41430K(292864K), 0.0320053 secs]
SUREFIRE-859: [Full GC (Metadata GC Threshold)  41430K->8835K(232960K), 0.0609559 secs]
SUREFIRE-859: [GC (Allocation Failure)  130691K->70014K(317440K), 0.1044442 secs]
SUREFIRE-859: [Full GC (Ergonomics)  70014K->66437K(468480K), 0.1392325 secs]
SUREFIRE-859: [GC (Allocation Failure)  272773K->105728K(505856K), 0.1179413 secs]
Tests run: 1, Failures: 0, Errors: 1, Skipped: 0, Time elapsed: 7.171 sec <<< FAILURE!
- in org.apache.hadoop.hbase.test.IntegrationTestBigLinkedList
testContinuousIngest(org.apache.hadoop.hbase.test.IntegrationTestBigLinkedList)  Time elapsed:
7.057 sec  <<< ERROR!
java.io.IOException: Shutting down
	at sun.nio.ch.Net.bind0(Native Method)
	at sun.nio.ch.Net.bind(Net.java:433)
	at sun.nio.ch.Net.bind(Net.java:425)
	at sun.nio.ch.ServerSocketChannelImpl.bind(ServerSocketChannelImpl.java:223)
	at sun.nio.ch.ServerSocketAdaptor.bind(ServerSocketAdaptor.java:74)
	at org.apache.hadoop.hbase.ipc.RpcServer.bind(RpcServer.java:2644)
	at org.apache.hadoop.hbase.ipc.RpcServer$Listener.<init>(RpcServer.java:618)
	at org.apache.hadoop.hbase.ipc.RpcServer.<init>(RpcServer.java:2087)
	at org.apache.hadoop.hbase.regionserver.RSRpcServices.<init>(RSRpcServices.java:961)
	at org.apache.hadoop.hbase.master.MasterRpcServices.<init>(MasterRpcServices.java:232)
	at org.apache.hadoop.hbase.master.HMaster.createRpcServices(HMaster.java:531)
	at org.apache.hadoop.hbase.regionserver.HRegionServer.<init>(HRegionServer.java:544)
	at org.apache.hadoop.hbase.master.HMaster.<init>(HMaster.java:378)
	at sun.reflect.NativeConstructorAccessorImpl.newInstance0(Native Method)
	at sun.reflect.NativeConstructorAccessorImpl.newInstance(NativeConstructorAccessorImpl.java:62)
	at sun.reflect.DelegatingConstructorAccessorImpl.newInstance(DelegatingConstructorAccessorImpl.java:45)
	at java.lang.reflect.Constructor.newInstance(Constructor.java:423)
	at org.apache.hadoop.hbase.util.JVMClusterUtil.createMasterThread(JVMClusterUtil.java:140)
	at org.apache.hadoop.hbase.LocalHBaseCluster.addMaster(LocalHBaseCluster.java:219)
	at org.apache.hadoop.hbase.LocalHBaseCluster.<init>(LocalHBaseCluster.java:155)
	at org.apache.hadoop.hbase.MiniHBaseCluster.init(MiniHBaseCluster.java:213)
	at org.apache.hadoop.hbase.MiniHBaseCluster.<init>(MiniHBaseCluster.java:93)
	at org.apache.hadoop.hbase.HBaseTestingUtility.startMiniHBaseCluster(HBaseTestingUtility.java:1066)
	at org.apache.hadoop.hbase.HBaseTestingUtility.startMiniCluster(HBaseTestingUtility.java:1026)
	at org.apache.hadoop.hbase.HBaseTestingUtility.startMiniCluster(HBaseTestingUtility.java:898)
	at org.apache.hadoop.hbase.HBaseTestingUtility.startMiniCluster(HBaseTestingUtility.java:880)
	at org.apache.hadoop.hbase.HBaseTestingUtility.startMiniCluster(HBaseTestingUtility.java:867)
	at org.apache.hadoop.hbase.IntegrationTestingUtility.initializeCluster(IntegrationTestingUtility.java:78)
	at org.apache.hadoop.hbase.test.IntegrationTestBigLinkedList.setUpCluster(IntegrationTestBigLinkedList.java:1550)


Results :

Tests in error: 
  IntegrationTestBigLinkedList>IntegrationTestBase.setUp:133->setUpCluster:1550 » IO

Tests run: 1, Failures: 0, Errors: 1, Skipped: 0

[WARNING] File encoding has not been set, using platform encoding UTF-8, i.e. build is platform
dependent! The file encoding for reports output files should be provided by the POM property
${project.reporting.outputEncoding}.
[INFO] 
[INFO] --- maven-failsafe-plugin:2.18.1:verify (verify) @ hbase-it ---
[INFO] Failsafe report directory: <https://builds.apache.org/job/HBase-1.3-IT/it.test=IntegrationTestBigLinkedList,jdk=latest1.8,label=yahoo-not-h2/ws/hbase-it/target/failsafe-reports>
[WARNING] File encoding has not been set, using platform encoding UTF-8, i.e. build is platform
dependent! The file encoding for reports output files should be provided by the POM property
${project.reporting.outputEncoding}.
[INFO] ------------------------------------------------------------------------
[INFO] Reactor Summary:
[INFO] 
[INFO] Apache HBase ...................................... SUCCESS [1:34.467s]
[INFO] Apache HBase - Checkstyle ......................... SUCCESS [6.582s]
[INFO] Apache HBase - Resource Bundle .................... SUCCESS [0.267s]
[INFO] Apache HBase - Annotations ........................ SUCCESS [1.340s]
[INFO] Apache HBase - Protocol ........................... SUCCESS [24.653s]
[INFO] Apache HBase - Common ............................. SUCCESS [1:21.558s]
[INFO] Apache HBase - Procedure .......................... SUCCESS [1.409s]
[INFO] Apache HBase - Client ............................. SUCCESS [10.895s]
[INFO] Apache HBase - Hadoop Compatibility ............... SUCCESS [1.930s]
[INFO] Apache HBase - Hadoop Two Compatibility ........... SUCCESS [3.617s]
[INFO] Apache HBase - Prefix Tree ........................ SUCCESS [1.259s]
[INFO] Apache HBase - Server ............................. SUCCESS [1:44.014s]
[INFO] Apache HBase - Testing Util ....................... SUCCESS [2.148s]
[INFO] Apache HBase - Thrift ............................. SUCCESS [9.958s]
[INFO] Apache HBase - Rest ............................... SUCCESS [3.831s]
[INFO] Apache HBase - Shell .............................. SUCCESS [5.856s]
[INFO] Apache HBase - Integration Tests .................. FAILURE [11.558s]
[INFO] Apache HBase - Examples ........................... SKIPPED
[INFO] Apache HBase - External Block Cache ............... SKIPPED
[INFO] Apache HBase - Assembly ........................... SKIPPED
[INFO] Apache HBase - Shaded ............................. SKIPPED
[INFO] Apache HBase - Shaded - Client .................... SKIPPED
[INFO] Apache HBase - Shaded - Server .................... SKIPPED
[INFO] ------------------------------------------------------------------------
[INFO] BUILD FAILURE
[INFO] ------------------------------------------------------------------------
[INFO] Total time: 6:40.842s
[INFO] Finished at: Tue Mar 29 10:48:07 UTC 2016
[INFO] Final Memory: 151M/1442M
[INFO] ------------------------------------------------------------------------
[ERROR] Failed to execute goal org.apache.maven.plugins:maven-failsafe-plugin:2.18.1:verify
(verify) on project hbase-it: There are test failures.
[ERROR] 
[ERROR] Please refer to <https://builds.apache.org/job/HBase-1.3-IT/it.test=IntegrationTestBigLinkedList,jdk=latest1.8,label=yahoo-not-h2/ws/hbase-it/target/failsafe-reports>
for the individual test results.
[ERROR] -> [Help 1]
[ERROR] 
[ERROR] To see the full stack trace of the errors, re-run Maven with the -e switch.
[ERROR] Re-run Maven using the -X switch to enable full debug logging.
[ERROR] 
[ERROR] For more information about the errors and possible solutions, please read the following
articles:
[ERROR] [Help 1] http://cwiki.apache.org/confluence/display/MAVEN/MojoFailureException
[ERROR] 
[ERROR] After correcting the problems, you can resume the build with the command
[ERROR]   mvn <goals> -rf :hbase-it
Build step 'Invoke top-level Maven targets' marked build as failure
Performing Post build task...
Match found for :.* : True
Logical operation result is TRUE
Running script  : # Post-build task script. TODO: Check this in and have all builds reference
check-in.
pwd && ls
# NOTE!!!! The below code has been copied and pasted from ./dev-tools/run-test.sh
# Do not change here without syncing there and vice-versa.
ZOMBIE_TESTS_COUNT=`jps -v | grep surefirebooter | grep -e '-Dhbase.test' | wc -l`
if [[ $ZOMBIE_TESTS_COUNT != 0 ]] ; then
 echo "Suspicious java process found - waiting 30s to see if there are just slow to stop"
 sleep 30
 ZOMBIE_TESTS_COUNT=`jps -v | grep surefirebooter | grep -e '-Dhbase.test' | wc -l`
 if [[ $ZOMBIE_TESTS_COUNT != 0 ]] ; then
   echo " {color:red}There appear to be $ZOMBIE_TESTS_COUNT zombie tests{color}, they should
have been killed by surefire but survived"
   jps -v | grep surefirebooter | grep -e '-Dhbase.test'
   jps -v | grep surefirebooter | grep -e '-Dhbase.test' | cut -d ' ' -f 1 | xargs -n 1 jstack
   # Exit with error
   exit 1
 else
   echo "We're ok: there is no zombie test, but some tests took some time to stop"
 fi
else
  echo "We're ok: there is no zombie test"
fi
[yahoo-not-h2] $ /bin/bash -xe /tmp/hudson4155861554989363567.sh
+ pwd
<https://builds.apache.org/job/HBase-1.3-IT/it.test=IntegrationTestBigLinkedList,jdk=latest1.8,label=yahoo-not-h2/ws/>
+ ls
bin
CHANGES.txt
conf
dev-support
hbase-annotations
hbase-assembly
hbase-checkstyle
hbase-client
hbase-common
hbase-examples
hbase-external-blockcache
hbase-hadoop2-compat
hbase-hadoop-compat
hbase-it
hbase-native-client
hbase-prefix-tree
hbase-procedure
hbase-protocol
hbase-resource-bundle
hbase-rest
hbase-server
hbase-shaded
hbase-shell
hbase-testing-util
hbase-thrift
LICENSE.txt
NOTICE.txt
pom.xml
README.txt
src
target
++ jps -v
++ grep surefirebooter
++ grep -e -Dhbase.test
++ wc -l
+ ZOMBIE_TESTS_COUNT=0
+ [[ 0 != 0 ]]
+ echo 'We'\''re ok: there is no zombie test'
We're ok: there is no zombie test
POST BUILD TASK : SUCCESS
END OF POST BUILD TASK : 0
Archiving artifacts

Mime
View raw message