hbase-builds mailing list archives

Site index · List index
Message view « Date » · « Thread »
Top « Date » · « Thread »
From Apache Jenkins Server <jenk...@builds.apache.org>
Subject Build failed in Jenkins: HBase-0.98-matrix » latest1.6,yahoo-not-h2 #320
Date Tue, 29 Mar 2016 13:04:55 GMT
See <https://builds.apache.org/job/HBase-0.98-matrix/jdk=latest1.6,label=yahoo-not-h2/320/changes>

Changes:

[apurtell] Update version to 0.98.19-SNAPSHOT

------------------------------------------
[...truncated 37419 lines...]
Running org.apache.hadoop.hbase.regionserver.TestSplitTransaction
Tests run: 8, Failures: 0, Errors: 0, Skipped: 0, Time elapsed: 5.634 sec - in org.apache.hadoop.hbase.regionserver.TestSplitTransaction
Running org.apache.hadoop.hbase.regionserver.TestWideScanner
Tests run: 1, Failures: 0, Errors: 0, Skipped: 0, Time elapsed: 2.338 sec - in org.apache.hadoop.hbase.regionserver.TestWideScanner
Running org.apache.hadoop.hbase.regionserver.TestExplicitColumnTracker
Tests run: 4, Failures: 0, Errors: 0, Skipped: 0, Time elapsed: 0.598 sec - in org.apache.hadoop.hbase.regionserver.TestExplicitColumnTracker
Running org.apache.hadoop.hbase.regionserver.TestHRegionFileSystem
Tests run: 3, Failures: 0, Errors: 0, Skipped: 0, Time elapsed: 18.692 sec - in org.apache.hadoop.hbase.regionserver.TestHRegionFileSystem
Running org.apache.hadoop.hbase.regionserver.TestStoreFile
Tests run: 12, Failures: 0, Errors: 0, Skipped: 0, Time elapsed: 1.483 sec - in org.apache.hadoop.hbase.regionserver.TestStoreFile
Running org.apache.hadoop.hbase.regionserver.TestRegionSplitPolicy
Tests run: 7, Failures: 0, Errors: 0, Skipped: 0, Time elapsed: 1.028 sec - in org.apache.hadoop.hbase.regionserver.TestRegionSplitPolicy
Running org.apache.hadoop.hbase.regionserver.TestServerNonceManager
Tests run: 6, Failures: 0, Errors: 0, Skipped: 0, Time elapsed: 1.548 sec - in org.apache.hadoop.hbase.regionserver.TestServerNonceManager
Running org.apache.hadoop.hbase.regionserver.compactions.TestOffPeakHours
Tests run: 3, Failures: 0, Errors: 0, Skipped: 0, Time elapsed: 0.101 sec - in org.apache.hadoop.hbase.regionserver.compactions.TestOffPeakHours
Running org.apache.hadoop.hbase.regionserver.compactions.TestDateTieredCompactor
Tests run: 4, Failures: 0, Errors: 0, Skipped: 0, Time elapsed: 0.942 sec - in org.apache.hadoop.hbase.regionserver.compactions.TestDateTieredCompactor
Running org.apache.hadoop.hbase.regionserver.compactions.TestStripeCompactor
Tests run: 3, Failures: 0, Errors: 0, Skipped: 0, Time elapsed: 1.179 sec - in org.apache.hadoop.hbase.regionserver.compactions.TestStripeCompactor
Running org.apache.hadoop.hbase.regionserver.compactions.TestStripeCompactionPolicy
Tests run: 30, Failures: 0, Errors: 0, Skipped: 0, Time elapsed: 2.125 sec - in org.apache.hadoop.hbase.regionserver.compactions.TestStripeCompactionPolicy
Running org.apache.hadoop.hbase.regionserver.TestScanDeleteTracker
Tests run: 8, Failures: 0, Errors: 0, Skipped: 0, Time elapsed: 0.166 sec - in org.apache.hadoop.hbase.regionserver.TestScanDeleteTracker
Running org.apache.hadoop.hbase.regionserver.TestResettingCounters
Tests run: 1, Failures: 0, Errors: 0, Skipped: 0, Time elapsed: 1.612 sec - in org.apache.hadoop.hbase.regionserver.TestResettingCounters
Running org.apache.hadoop.hbase.regionserver.TestMemStoreChunkPool
Tests run: 3, Failures: 0, Errors: 0, Skipped: 0, Time elapsed: 0.306 sec - in org.apache.hadoop.hbase.regionserver.TestMemStoreChunkPool
Running org.apache.hadoop.hbase.regionserver.TestKeyValueScanFixture
Tests run: 1, Failures: 0, Errors: 0, Skipped: 0, Time elapsed: 0.31 sec - in org.apache.hadoop.hbase.regionserver.TestKeyValueScanFixture
Running org.apache.hadoop.hbase.regionserver.TestScanWithBloomError
Tests run: 3, Failures: 0, Errors: 0, Skipped: 0, Time elapsed: 1.485 sec - in org.apache.hadoop.hbase.regionserver.TestScanWithBloomError
Running org.apache.hadoop.hbase.regionserver.TestKeyValueSkipListSet
Tests run: 4, Failures: 0, Errors: 0, Skipped: 0, Time elapsed: 0.217 sec - in org.apache.hadoop.hbase.regionserver.TestKeyValueSkipListSet
Running org.apache.hadoop.hbase.regionserver.TestKeepDeletes
Tests run: 12, Failures: 0, Errors: 0, Skipped: 0, Time elapsed: 2.611 sec - in org.apache.hadoop.hbase.regionserver.TestKeepDeletes
Running org.apache.hadoop.hbase.regionserver.TestMinVersions
Tests run: 6, Failures: 0, Errors: 0, Skipped: 0, Time elapsed: 1.85 sec - in org.apache.hadoop.hbase.regionserver.TestMinVersions
Running org.apache.hadoop.hbase.regionserver.TestQueryMatcher
Tests run: 5, Failures: 0, Errors: 0, Skipped: 0, Time elapsed: 0.186 sec - in org.apache.hadoop.hbase.regionserver.TestQueryMatcher
Running org.apache.hadoop.hbase.TestCheckTestClasses
Tests run: 1, Failures: 0, Errors: 0, Skipped: 0, Time elapsed: 1.896 sec - in org.apache.hadoop.hbase.TestCheckTestClasses
Running org.apache.hadoop.hbase.snapshot.TestRestoreSnapshotHelper
Tests run: 2, Failures: 0, Errors: 0, Skipped: 0, Time elapsed: 2.157 sec - in org.apache.hadoop.hbase.snapshot.TestRestoreSnapshotHelper
Running org.apache.hadoop.hbase.snapshot.TestSnapshotManifest
Tests run: 1, Failures: 0, Errors: 0, Skipped: 0, Time elapsed: 7.359 sec - in org.apache.hadoop.hbase.snapshot.TestSnapshotManifest
Running org.apache.hadoop.hbase.TestHTableDescriptor
Tests run: 13, Failures: 0, Errors: 0, Skipped: 0, Time elapsed: 0.863 sec - in org.apache.hadoop.hbase.TestHTableDescriptor
Running org.apache.hadoop.hbase.constraint.TestConstraints
Tests run: 6, Failures: 0, Errors: 0, Skipped: 0, Time elapsed: 0.963 sec - in org.apache.hadoop.hbase.constraint.TestConstraints
Running org.apache.hadoop.hbase.coprocessor.TestCoprocessorInterface
Tests run: 2, Failures: 0, Errors: 0, Skipped: 0, Time elapsed: 4.443 sec - in org.apache.hadoop.hbase.coprocessor.TestCoprocessorInterface
Running org.apache.hadoop.hbase.coprocessor.TestCoprocessorConfiguration
Tests run: 5, Failures: 0, Errors: 0, Skipped: 0, Time elapsed: 0.454 sec - in org.apache.hadoop.hbase.coprocessor.TestCoprocessorConfiguration
Running org.apache.hadoop.hbase.coprocessor.TestRegionObserverStacking
Tests run: 1, Failures: 0, Errors: 0, Skipped: 0, Time elapsed: 0.993 sec - in org.apache.hadoop.hbase.coprocessor.TestRegionObserverStacking
Running org.apache.hadoop.hbase.coprocessor.TestCoprocessorHost
Tests run: 1, Failures: 0, Errors: 0, Skipped: 0, Time elapsed: 0.369 sec - in org.apache.hadoop.hbase.coprocessor.TestCoprocessorHost
Running org.apache.hadoop.hbase.TestServerLoad
Tests run: 3, Failures: 0, Errors: 0, Skipped: 0, Time elapsed: 0.293 sec - in org.apache.hadoop.hbase.TestServerLoad
Running org.apache.hadoop.hbase.TestNodeHealthCheckChore
Tests run: 4, Failures: 0, Errors: 0, Skipped: 0, Time elapsed: 10.664 sec - in org.apache.hadoop.hbase.TestNodeHealthCheckChore
Running org.apache.hadoop.hbase.TestIPv6NIOServerSocketChannel
Tests run: 2, Failures: 0, Errors: 0, Skipped: 0, Time elapsed: 0.365 sec - in org.apache.hadoop.hbase.TestIPv6NIOServerSocketChannel
Running org.apache.hadoop.hbase.errorhandling.TestForeignExceptionDispatcher
Tests run: 3, Failures: 0, Errors: 0, Skipped: 0, Time elapsed: 0.341 sec - in org.apache.hadoop.hbase.errorhandling.TestForeignExceptionDispatcher
Running org.apache.hadoop.hbase.errorhandling.TestForeignExceptionSerialization
Tests run: 2, Failures: 0, Errors: 0, Skipped: 0, Time elapsed: 0.276 sec - in org.apache.hadoop.hbase.errorhandling.TestForeignExceptionSerialization
Running org.apache.hadoop.hbase.errorhandling.TestTimeoutExceptionInjector
Tests run: 4, Failures: 0, Errors: 0, Skipped: 0, Time elapsed: 0.371 sec - in org.apache.hadoop.hbase.errorhandling.TestTimeoutExceptionInjector
Running org.apache.hadoop.hbase.TestCompare
Tests run: 1, Failures: 0, Errors: 0, Skipped: 0, Time elapsed: 0.401 sec - in org.apache.hadoop.hbase.TestCompare
Running org.apache.hadoop.hbase.client.TestHBaseAdminNoCluster
Tests run: 1, Failures: 0, Errors: 0, Skipped: 0, Time elapsed: 1.635 sec - in org.apache.hadoop.hbase.client.TestHBaseAdminNoCluster
Running org.apache.hadoop.hbase.client.TestConnectionUtils
Tests run: 1, Failures: 0, Errors: 0, Skipped: 0, Time elapsed: 0.245 sec - in org.apache.hadoop.hbase.client.TestConnectionUtils
Running org.apache.hadoop.hbase.client.TestPutDeleteEtcCellIteration
Tests run: 6, Failures: 0, Errors: 0, Skipped: 0, Time elapsed: 0.35 sec - in org.apache.hadoop.hbase.client.TestPutDeleteEtcCellIteration
Running org.apache.hadoop.hbase.client.TestIntraRowPagination
Tests run: 1, Failures: 0, Errors: 0, Skipped: 0, Time elapsed: 1.26 sec - in org.apache.hadoop.hbase.client.TestIntraRowPagination
Running org.apache.hadoop.hbase.client.TestResult
Tests run: 9, Failures: 0, Errors: 0, Skipped: 0, Time elapsed: 0.383 sec - in org.apache.hadoop.hbase.client.TestResult
Running org.apache.hadoop.hbase.util.TestPoolMap$TestThreadLocalPoolType
Tests run: 3, Failures: 0, Errors: 0, Skipped: 0, Time elapsed: 0.266 sec - in org.apache.hadoop.hbase.util.TestPoolMap$TestThreadLocalPoolType
Running org.apache.hadoop.hbase.util.TestIncrementingEnvironmentEdge
Tests run: 1, Failures: 0, Errors: 0, Skipped: 0, Time elapsed: 0.258 sec - in org.apache.hadoop.hbase.util.TestIncrementingEnvironmentEdge
Running org.apache.hadoop.hbase.util.TestConfigurationUtil
Tests run: 2, Failures: 0, Errors: 0, Skipped: 0, Time elapsed: 0.357 sec - in org.apache.hadoop.hbase.util.TestConfigurationUtil
Running org.apache.hadoop.hbase.util.TestSortedList
Tests run: 4, Failures: 0, Errors: 0, Skipped: 0, Time elapsed: 0.342 sec - in org.apache.hadoop.hbase.util.TestSortedList
Running org.apache.hadoop.hbase.util.TestCompressionTest
Tests run: 2, Failures: 0, Errors: 0, Skipped: 0, Time elapsed: 0.38 sec - in org.apache.hadoop.hbase.util.TestCompressionTest
Running org.apache.hadoop.hbase.util.TestRegionSizeCalculator
Tests run: 3, Failures: 0, Errors: 0, Skipped: 0, Time elapsed: 0.602 sec - in org.apache.hadoop.hbase.util.TestRegionSizeCalculator
Running org.apache.hadoop.hbase.util.TestRootPath
Tests run: 1, Failures: 0, Errors: 0, Skipped: 0, Time elapsed: 0.19 sec - in org.apache.hadoop.hbase.util.TestRootPath
Running org.apache.hadoop.hbase.util.TestByteBloomFilter
Tests run: 5, Failures: 0, Errors: 0, Skipped: 0, Time elapsed: 0.922 sec - in org.apache.hadoop.hbase.util.TestByteBloomFilter
Running org.apache.hadoop.hbase.util.TestBoundedConcurrentLinkedQueue
Tests run: 4, Failures: 0, Errors: 0, Skipped: 0, Time elapsed: 5.281 sec - in org.apache.hadoop.hbase.util.TestBoundedConcurrentLinkedQueue
Running org.apache.hadoop.hbase.util.TestByteBufferUtils
Tests run: 12, Failures: 0, Errors: 0, Skipped: 0, Time elapsed: 0.629 sec - in org.apache.hadoop.hbase.util.TestByteBufferUtils
Running org.apache.hadoop.hbase.util.TestEncryptionTest
Tests run: 3, Failures: 0, Errors: 0, Skipped: 0, Time elapsed: 1.016 sec - in org.apache.hadoop.hbase.util.TestEncryptionTest
Running org.apache.hadoop.hbase.util.TestSortedCopyOnWriteSet
Tests run: 2, Failures: 0, Errors: 0, Skipped: 0, Time elapsed: 0.253 sec - in org.apache.hadoop.hbase.util.TestSortedCopyOnWriteSet
Running org.apache.hadoop.hbase.util.TestHBaseFsckComparator
Tests run: 6, Failures: 0, Errors: 0, Skipped: 0, Time elapsed: 0.257 sec - in org.apache.hadoop.hbase.util.TestHBaseFsckComparator
Running org.apache.hadoop.hbase.util.TestPoolMap$TestRoundRobinPoolType
Tests run: 3, Failures: 0, Errors: 0, Skipped: 0, Time elapsed: 0.266 sec - in org.apache.hadoop.hbase.util.TestPoolMap$TestRoundRobinPoolType
Running org.apache.hadoop.hbase.util.TestRegionSplitCalculator
Tests run: 15, Failures: 0, Errors: 0, Skipped: 0, Time elapsed: 0.409 sec - in org.apache.hadoop.hbase.util.TestRegionSplitCalculator
Running org.apache.hadoop.hbase.util.TestHFileArchiveUtil
Tests run: 4, Failures: 0, Errors: 0, Skipped: 0, Time elapsed: 0.752 sec - in org.apache.hadoop.hbase.util.TestHFileArchiveUtil
Running org.apache.hadoop.hbase.util.TestPoolMap$TestReusablePoolType
Tests run: 3, Failures: 0, Errors: 0, Skipped: 0, Time elapsed: 0.3 sec - in org.apache.hadoop.hbase.util.TestPoolMap$TestReusablePoolType
Running org.apache.hadoop.hbase.util.TestPoolMap$TestRoundRobinPoolType
Tests run: 3, Failures: 0, Errors: 0, Skipped: 0, Time elapsed: 0.255 sec - in org.apache.hadoop.hbase.util.TestPoolMap$TestRoundRobinPoolType
Running org.apache.hadoop.hbase.util.TestPoolMap$TestThreadLocalPoolType
Tests run: 3, Failures: 0, Errors: 0, Skipped: 0, Time elapsed: 0.043 sec - in org.apache.hadoop.hbase.util.TestPoolMap$TestThreadLocalPoolType
Running org.apache.hadoop.hbase.util.TestPoolMap$TestReusablePoolType
Tests run: 3, Failures: 0, Errors: 0, Skipped: 0, Time elapsed: 0.043 sec - in org.apache.hadoop.hbase.util.TestPoolMap$TestReusablePoolType
Running org.apache.hadoop.hbase.replication.regionserver.TestReplicationThrottler
Tests run: 1, Failures: 0, Errors: 0, Skipped: 0, Time elapsed: 0.183 sec - in org.apache.hadoop.hbase.replication.regionserver.TestReplicationThrottler
Running org.apache.hadoop.hbase.replication.regionserver.TestReplicationSinkManager
Tests run: 5, Failures: 0, Errors: 0, Skipped: 0, Time elapsed: 0.717 sec - in org.apache.hadoop.hbase.replication.regionserver.TestReplicationSinkManager
Running org.apache.hadoop.hbase.replication.TestReplicationWALEntryFilters
Tests run: 4, Failures: 0, Errors: 0, Skipped: 0, Time elapsed: 0.719 sec - in org.apache.hadoop.hbase.replication.TestReplicationWALEntryFilters

Results :

Tests in error: 
  TestProcedureManager.setupBeforeClass:51 » IO Shutting down
  TestRegionMergeTransaction.testFailAfterPONR:327 » Bind Problem binding to 115...
  TestRegionMergeTransaction.testRollback:268 » Bind Problem binding to 115.98.1...
  TestRegionMergeTransaction.testWholesomeMerge:221 » Bind Problem binding to 11...

Tests run: 862, Failures: 0, Errors: 4, Skipped: 11

[INFO] ------------------------------------------------------------------------
[INFO] Reactor Summary:
[INFO] 
[INFO] Apache HBase ...................................... SUCCESS [1:29.638s]
[INFO] Apache HBase - Checkstyle ......................... SUCCESS [8.244s]
[INFO] Apache HBase - Resource Bundle .................... SUCCESS [0.149s]
[INFO] Apache HBase - Annotations ........................ SUCCESS [0.815s]
[INFO] Apache HBase - Common ............................. SUCCESS [2:58.175s]
[INFO] Apache HBase - Protocol ........................... SUCCESS [15.034s]
[INFO] Apache HBase - Client ............................. SUCCESS [1:01.437s]
[INFO] Apache HBase - Hadoop Compatibility ............... SUCCESS [6.590s]
[INFO] Apache HBase - Hadoop Two Compatibility ........... SUCCESS [11.133s]
[INFO] Apache HBase - Prefix Tree ........................ SUCCESS [7.317s]
[INFO] Apache HBase - Server ............................. FAILURE [9:05.181s]
[INFO] Apache HBase - Testing Util ....................... SKIPPED
[INFO] Apache HBase - Thrift ............................. SKIPPED
[INFO] Apache HBase - Rest ............................... SKIPPED
[INFO] Apache HBase - Shell .............................. SKIPPED
[INFO] Apache HBase - Integration Tests .................. SKIPPED
[INFO] Apache HBase - Examples ........................... SKIPPED
[INFO] Apache HBase - Assembly ........................... SKIPPED
[INFO] ------------------------------------------------------------------------
[INFO] BUILD FAILURE
[INFO] ------------------------------------------------------------------------
[INFO] Total time: 15:48.153s
[INFO] Finished at: Tue Mar 29 13:04:24 UTC 2016
[INFO] Final Memory: 60M/607M
[INFO] ------------------------------------------------------------------------
[ERROR] Failed to execute goal org.apache.maven.plugins:maven-surefire-plugin:2.18.1:test
(default-test) on project hbase-server: There are test failures.
[ERROR] 
[ERROR] Please refer to <https://builds.apache.org/job/HBase-0.98-matrix/jdk=latest1.6,label=yahoo-not-h2/ws/hbase-server/target/surefire-reports>
for the individual test results.
[ERROR] -> [Help 1]
[ERROR] 
[ERROR] To see the full stack trace of the errors, re-run Maven with the -e switch.
[ERROR] Re-run Maven using the -X switch to enable full debug logging.
[ERROR] 
[ERROR] For more information about the errors and possible solutions, please read the following
articles:
[ERROR] [Help 1] http://cwiki.apache.org/confluence/display/MAVEN/MojoFailureException
[ERROR] 
[ERROR] After correcting the problems, you can resume the build with the command
[ERROR]   mvn <goals> -rf :hbase-server
Build step 'Invoke top-level Maven targets' marked build as failure
Performing Post build task...
Match found for :.* : True
Logical operation result is TRUE
Running script  : # Post-build task script. TODO: Check this in and have all builds reference
check-in.
pwd && ls
# NOTE!!!! The below code has been copied and pasted from ./dev-tools/run-test.sh
# Do not change here without syncing there and vice-versa.
ZOMBIE_TESTS_COUNT=`jps -v | grep surefirebooter | grep -e '-Dhbase.test' | wc -l`
if [[ $ZOMBIE_TESTS_COUNT != 0 ]] ; then
 echo "Suspicious java process found - waiting 30s to see if there are just slow to stop"
 sleep 30
 ZOMBIE_TESTS_COUNT=`jps -v | grep surefirebooter | grep -e '-Dhbase.test' | wc -l`
 if [[ $ZOMBIE_TESTS_COUNT != 0 ]] ; then
   echo " {color:red}There appear to be $ZOMBIE_TESTS_COUNT zombie tests{color}, they should
have been killed by surefire but survived"
   jps -v | grep surefirebooter | grep -e '-Dhbase.test'
   jps -v | grep surefirebooter | grep -e '-Dhbase.test' | cut -d ' ' -f 1 | xargs -n 1 jstack
   # Exit with error
   exit 1
 else
   echo "We're ok: there is no zombie test, but some tests took some time to stop"
 fi
else
  echo "We're ok: there is no zombie test"
fi
[yahoo-not-h2] $ /bin/bash -xe /tmp/hudson2751320209714501919.sh
+ pwd
<https://builds.apache.org/job/HBase-0.98-matrix/jdk=latest1.6,label=yahoo-not-h2/ws/>
+ ls
bin
CHANGES.txt
conf
dev-support
hbase-annotations
hbase-assembly
hbase-checkstyle
hbase-client
hbase-common
hbase-examples
hbase-hadoop1-compat
hbase-hadoop2-compat
hbase-hadoop-compat
hbase-it
hbase-prefix-tree
hbase-protocol
hbase-resource-bundle
hbase-rest
hbase-server
hbase-shell
hbase-testing-util
hbase-thrift
LICENSE.txt
NOTICE.txt
pom.xml
README.txt
src
target
++ jps -v
++ grep surefirebooter
++ grep -e -Dhbase.test
++ wc -l
+ ZOMBIE_TESTS_COUNT=0
+ [[ 0 != 0 ]]
+ echo 'We'\''re ok: there is no zombie test'
We're ok: there is no zombie test
POST BUILD TASK : SUCCESS
END OF POST BUILD TASK : 0
Archiving artifacts
Recording test results

Mime
View raw message