hbase-builds mailing list archives

Site index · List index
Message view « Date » · « Thread »
Top « Date » · « Thread »
From Apache Jenkins Server <jenk...@builds.apache.org>
Subject Build failed in Jenkins: HBase-1.4 » latest1.7,yahoo-not-h2 #56
Date Sat, 26 Mar 2016 08:20:07 GMT
See <https://builds.apache.org/job/HBase-1.4/jdk=latest1.7,label=yahoo-not-h2/56/changes>

Changes:

[tedyu] HBASE-15496 Throw RowTooBigException only for user scan/get (Guanghao

------------------------------------------
[...truncated 52583 lines...]
Running org.apache.hadoop.hbase.regionserver.TestMasterAddressTracker
Tests run: 5, Failures: 0, Errors: 0, Skipped: 0, Time elapsed: 5.985 sec - in org.apache.hadoop.hbase.regionserver.TestMasterAddressTracker
Tests run: 24, Failures: 0, Errors: 0, Skipped: 0, Time elapsed: 74.038 sec - in org.apache.hadoop.hbase.regionserver.TestDefaultMemStore
Running org.apache.hadoop.hbase.regionserver.TestParallelPut
Tests run: 2, Failures: 0, Errors: 0, Skipped: 0, Time elapsed: 31.492 sec - in org.apache.hadoop.hbase.regionserver.TestParallelPut
Tests run: 3, Failures: 2, Errors: 0, Skipped: 0, Time elapsed: 158.107 sec <<< FAILURE!
- in org.apache.hadoop.hbase.regionserver.throttle.TestFlushWithThroughputController
testFlushControlForStripedStore(org.apache.hadoop.hbase.regionserver.throttle.TestFlushWithThroughputController)
 Time elapsed: 47.792 sec  <<< FAILURE!
java.lang.AssertionError: null
	at org.junit.Assert.fail(Assert.java:86)
	at org.junit.Assert.assertTrue(Assert.java:41)
	at org.junit.Assert.assertTrue(Assert.java:52)
	at org.apache.hadoop.hbase.regionserver.throttle.TestFlushWithThroughputController.testFlushWithThroughputLimit(TestFlushWithThroughputController.java:117)
	at org.apache.hadoop.hbase.regionserver.throttle.TestFlushWithThroughputController.testFlushControl(TestFlushWithThroughputController.java:144)
	at org.apache.hadoop.hbase.regionserver.throttle.TestFlushWithThroughputController.testFlushControlForStripedStore(TestFlushWithThroughputController.java:218)

testFlushControl(org.apache.hadoop.hbase.regionserver.throttle.TestFlushWithThroughputController)
 Time elapsed: 46.788 sec  <<< FAILURE!
java.lang.AssertionError: null
	at org.junit.Assert.fail(Assert.java:86)
	at org.junit.Assert.assertTrue(Assert.java:41)
	at org.junit.Assert.assertTrue(Assert.java:52)
	at org.apache.hadoop.hbase.regionserver.throttle.TestFlushWithThroughputController.testFlushWithThroughputLimit(TestFlushWithThroughputController.java:117)
	at org.apache.hadoop.hbase.regionserver.throttle.TestFlushWithThroughputController.testFlushControl(TestFlushWithThroughputController.java:144)

Running org.apache.hadoop.hbase.regionserver.TestSplitTransactionOnCluster
Tests run: 3, Failures: 0, Errors: 0, Skipped: 0, Time elapsed: 141.49 sec - in org.apache.hadoop.hbase.regionserver.throttle.TestCompactionWithThroughputController
Running org.apache.hadoop.hbase.regionserver.TestCorruptedRegionStoreFile
Running org.apache.hadoop.hbase.regionserver.TestRegionServerOnlineConfigChange
Tests run: 2, Failures: 0, Errors: 0, Skipped: 0, Time elapsed: 2.325 sec - in org.apache.hadoop.hbase.regionserver.TestRegionServerOnlineConfigChange
Running org.apache.hadoop.hbase.regionserver.TestRegionIncrement
Tests run: 4, Failures: 0, Errors: 0, Skipped: 0, Time elapsed: 63.017 sec - in org.apache.hadoop.hbase.regionserver.TestRegionIncrement
Running org.apache.hadoop.hbase.regionserver.TestCompaction
Tests run: 2, Failures: 0, Errors: 0, Skipped: 0, Time elapsed: 301.282 sec - in org.apache.hadoop.hbase.regionserver.throttle.TestFlushWithThroughputController
Tests run: 5, Failures: 0, Errors: 0, Skipped: 0, Time elapsed: 434.66 sec - in org.apache.hadoop.hbase.regionserver.wal.TestLogRolling
Running org.apache.hadoop.hbase.regionserver.TestRegionMergeTransactionOnCluster
Tests run: 5, Failures: 0, Errors: 0, Skipped: 0, Time elapsed: 71.129 sec - in org.apache.hadoop.hbase.regionserver.TestCompaction
Running org.apache.hadoop.hbase.regionserver.TestRemoveRegionMetrics
Tests run: 17, Failures: 0, Errors: 0, Skipped: 0, Time elapsed: 206.348 sec - in org.apache.hadoop.hbase.regionserver.TestSplitTransactionOnCluster
Running org.apache.hadoop.hbase.regionserver.TestRecoveredEdits
Running org.apache.hadoop.hbase.regionserver.TestGetClosestAtOrBefore
Tests run: 3, Failures: 0, Errors: 0, Skipped: 0, Time elapsed: 9.087 sec - in org.apache.hadoop.hbase.regionserver.TestGetClosestAtOrBefore
Running org.apache.hadoop.hbase.regionserver.TestCompoundBloomFilter
Tests run: 4, Failures: 0, Errors: 0, Skipped: 0, Time elapsed: 65.083 sec - in org.apache.hadoop.hbase.regionserver.TestRegionMergeTransactionOnCluster
Running org.apache.hadoop.hbase.regionserver.TestRegionServerReportForDuty
Tests run: 1, Failures: 0, Errors: 0, Skipped: 0, Time elapsed: 53.735 sec - in org.apache.hadoop.hbase.regionserver.TestRecoveredEdits
Tests run: 2, Failures: 0, Errors: 0, Skipped: 0, Time elapsed: 257.099 sec - in org.apache.hadoop.hbase.regionserver.TestCorruptedRegionStoreFile
Running org.apache.hadoop.hbase.regionserver.TestHRegion
Running org.apache.hadoop.hbase.regionserver.compactions.TestCompactedHFilesDischarger
Tests run: 3, Failures: 0, Errors: 0, Skipped: 0, Time elapsed: 13.159 sec - in org.apache.hadoop.hbase.regionserver.compactions.TestCompactedHFilesDischarger
Tests run: 1, Failures: 0, Errors: 0, Skipped: 0, Time elapsed: 51.14 sec - in org.apache.hadoop.hbase.regionserver.TestRegionServerReportForDuty
Running org.apache.hadoop.hbase.regionserver.compactions.TestFIFOCompactionPolicy
Running org.apache.hadoop.hbase.regionserver.TestAtomicOperation
Tests run: 1, Failures: 0, Errors: 0, Skipped: 0, Time elapsed: 169.618 sec - in org.apache.hadoop.hbase.regionserver.TestRemoveRegionMetrics
Running org.apache.hadoop.hbase.regionserver.TestTimestampFilterSeekHint
Tests run: 4, Failures: 0, Errors: 0, Skipped: 0, Time elapsed: 94.364 sec - in org.apache.hadoop.hbase.regionserver.compactions.TestFIFOCompactionPolicy
Running org.apache.hadoop.hbase.regionserver.TestFSErrorsExposed
Tests run: 2, Failures: 0, Errors: 0, Skipped: 0, Time elapsed: 81.58 sec - in org.apache.hadoop.hbase.regionserver.TestTimestampFilterSeekHint
Tests run: 9, Failures: 0, Errors: 1, Skipped: 0, Time elapsed: 140.782 sec <<< FAILURE!
- in org.apache.hadoop.hbase.regionserver.TestAtomicOperation
testMultiRowMutationMultiThreads(org.apache.hadoop.hbase.regionserver.TestAtomicOperation)
 Time elapsed: 27.363 sec  <<< ERROR!
org.apache.hadoop.hbase.DroppedSnapshotException: Failed clearing memory after 6 attempts
on region: testMultiRowMutationMultiThreads,,1458978622950.7e42031c12d537db7cea851f988b8301.
	at org.apache.hadoop.hbase.regionserver.HRegion.doClose(HRegion.java:1456)
	at org.apache.hadoop.hbase.regionserver.HRegion.close(HRegion.java:1382)
	at org.apache.hadoop.hbase.regionserver.HRegion.close(HRegion.java:1332)
	at org.apache.hadoop.hbase.regionserver.TestAtomicOperation.teardown(TestAtomicOperation.java:107)

Running org.apache.hadoop.hbase.regionserver.TestRSKilledWhenInitializing
Tests run: 1, Failures: 0, Errors: 0, Skipped: 0, Time elapsed: 156.156 sec - in org.apache.hadoop.hbase.regionserver.TestAtomicOperation
Running org.apache.hadoop.hbase.regionserver.TestMultiColumnScanner
Tests run: 3, Failures: 0, Errors: 0, Skipped: 0, Time elapsed: 85.974 sec - in org.apache.hadoop.hbase.regionserver.TestFSErrorsExposed
Tests run: 1, Failures: 0, Errors: 0, Skipped: 0, Time elapsed: 41.214 sec - in org.apache.hadoop.hbase.regionserver.TestRSKilledWhenInitializing
Running org.apache.hadoop.hbase.regionserver.TestFlushRegionEntry
Tests run: 1, Failures: 0, Errors: 0, Skipped: 0, Time elapsed: 3.794 sec - in org.apache.hadoop.hbase.regionserver.TestFlushRegionEntry
Running org.apache.hadoop.hbase.regionserver.TestStore
Running org.apache.hadoop.hbase.TestMetaTableLocator
Tests run: 7, Failures: 0, Errors: 0, Skipped: 0, Time elapsed: 12.232 sec - in org.apache.hadoop.hbase.TestMetaTableLocator
Tests run: 18, Failures: 0, Errors: 0, Skipped: 0, Time elapsed: 34.322 sec - in org.apache.hadoop.hbase.regionserver.TestStore
Running org.apache.hadoop.hbase.TestStochasticBalancerJmxMetrics
Tests run: 1, Failures: 0, Errors: 0, Skipped: 1, Time elapsed: 0.001 sec - in org.apache.hadoop.hbase.TestStochasticBalancerJmxMetrics
Running org.apache.hadoop.hbase.namespace.TestNamespaceAuditor
Tests run: 12, Failures: 0, Errors: 0, Skipped: 0, Time elapsed: 210.703 sec - in org.apache.hadoop.hbase.regionserver.TestMultiColumnScanner
Tests run: 12, Failures: 0, Errors: 0, Skipped: 1, Time elapsed: 180.839 sec - in org.apache.hadoop.hbase.namespace.TestNamespaceAuditor
Tests run: 3, Failures: 0, Errors: 0, Skipped: 0, Time elapsed: 543.556 sec - in org.apache.hadoop.hbase.regionserver.TestCompoundBloomFilter
Tests run: 102, Failures: 0, Errors: 0, Skipped: 0, Time elapsed: 766.39 sec - in org.apache.hadoop.hbase.regionserver.TestHRegion

Results :

Failed tests: 
org.apache.hadoop.hbase.master.balancer.TestStochasticLoadBalancer2.testRegionReplicasOnMidClusterHighReplication(org.apache.hadoop.hbase.master.balancer.TestStochasticLoadBalancer2)
  Run 1: TestStochasticLoadBalancer2.testRegionReplicasOnMidClusterHighReplication:72->BalancerTestBase.testWithCluster:422->BalancerTestBase.testWithCluster:450->BalancerTestBase.assertRegionReplicaPlacement:225
Two or more region replicas are hosted on the same host after balance
  Run 2: TestStochasticLoadBalancer2.testRegionReplicasOnMidClusterHighReplication:72->BalancerTestBase.testWithCluster:422->BalancerTestBase.testWithCluster:450->BalancerTestBase.assertRegionReplicaPlacement:225
Two or more region replicas are hosted on the same host after balance
  Run 3: TestStochasticLoadBalancer2.testRegionReplicasOnMidClusterHighReplication:72->BalancerTestBase.testWithCluster:422->BalancerTestBase.testWithCluster:450->BalancerTestBase.assertRegionReplicaPlacement:225
Two or more region replicas are hosted on the same host after balance

Tests in error: 
  TestHRegionServerBulkLoad.testAtomicBulkLoad:352->runAtomicBulkloadTest:377 » Runtime
Flaked tests: 
org.apache.hadoop.hbase.regionserver.TestAtomicOperation.testMultiRowMutationMultiThreads(org.apache.hadoop.hbase.regionserver.TestAtomicOperation)
  Run 1: TestAtomicOperation.teardown:107 » DroppedSnapshot Failed clearing memory afte...
  Run 2: PASS

org.apache.hadoop.hbase.regionserver.TestEncryptionKeyRotation.testCFKeyRotation(org.apache.hadoop.hbase.regionserver.TestEncryptionKeyRotation)
  Run 1: TestEncryptionKeyRotation.testCFKeyRotation:151 Store file hdfs://localhost:55222/user/jenkins/test-data/2c81f2f4-71da-4c1e-9f2b-c798de1aa6f2/data/default/testCFKeyRotation/7b97ce439b4da880bf5c0409e2a29226/cf/5cb30a6b4f724c6b89822e1bff855e68
has incorrect key
  Run 2: PASS

org.apache.hadoop.hbase.regionserver.TestPerColumnFamilyFlush.testCompareStoreFileCount(org.apache.hadoop.hbase.regionserver.TestPerColumnFamilyFlush)
  Run 1: TestPerColumnFamilyFlush.testCompareStoreFileCount:622->doPut:559->Object.wait:-2
» TestTimedOut
  Run 2: PASS

org.apache.hadoop.hbase.regionserver.TestPerColumnFamilyFlush.testFlushingWhenLogRolling(org.apache.hadoop.hbase.regionserver.TestPerColumnFamilyFlush)
  Run 1: TestPerColumnFamilyFlush.testFlushingWhenLogRolling:467 » IllegalState A mini-...
  Run 2: PASS

org.apache.hadoop.hbase.regionserver.TestRegionServerHostname.testInvalidRegionServerHostnameAbortsServer(org.apache.hadoop.hbase.regionserver.TestRegionServerHostname)
  Run 1: TestRegionServerHostname.testInvalidRegionServerHostnameAbortsServer:53 » TestTimedOut
  Run 2: TestRegionServerHostname.testInvalidRegionServerHostnameAbortsServer:53 » IllegalState
  Run 3: PASS

org.apache.hadoop.hbase.regionserver.TestRegionServerHostname.testRegionServerHostname(org.apache.hadoop.hbase.regionserver.TestRegionServerHostname)
  Run 1: TestRegionServerHostname.testRegionServerHostname:86 » IllegalState A mini-clu...
  Run 2: PASS

org.apache.hadoop.hbase.regionserver.TestWALLockup.testLockupWhenSyncInMiddleOfZigZagSetup(org.apache.hadoop.hbase.regionserver.TestWALLockup)
  Run 1: TestWALLockup.testLockupWhenSyncInMiddleOfZigZagSetup:276 » TestTimedOut test ...
  Run 2: PASS

org.apache.hadoop.hbase.regionserver.throttle.TestFlushWithThroughputController.testFlushControl(org.apache.hadoop.hbase.regionserver.throttle.TestFlushWithThroughputController)
  Run 1: TestFlushWithThroughputController.testFlushControl:144->testFlushWithThroughputLimit:117
null
  Run 2: PASS

org.apache.hadoop.hbase.regionserver.throttle.TestFlushWithThroughputController.testFlushControlForStripedStore(org.apache.hadoop.hbase.regionserver.throttle.TestFlushWithThroughputController)
  Run 1: TestFlushWithThroughputController.testFlushControlForStripedStore:218->testFlushControl:144->testFlushWithThroughputLimit:117
null
  Run 2: PASS


Tests run: 2528, Failures: 1, Errors: 1, Skipped: 63, Flakes: 9

[INFO] ------------------------------------------------------------------------
[INFO] Reactor Summary:
[INFO] 
[INFO] Apache HBase ...................................... SUCCESS [1:12.743s]
[INFO] Apache HBase - Checkstyle ......................... SUCCESS [8.485s]
[INFO] Apache HBase - Resource Bundle .................... SUCCESS [0.768s]
[INFO] Apache HBase - Annotations ........................ SUCCESS [3.536s]
[INFO] Apache HBase - Protocol ........................... SUCCESS [52.494s]
[INFO] Apache HBase - Common ............................. SUCCESS [5:31.378s]
[INFO] Apache HBase - Procedure .......................... SUCCESS [6:18.472s]
[INFO] Apache HBase - Client ............................. SUCCESS [2:53.446s]
[INFO] Apache HBase - Hadoop Compatibility ............... SUCCESS [15.405s]
[INFO] Apache HBase - Hadoop Two Compatibility ........... SUCCESS [28.313s]
[INFO] Apache HBase - Prefix Tree ........................ SUCCESS [34.599s]
[INFO] Apache HBase - Server ............................. FAILURE [3:42:23.373s]
[INFO] Apache HBase - Testing Util ....................... SKIPPED
[INFO] Apache HBase - Thrift ............................. SKIPPED
[INFO] Apache HBase - Rest ............................... SKIPPED
[INFO] Apache HBase - Shell .............................. SKIPPED
[INFO] Apache HBase - Integration Tests .................. SKIPPED
[INFO] Apache HBase - Examples ........................... SKIPPED
[INFO] Apache HBase - External Block Cache ............... SKIPPED
[INFO] Apache HBase - Assembly ........................... SKIPPED
[INFO] Apache HBase - Shaded ............................. SKIPPED
[INFO] Apache HBase - Shaded - Client .................... SKIPPED
[INFO] Apache HBase - Shaded - Server .................... SKIPPED
[INFO] ------------------------------------------------------------------------
[INFO] BUILD FAILURE
[INFO] ------------------------------------------------------------------------
[INFO] Total time: 4:01:12.954s
[INFO] Finished at: Sat Mar 26 08:02:34 UTC 2016
[INFO] Final Memory: 59M/736M
[INFO] ------------------------------------------------------------------------
[ERROR] Failed to execute goal org.apache.maven.plugins:maven-surefire-plugin:2.18.1:test
(secondPartTestsExecution) on project hbase-server: ExecutionException: java.lang.RuntimeException:
java.lang.RuntimeException: org.apache.maven.surefire.report.ReporterException: When writing
xml report stdout/stderr: /tmp/stderr7664514560748700997deferred (No such file or directory)
-> [Help 1]
[ERROR] 
[ERROR] To see the full stack trace of the errors, re-run Maven with the -e switch.
[ERROR] Re-run Maven using the -X switch to enable full debug logging.
[ERROR] 
[ERROR] For more information about the errors and possible solutions, please read the following
articles:
[ERROR] [Help 1] http://cwiki.apache.org/confluence/display/MAVEN/MojoFailureException
[ERROR] 
[ERROR] After correcting the problems, you can resume the build with the command
[ERROR]   mvn <goals> -rf :hbase-server
Build step 'Invoke top-level Maven targets' marked build as failure
Performing Post build task...
Match found for :.* : True
Logical operation result is TRUE
Running script  : # Post-build task script. TODO: Check this in and have all builds reference
check-in.
pwd && ls
# NOTE!!!! The below code has been copied and pasted from ./dev-tools/run-test.sh
# Do not change here without syncing there and vice-versa.
ZOMBIE_TESTS_COUNT=`jps -v | grep surefirebooter | grep -e '-Dhbase.test' | wc -l`
if [[ $ZOMBIE_TESTS_COUNT != 0 ]] ; then
 echo "Suspicious java process found - waiting 30s to see if there are just slow to stop"
 sleep 30
 ZOMBIE_TESTS_COUNT=`jps -v | grep surefirebooter | grep -e '-Dhbase.test' | wc -l`
 if [[ $ZOMBIE_TESTS_COUNT != 0 ]] ; then
   echo " {color:red}There appear to be $ZOMBIE_TESTS_COUNT zombie tests{color}, they should
have been killed by surefire but survived"
   jps -v | grep surefirebooter | grep -e '-Dhbase.test'
   jps -v | grep surefirebooter | grep -e '-Dhbase.test' | cut -d ' ' -f 1 | xargs -n 1 jstack
   # Exit with error
   exit 1
 else
   echo "We're ok: there is no zombie test, but some tests took some time to stop"
 fi
else
  echo "We're ok: there is no zombie test"
fi
[yahoo-not-h2] $ /bin/bash -xe /tmp/hudson6705263552923554328.sh
+ pwd
<https://builds.apache.org/job/HBase-1.4/jdk=latest1.7,label=yahoo-not-h2/ws/>
+ ls
bin
CHANGES.txt
conf
dev-support
hbase-annotations
hbase-assembly
hbase-checkstyle
hbase-client
hbase-common
hbase-examples
hbase-external-blockcache
hbase-hadoop2-compat
hbase-hadoop-compat
hbase-it
hbase-native-client
hbase-prefix-tree
hbase-procedure
hbase-protocol
hbase-resource-bundle
hbase-rest
hbase-server
hbase-shaded
hbase-shell
hbase-testing-util
hbase-thrift
LICENSE.txt
NOTICE.txt
pom.xml
README.txt
src
target
++ wc -l
++ grep -e -Dhbase.test
++ grep surefirebooter
++ jps -v
+ ZOMBIE_TESTS_COUNT=0
+ [[ 0 != 0 ]]
+ echo 'We'\''re ok: there is no zombie test'
We're ok: there is no zombie test
POST BUILD TASK : SUCCESS
END OF POST BUILD TASK : 0
Archiving artifacts
Recording test results

Mime
View raw message