hbase-builds mailing list archives

Site index · List index
Message view « Date » · « Thread »
Top « Date » · « Thread »
From Apache Jenkins Server <jenk...@builds.apache.org>
Subject Build failed in Jenkins: HBase-1.1-JDK7 #1676
Date Thu, 10 Mar 2016 10:18:41 GMT
See <https://builds.apache.org/job/HBase-1.1-JDK7/1676/changes>

Changes:

[tedyu] HBASE-15378 Scanner cannot handle heartbeat message with no results

[ndimiduk] HBASE-15120 Backport HBASE-14883 to branch-1.1 (Yu Li)

------------------------------------------
[...truncated 2119 lines...]
Tests run: 7, Failures: 0, Errors: 0, Skipped: 0, Time elapsed: 30.46 sec - in org.apache.hadoop.hbase.regionserver.TestSplitLogWorker
Running org.apache.hadoop.hbase.regionserver.TestMinorCompaction
Running org.apache.hadoop.hbase.regionserver.TestRegionServerMetrics
Tests run: 6, Failures: 0, Errors: 0, Skipped: 0, Time elapsed: 16.986 sec - in org.apache.hadoop.hbase.regionserver.TestMinorCompaction
Tests run: 2, Failures: 0, Errors: 0, Skipped: 0, Time elapsed: 50.77 sec - in org.apache.hadoop.hbase.regionserver.TestRegionServerHostname
Tests run: 1, Failures: 0, Errors: 0, Skipped: 0, Time elapsed: 66.445 sec - in org.apache.hadoop.hbase.regionserver.TestJoinedScanners
Running org.apache.hadoop.hbase.regionserver.TestHRegionOnCluster
Running org.apache.hadoop.hbase.regionserver.TestTags
Tests run: 11, Failures: 0, Errors: 0, Skipped: 0, Time elapsed: 45.513 sec - in org.apache.hadoop.hbase.regionserver.TestRegionServerMetrics
Running org.apache.hadoop.hbase.regionserver.TestScannerHeartbeatMessages
Tests run: 1, Failures: 0, Errors: 0, Skipped: 0, Time elapsed: 44.425 sec - in org.apache.hadoop.hbase.regionserver.TestHRegionOnCluster
Running org.apache.hadoop.hbase.regionserver.TestRowTooBig
Tests run: 2, Failures: 0, Errors: 0, Skipped: 0, Time elapsed: 34.017 sec - in org.apache.hadoop.hbase.regionserver.TestRowTooBig
Tests run: 4, Failures: 0, Errors: 0, Skipped: 0, Time elapsed: 83.169 sec - in org.apache.hadoop.hbase.regionserver.TestTags
Running org.apache.hadoop.hbase.regionserver.TestSCVFWithMiniCluster
Running org.apache.hadoop.hbase.regionserver.TestPerColumnFamilyFlush
Tests run: 5, Failures: 0, Errors: 0, Skipped: 0, Time elapsed: 1.083 sec - in org.apache.hadoop.hbase.regionserver.TestSCVFWithMiniCluster
Running org.apache.hadoop.hbase.regionserver.TestSeekOptimizations
Tests run: 6, Failures: 0, Errors: 0, Skipped: 0, Time elapsed: 22.242 sec - in org.apache.hadoop.hbase.regionserver.TestSeekOptimizations
Running org.apache.hadoop.hbase.regionserver.TestCompactionState
Running org.apache.hadoop.hbase.regionserver.TestRegionReplicas
Tests run: 1, Failures: 0, Errors: 0, Skipped: 0, Time elapsed: 175.888 sec - in org.apache.hadoop.hbase.regionserver.TestScannerHeartbeatMessages
Running org.apache.hadoop.hbase.regionserver.TestCompactionWithCoprocessor
Tests run: 5, Failures: 0, Errors: 0, Skipped: 0, Time elapsed: 100.188 sec - in org.apache.hadoop.hbase.regionserver.TestCompactionState
Running org.apache.hadoop.hbase.regionserver.TestStoreScanner
Tests run: 16, Failures: 0, Errors: 0, Skipped: 0, Time elapsed: 3.998 sec - in org.apache.hadoop.hbase.regionserver.TestStoreScanner
Running org.apache.hadoop.hbase.regionserver.TestHRegionReplayEvents
Tests run: 5, Failures: 0, Errors: 0, Skipped: 0, Time elapsed: 66.181 sec - in org.apache.hadoop.hbase.regionserver.TestCompactionWithCoprocessor
Running org.apache.hadoop.hbase.regionserver.TestCacheOnWriteInSchema
Tests run: 3, Failures: 0, Errors: 0, Skipped: 0, Time elapsed: 13.336 sec - in org.apache.hadoop.hbase.regionserver.TestCacheOnWriteInSchema
Tests run: 6, Failures: 0, Errors: 0, Skipped: 0, Time elapsed: 195.118 sec - in org.apache.hadoop.hbase.regionserver.TestPerColumnFamilyFlush
Tests run: 26, Failures: 0, Errors: 0, Skipped: 0, Time elapsed: 58.817 sec - in org.apache.hadoop.hbase.regionserver.TestHRegionReplayEvents
Running org.apache.hadoop.hbase.regionserver.wal.TestReadOldRootAndMetaEdits
Tests run: 1, Failures: 0, Errors: 0, Skipped: 0, Time elapsed: 1.859 sec - in org.apache.hadoop.hbase.regionserver.wal.TestReadOldRootAndMetaEdits
Running org.apache.hadoop.hbase.regionserver.wal.TestFSHLog
Running org.apache.hadoop.hbase.regionserver.wal.TestWALReplayCompressed
Tests run: 7, Failures: 0, Errors: 0, Skipped: 0, Time elapsed: 13.991 sec - in org.apache.hadoop.hbase.regionserver.wal.TestFSHLog
Running org.apache.hadoop.hbase.regionserver.wal.TestSecureWALReplay
Running org.apache.hadoop.hbase.regionserver.wal.TestWALReplay
Tests run: 7, Failures: 0, Errors: 0, Skipped: 0, Time elapsed: 224.462 sec - in org.apache.hadoop.hbase.regionserver.TestRegionReplicas
Running org.apache.hadoop.hbase.regionserver.wal.TestLogRollAbort
Tests run: 10, Failures: 0, Errors: 0, Skipped: 0, Time elapsed: 69.59 sec - in org.apache.hadoop.hbase.regionserver.wal.TestWALReplayCompressed
Running org.apache.hadoop.hbase.regionserver.wal.TestLogRolling
Tests run: 12, Failures: 0, Errors: 0, Skipped: 0, Time elapsed: 607.499 sec - in org.apache.hadoop.hbase.regionserver.TestRegionReplicaFailover
Tests run: 10, Failures: 0, Errors: 0, Skipped: 0, Time elapsed: 82.664 sec - in org.apache.hadoop.hbase.regionserver.wal.TestSecureWALReplay
Running org.apache.hadoop.hbase.regionserver.wal.TestProtobufLog
Tests run: 10, Failures: 0, Errors: 0, Skipped: 0, Time elapsed: 66.068 sec - in org.apache.hadoop.hbase.regionserver.wal.TestWALReplay
Tests run: 1, Failures: 0, Errors: 0, Skipped: 0, Time elapsed: 4.622 sec - in org.apache.hadoop.hbase.regionserver.wal.TestProtobufLog
Tests run: 2, Failures: 0, Errors: 0, Skipped: 0, Time elapsed: 47.624 sec - in org.apache.hadoop.hbase.regionserver.wal.TestLogRollAbort
Running org.apache.hadoop.hbase.regionserver.wal.TestDurability
Tests run: 3, Failures: 0, Errors: 0, Skipped: 0, Time elapsed: 6.38 sec - in org.apache.hadoop.hbase.regionserver.wal.TestDurability
Running org.apache.hadoop.hbase.regionserver.wal.TestLogRollPeriod
Running org.apache.hadoop.hbase.regionserver.TestDefaultMemStore
Running org.apache.hadoop.hbase.regionserver.TestScannerWithBulkload
Running org.apache.hadoop.hbase.regionserver.TestEncryptionRandomKeying
Tests run: 1, Failures: 0, Errors: 0, Skipped: 0, Time elapsed: 1.86 sec - in org.apache.hadoop.hbase.regionserver.TestEncryptionRandomKeying
Running org.apache.hadoop.hbase.regionserver.handler.TestOpenRegionHandler
Tests run: 3, Failures: 0, Errors: 0, Skipped: 0, Time elapsed: 17.201 sec - in org.apache.hadoop.hbase.regionserver.TestScannerWithBulkload
Running org.apache.hadoop.hbase.regionserver.handler.TestCloseRegionHandler
Tests run: 6, Failures: 0, Errors: 0, Skipped: 0, Time elapsed: 6.665 sec - in org.apache.hadoop.hbase.regionserver.handler.TestOpenRegionHandler
Running org.apache.hadoop.hbase.regionserver.TestMasterAddressTracker
Tests run: 3, Failures: 0, Errors: 0, Skipped: 0, Time elapsed: 6.298 sec - in org.apache.hadoop.hbase.regionserver.handler.TestCloseRegionHandler
Tests run: 5, Failures: 0, Errors: 0, Skipped: 0, Time elapsed: 4.142 sec - in org.apache.hadoop.hbase.regionserver.TestMasterAddressTracker
Running org.apache.hadoop.hbase.regionserver.TestParallelPut
Tests run: 2, Failures: 0, Errors: 0, Skipped: 0, Time elapsed: 27.315 sec - in org.apache.hadoop.hbase.regionserver.TestParallelPut
Running org.apache.hadoop.hbase.regionserver.TestSplitTransactionOnCluster
Tests run: 2, Failures: 0, Errors: 0, Skipped: 0, Time elapsed: 66.48 sec - in org.apache.hadoop.hbase.regionserver.wal.TestLogRollPeriod
Running org.apache.hadoop.hbase.regionserver.TestRegionIncrement
Tests run: 24, Failures: 0, Errors: 0, Skipped: 0, Time elapsed: 77.07 sec - in org.apache.hadoop.hbase.regionserver.TestDefaultMemStore
Running org.apache.hadoop.hbase.regionserver.TestRegionServerOnlineConfigChange
Tests run: 2, Failures: 0, Errors: 0, Skipped: 0, Time elapsed: 2.238 sec - in org.apache.hadoop.hbase.regionserver.TestRegionServerOnlineConfigChange
Running org.apache.hadoop.hbase.regionserver.TestCompaction
Tests run: 2, Failures: 0, Errors: 0, Skipped: 0, Time elapsed: 34.679 sec - in org.apache.hadoop.hbase.regionserver.TestRegionIncrement
Running org.apache.hadoop.hbase.regionserver.TestRecoveredEdits
Running org.apache.hadoop.hbase.regionserver.TestRegionMergeTransactionOnCluster
Tests run: 1, Failures: 0, Errors: 0, Skipped: 0, Time elapsed: 37.861 sec - in org.apache.hadoop.hbase.regionserver.TestRecoveredEdits
Running org.apache.hadoop.hbase.regionserver.TestGetClosestAtOrBefore
Tests run: 5, Failures: 0, Errors: 0, Skipped: 0, Time elapsed: 59.821 sec - in org.apache.hadoop.hbase.regionserver.TestCompaction
Running org.apache.hadoop.hbase.regionserver.TestCompoundBloomFilter
Tests run: 3, Failures: 0, Errors: 0, Skipped: 0, Time elapsed: 6.421 sec - in org.apache.hadoop.hbase.regionserver.TestGetClosestAtOrBefore
Running org.apache.hadoop.hbase.regionserver.TestRegionServerReportForDuty
Tests run: 4, Failures: 0, Errors: 0, Skipped: 0, Time elapsed: 54.307 sec - in org.apache.hadoop.hbase.regionserver.TestRegionMergeTransactionOnCluster
Running org.apache.hadoop.hbase.regionserver.TestHRegion
Tests run: 1, Failures: 0, Errors: 0, Skipped: 0, Time elapsed: 45.651 sec - in org.apache.hadoop.hbase.regionserver.TestRegionServerReportForDuty
Tests run: 3, Failures: 0, Errors: 0, Skipped: 0, Time elapsed: 54.865 sec - in org.apache.hadoop.hbase.regionserver.TestCompoundBloomFilter
Running org.apache.hadoop.hbase.regionserver.compactions.TestCompactionWithThroughputController
Running org.apache.hadoop.hbase.regionserver.TestAtomicOperation
Tests run: 17, Failures: 0, Errors: 0, Skipped: 0, Time elapsed: 184.88 sec - in org.apache.hadoop.hbase.regionserver.TestSplitTransactionOnCluster
Running org.apache.hadoop.hbase.regionserver.TestFSErrorsExposed
Tests run: 3, Failures: 0, Errors: 0, Skipped: 0, Time elapsed: 61.641 sec - in org.apache.hadoop.hbase.regionserver.TestFSErrorsExposed
Running org.apache.hadoop.hbase.regionserver.TestRSKilledWhenInitializing
Tests run: 5, Failures: 0, Errors: 0, Skipped: 0, Time elapsed: 387.203 sec - in org.apache.hadoop.hbase.regionserver.wal.TestLogRolling
Tests run: 3, Failures: 0, Errors: 0, Skipped: 0, Time elapsed: 111.849 sec - in org.apache.hadoop.hbase.regionserver.compactions.TestCompactionWithThroughputController
Running org.apache.hadoop.hbase.regionserver.TestMultiColumnScanner
Running org.apache.hadoop.hbase.regionserver.TestFlushRegionEntry
Tests run: 1, Failures: 0, Errors: 0, Skipped: 0, Time elapsed: 2.686 sec - in org.apache.hadoop.hbase.regionserver.TestFlushRegionEntry
Running org.apache.hadoop.hbase.regionserver.TestStore
Tests run: 1, Failures: 0, Errors: 0, Skipped: 0, Time elapsed: 34.624 sec - in org.apache.hadoop.hbase.regionserver.TestRSKilledWhenInitializing
Running org.apache.hadoop.hbase.TestMetaTableLocator
Tests run: 18, Failures: 0, Errors: 0, Skipped: 0, Time elapsed: 29.145 sec - in org.apache.hadoop.hbase.regionserver.TestStore
Tests run: 7, Failures: 0, Errors: 0, Skipped: 0, Time elapsed: 10.804 sec - in org.apache.hadoop.hbase.TestMetaTableLocator
Running org.apache.hadoop.hbase.namespace.TestNamespaceAuditor
Tests run: 6, Failures: 0, Errors: 0, Skipped: 0, Time elapsed: 191.636 sec - in org.apache.hadoop.hbase.regionserver.TestAtomicOperation
Tests run: 12, Failures: 0, Errors: 0, Skipped: 0, Time elapsed: 182.363 sec - in org.apache.hadoop.hbase.regionserver.TestMultiColumnScanner
Tests run: 12, Failures: 0, Errors: 0, Skipped: 0, Time elapsed: 167.555 sec - in org.apache.hadoop.hbase.namespace.TestNamespaceAuditor
Tests run: 99, Failures: 0, Errors: 0, Skipped: 0, Time elapsed: 527.812 sec - in org.apache.hadoop.hbase.regionserver.TestHRegion

Results :

Flaked tests: 
org.apache.hadoop.hbase.master.handler.TestEnableTableHandler.testEnableTableWithNoRegionServers(org.apache.hadoop.hbase.master.handler.TestEnableTableHandler)
  Run 1: TestEnableTableHandler.testEnableTableWithNoRegionServers:123 Waiting timed out after
[60,000] msec table enabled in zk,
  Run 2: PASS

org.apache.hadoop.hbase.replication.TestReplicationSmallTests.testDisableEnable(org.apache.hadoop.hbase.replication.TestReplicationSmallTests)
  Run 1: TestReplicationSmallTests.testDisableEnable:305 Replication wasn't disabled
  Run 2: PASS

org.apache.hadoop.hbase.replication.TestReplicationSmallTests.testSimplePutDelete(org.apache.hadoop.hbase.replication.TestReplicationSmallTests)
  Run 1: TestReplicationSmallTests.testSimplePutDelete:214 Waited too much time for put replication
  Run 2: PASS

org.apache.hadoop.hbase.util.TestHBaseFsck.testHbckThreadpooling(org.apache.hadoop.hbase.util.TestHBaseFsck)
  Run 1: TestHBaseFsck.testHbckThreadpooling:516 expected:<[]> but was:<[NOT_IN_META_OR_DEPLOYED,
FIRST_REGION_STARTKEY_NOT_EMPTY]>
  Run 2: PASS

org.apache.hadoop.hbase.util.TestHBaseFsck.testQuarantineMissingRegionDir(org.apache.hadoop.hbase.util.TestHBaseFsck)
  Run 1: TestHBaseFsck.testQuarantineMissingRegionDir:2236->doQuarantineTest:2148->cleanupTable:475->deleteTable:2816
ยป TableNotDisabled
  Run 2: PASS


Tests run: 2407, Failures: 0, Errors: 0, Skipped: 21, Flakes: 5

[INFO] ------------------------------------------------------------------------
[INFO] Reactor Summary:
[INFO] 
[INFO] Apache HBase ...................................... SUCCESS [12.717s]
[INFO] Apache HBase - Checkstyle ......................... SUCCESS [2.052s]
[INFO] Apache HBase - Resource Bundle .................... SUCCESS [0.963s]
[INFO] Apache HBase - Annotations ........................ SUCCESS [3.011s]
[INFO] Apache HBase - Protocol ........................... SUCCESS [37.290s]
[INFO] Apache HBase - Common ............................. SUCCESS [3:24.627s]
[INFO] Apache HBase - Procedure .......................... SUCCESS [6:11.978s]
[INFO] Apache HBase - Client ............................. SUCCESS [3:34.956s]
[INFO] Apache HBase - Hadoop Compatibility ............... SUCCESS [18.411s]
[INFO] Apache HBase - Hadoop Two Compatibility ........... SUCCESS [28.496s]
[INFO] Apache HBase - Prefix Tree ........................ SUCCESS [39.134s]
[INFO] Apache HBase - Server ............................. FAILURE [3:49:14.074s]
[INFO] Apache HBase - Testing Util ....................... SKIPPED
[INFO] Apache HBase - Thrift ............................. SKIPPED
[INFO] Apache HBase - Rest ............................... SKIPPED
[INFO] Apache HBase - Shell .............................. SKIPPED
[INFO] Apache HBase - Integration Tests .................. SKIPPED
[INFO] Apache HBase - Examples ........................... SKIPPED
[INFO] Apache HBase - Assembly ........................... SKIPPED
[INFO] Apache HBase - Shaded ............................. SKIPPED
[INFO] Apache HBase - Shaded - Client .................... SKIPPED
[INFO] Apache HBase - Shaded - Server .................... SKIPPED
[INFO] ------------------------------------------------------------------------
[INFO] BUILD FAILURE
[INFO] ------------------------------------------------------------------------
[INFO] Total time: 4:04:54.328s
[INFO] Finished at: Thu Mar 10 10:10:18 UTC 2016
[INFO] Final Memory: 54M/611M
[INFO] ------------------------------------------------------------------------
[ERROR] Failed to execute goal org.apache.maven.plugins:maven-surefire-plugin:2.18.1:test
(secondPartTestsExecution) on project hbase-server: There was a timeout or other error in
the fork -> [Help 1]
[ERROR] 
[ERROR] To see the full stack trace of the errors, re-run Maven with the -e switch.
[ERROR] Re-run Maven using the -X switch to enable full debug logging.
[ERROR] 
[ERROR] For more information about the errors and possible solutions, please read the following
articles:
[ERROR] [Help 1] http://cwiki.apache.org/confluence/display/MAVEN/MojoFailureException
[ERROR] 
[ERROR] After correcting the problems, you can resume the build with the command
[ERROR]   mvn <goals> -rf :hbase-server
Build step 'Invoke top-level Maven targets' marked build as failure
Performing Post build task...
Match found for :.* : True
Logical operation result is TRUE
Running script  : # Post-build task script. TODO: Check this in and have all builds reference
check-in.
pwd && ls
# NOTE!!!! The below code has been copied and pasted from ./dev-tools/run-test.sh
# Do not change here without syncing there and vice-versa.
ZOMBIE_TESTS_COUNT=`jps -v | grep surefirebooter | grep -e '-Dhbase.test' | wc -l`
if [[ $ZOMBIE_TESTS_COUNT != 0 ]] ; then
 echo "Suspicious java process found - waiting 30s to see if there are just slow to stop"
 sleep 30
 ZOMBIE_TESTS_COUNT=`jps -v | grep surefirebooter | grep -e '-Dhbase.test' | wc -l`
 if [[ $ZOMBIE_TESTS_COUNT != 0 ]] ; then
   echo " {color:red}There appear to be $ZOMBIE_TESTS_COUNT zombie tests{color}, they should
have been killed by surefire but survived"
   jps -v | grep surefirebooter | grep -e '-Dhbase.test'
   jps -v | grep surefirebooter | grep -e '-Dhbase.test' | cut -d ' ' -f 1 | xargs -n 1 jstack
   # Exit with error
   exit 1
 else
   echo "We're ok: there is no zombie test, but some tests took some time to stop"
 fi
else
  echo "We're ok: there is no zombie test"
fi
[HBase-1.1-JDK7] $ /bin/bash -xe /tmp/hudson6893744399865743140.sh
+ pwd
<https://builds.apache.org/job/HBase-1.1-JDK7/ws/>
+ ls
bin
CHANGES.txt
conf
dev-support
hbase-annotations
hbase-assembly
hbase-checkstyle
hbase-client
hbase-common
hbase-examples
hbase-hadoop2-compat
hbase-hadoop-compat
hbase-it
hbase-native-client
hbase-prefix-tree
hbase-procedure
hbase-protocol
hbase-resource-bundle
hbase-rest
hbase-server
hbase-shaded
hbase-shell
hbase-testing-util
hbase-thrift
LICENSE.txt
NOTICE.txt
pom.xml
README.txt
src
target
++ jps -v
++ grep surefirebooter
++ grep -e -Dhbase.test
++ wc -l
+ ZOMBIE_TESTS_COUNT=0
+ [[ 0 != 0 ]]
+ echo 'We'\''re ok: there is no zombie test'
We're ok: there is no zombie test
POST BUILD TASK : SUCCESS
END OF POST BUILD TASK : 0
Archiving artifacts
Recording test results
Updating HBASE-14883
Updating HBASE-15378
Updating HBASE-15120

Mime
View raw message