hbase-builds mailing list archives

Site index · List index
Message view « Date » · « Thread »
Top « Date » · « Thread »
From Apache Jenkins Server <jenk...@builds.apache.org>
Subject Build failed in Jenkins: HBase-Trunk_matrix » latest1.7,yahoo-not-h2 #793
Date Mon, 21 Mar 2016 13:12:27 GMT
See <https://builds.apache.org/job/HBase-Trunk_matrix/jdk=latest1.7,label=yahoo-not-h2/793/changes>

Changes:

[busbey] HBASE-15478 add comments to syncRunnerIndex handling explaining

------------------------------------------
[...truncated 5579 lines...]
Running org.apache.hadoop.hbase.regionserver.TestMobStoreScanner
Tests run: 1, Failures: 0, Errors: 0, Skipped: 0, Time elapsed: 9.529 sec - in org.apache.hadoop.hbase.regionserver.TestWALLockup
Running org.apache.hadoop.hbase.regionserver.throttle.TestFlushWithThroughputController
Running org.apache.hadoop.hbase.regionserver.throttle.TestCompactionWithThroughputController
Tests run: 3, Failures: 0, Errors: 0, Skipped: 0, Time elapsed: 28.854 sec - in org.apache.hadoop.hbase.regionserver.TestDeleteMobTable
Running org.apache.hadoop.hbase.regionserver.TestCompactionState
Tests run: 6, Failures: 0, Errors: 0, Skipped: 0, Time elapsed: 60.72 sec - in org.apache.hadoop.hbase.regionserver.TestMobStoreScanner
Running org.apache.hadoop.hbase.regionserver.TestFSErrorsExposed
Tests run: 3, Failures: 0, Errors: 0, Skipped: 0, Time elapsed: 113.264 sec - in org.apache.hadoop.hbase.regionserver.throttle.TestCompactionWithThroughputController
Running org.apache.hadoop.hbase.regionserver.TestCorruptedRegionStoreFile
Tests run: 5, Failures: 0, Errors: 0, Skipped: 0, Time elapsed: 83.067 sec - in org.apache.hadoop.hbase.regionserver.TestCompactionState
Running org.apache.hadoop.hbase.regionserver.TestDefaultMemStore
Tests run: 3, Failures: 0, Errors: 0, Skipped: 0, Time elapsed: 70.569 sec - in org.apache.hadoop.hbase.regionserver.TestFSErrorsExposed
Tests run: 3, Failures: 0, Errors: 0, Skipped: 0, Time elapsed: 165.872 sec - in org.apache.hadoop.hbase.regionserver.throttle.TestFlushWithThroughputController
Running org.apache.hadoop.hbase.regionserver.TestRegionServerMetrics
Tests run: 7, Failures: 0, Errors: 0, Skipped: 0, Time elapsed: 236.252 sec - in org.apache.hadoop.hbase.regionserver.TestRegionReplicas
Running org.apache.hadoop.hbase.regionserver.TestRSKilledWhenInitializing
Running org.apache.hadoop.hbase.regionserver.TestGetClosestAtOrBefore
Tests run: 3, Failures: 0, Errors: 0, Skipped: 0, Time elapsed: 6.99 sec - in org.apache.hadoop.hbase.regionserver.TestGetClosestAtOrBefore
Tests run: 23, Failures: 0, Errors: 0, Skipped: 0, Time elapsed: 54.514 sec - in org.apache.hadoop.hbase.regionserver.TestDefaultMemStore
Running org.apache.hadoop.hbase.regionserver.TestReversibleScanners
Running org.apache.hadoop.hbase.regionserver.TestMobStoreCompaction
Tests run: 5, Failures: 0, Errors: 0, Skipped: 0, Time elapsed: 11.337 sec - in org.apache.hadoop.hbase.regionserver.TestReversibleScanners
Running org.apache.hadoop.hbase.regionserver.TestRecoveredEdits
Tests run: 1, Failures: 0, Errors: 0, Skipped: 0, Time elapsed: 39.983 sec - in org.apache.hadoop.hbase.regionserver.TestRSKilledWhenInitializing
Tests run: 4, Failures: 0, Errors: 0, Skipped: 0, Time elapsed: 11.928 sec - in org.apache.hadoop.hbase.regionserver.TestMobStoreCompaction
Tests run: 15, Failures: 0, Errors: 0, Skipped: 1, Time elapsed: 53.718 sec - in org.apache.hadoop.hbase.regionserver.TestRegionServerMetrics
Tests run: 1, Failures: 0, Errors: 0, Skipped: 0, Time elapsed: 25.015 sec - in org.apache.hadoop.hbase.regionserver.TestRecoveredEdits
Running org.apache.hadoop.hbase.regionserver.TestClusterId
Running org.apache.hadoop.hbase.regionserver.TestScannerRetriableFailure
Running org.apache.hadoop.hbase.regionserver.TestRegionServerNoMaster
Running org.apache.hadoop.hbase.regionserver.TestScannerWithBulkload
Tests run: 4, Failures: 0, Errors: 0, Skipped: 0, Time elapsed: 18.131 sec - in org.apache.hadoop.hbase.regionserver.TestRegionServerNoMaster
Running org.apache.hadoop.hbase.regionserver.TestRegionServerHostname
Tests run: 3, Failures: 0, Errors: 0, Skipped: 0, Time elapsed: 17.926 sec - in org.apache.hadoop.hbase.regionserver.TestScannerWithBulkload
Running org.apache.hadoop.hbase.regionserver.TestCompaction
Tests run: 1, Failures: 0, Errors: 0, Skipped: 0, Time elapsed: 38.923 sec - in org.apache.hadoop.hbase.regionserver.TestScannerRetriableFailure
Tests run: 2, Failures: 0, Errors: 0, Skipped: 0, Time elapsed: 48.911 sec - in org.apache.hadoop.hbase.regionserver.TestClusterId
Running org.apache.hadoop.hbase.regionserver.TestSplitWalDataLoss
Running org.apache.hadoop.hbase.regionserver.TestPerColumnFamilyFlush
Tests run: 2, Failures: 0, Errors: 0, Skipped: 0, Time elapsed: 38.399 sec - in org.apache.hadoop.hbase.regionserver.TestRegionServerHostname
Tests run: 5, Failures: 0, Errors: 0, Skipped: 0, Time elapsed: 30.765 sec - in org.apache.hadoop.hbase.regionserver.TestCompaction
Tests run: 1, Failures: 0, Errors: 0, Skipped: 0, Time elapsed: 35.288 sec - in org.apache.hadoop.hbase.regionserver.TestSplitWalDataLoss
Tests run: 2, Failures: 0, Errors: 0, Skipped: 0, Time elapsed: 217.092 sec - in org.apache.hadoop.hbase.regionserver.TestCorruptedRegionStoreFile
Running org.apache.hadoop.hbase.regionserver.compactions.TestFIFOCompactionPolicy
Running org.apache.hadoop.hbase.regionserver.compactions.TestCompactedHFilesDischarger
Running org.apache.hadoop.hbase.regionserver.TestServerCustomProtocol
Tests run: 3, Failures: 0, Errors: 0, Skipped: 0, Time elapsed: 8.535 sec - in org.apache.hadoop.hbase.regionserver.compactions.TestCompactedHFilesDischarger
Running org.apache.hadoop.hbase.regionserver.TestRegionFavoredNodes
Running org.apache.hadoop.hbase.regionserver.TestSeekOptimizations
Tests run: 6, Failures: 0, Errors: 0, Skipped: 0, Time elapsed: 16.244 sec - in org.apache.hadoop.hbase.regionserver.TestSeekOptimizations
Running org.apache.hadoop.hbase.regionserver.TestHRegion
Tests run: 1, Failures: 0, Errors: 0, Skipped: 0, Time elapsed: 26.139 sec - in org.apache.hadoop.hbase.regionserver.TestRegionFavoredNodes
Running org.apache.hadoop.hbase.regionserver.TestAtomicOperation
Tests run: 4, Failures: 0, Errors: 0, Skipped: 0, Time elapsed: 68.93 sec - in org.apache.hadoop.hbase.regionserver.compactions.TestFIFOCompactionPolicy
Tests run: 7, Failures: 0, Errors: 0, Skipped: 0, Time elapsed: 60.959 sec - in org.apache.hadoop.hbase.regionserver.TestServerCustomProtocol
Running org.apache.hadoop.hbase.regionserver.TestCompactionWithCoprocessor
Running org.apache.hadoop.hbase.regionserver.TestSplitTransactionOnCluster
Tests run: 5, Failures: 0, Errors: 0, Skipped: 0, Time elapsed: 36.319 sec - in org.apache.hadoop.hbase.regionserver.TestCompactionWithCoprocessor
Running org.apache.hadoop.hbase.regionserver.TestHRegionServerBulkLoad
Tests run: 8, Failures: 0, Errors: 0, Skipped: 0, Time elapsed: 82.075 sec - in org.apache.hadoop.hbase.regionserver.TestAtomicOperation
Tests run: 6, Failures: 0, Errors: 0, Skipped: 1, Time elapsed: 178.47 sec - in org.apache.hadoop.hbase.regionserver.TestPerColumnFamilyFlush
Running org.apache.hadoop.hbase.regionserver.TestRemoveRegionMetrics
Running org.apache.hadoop.hbase.regionserver.TestScannerHeartbeatMessages
Tests run: 102, Failures: 0, Errors: 0, Skipped: 0, Time elapsed: 182.574 sec - in org.apache.hadoop.hbase.regionserver.TestHRegion
Tests run: 2, Failures: 0, Errors: 0, Skipped: 0, Time elapsed: 124.269 sec - in org.apache.hadoop.hbase.regionserver.TestHRegionServerBulkLoad
Tests run: 15, Failures: 0, Errors: 0, Skipped: 0, Time elapsed: 144.038 sec - in org.apache.hadoop.hbase.regionserver.TestSplitTransactionOnCluster
Running org.apache.hadoop.hbase.regionserver.TestRegionServerOnlineConfigChange
Running org.apache.hadoop.hbase.regionserver.TestEncryptionRandomKeying
Tests run: 2, Failures: 0, Errors: 0, Skipped: 0, Time elapsed: 2.847 sec - in org.apache.hadoop.hbase.regionserver.TestRegionServerOnlineConfigChange
Tests run: 1, Failures: 0, Errors: 0, Skipped: 0, Time elapsed: 1.897 sec - in org.apache.hadoop.hbase.regionserver.TestEncryptionRandomKeying
Running org.apache.hadoop.hbase.TestRegionRebalancing
Running org.apache.hadoop.hbase.regionserver.TestEndToEndSplitTransaction
Running org.apache.hadoop.hbase.TestPartialResultsFromClientSide
Tests run: 2, Failures: 0, Errors: 0, Skipped: 0, Time elapsed: 27.079 sec - in org.apache.hadoop.hbase.regionserver.TestEndToEndSplitTransaction
Tests run: 1, Failures: 0, Errors: 0, Skipped: 0, Time elapsed: 162.592 sec - in org.apache.hadoop.hbase.regionserver.TestRemoveRegionMetrics
Running org.apache.hadoop.hbase.quotas.TestQuotaThrottle
Tests run: 2, Failures: 0, Errors: 0, Skipped: 0, Time elapsed: 73.748 sec - in org.apache.hadoop.hbase.TestRegionRebalancing
Tests run: 1, Failures: 0, Errors: 0, Skipped: 0, Time elapsed: 175.784 sec - in org.apache.hadoop.hbase.regionserver.TestScannerHeartbeatMessages
Running org.apache.hadoop.hbase.quotas.TestQuotaAdmin
Running org.apache.hadoop.hbase.io.encoding.TestEncodedSeekers
Tests run: 3, Failures: 0, Errors: 0, Skipped: 0, Time elapsed: 7.166 sec - in org.apache.hadoop.hbase.quotas.TestQuotaAdmin
Running org.apache.hadoop.hbase.io.encoding.TestDataBlockEncoders
Running org.apache.hadoop.hbase.quotas.TestQuotaTableUtil
Tests run: 12, Failures: 0, Errors: 0, Skipped: 0, Time elapsed: 43.276 sec - in org.apache.hadoop.hbase.quotas.TestQuotaThrottle
Tests run: 3, Failures: 0, Errors: 0, Skipped: 0, Time elapsed: 2.956 sec - in org.apache.hadoop.hbase.quotas.TestQuotaTableUtil
Running org.apache.hadoop.hbase.io.encoding.TestLoadAndSwitchEncodeOnDisk
Running org.apache.hadoop.hbase.io.encoding.TestChangingEncoding
Tests run: 1, Failures: 0, Errors: 0, Skipped: 0, Time elapsed: 60.779 sec - in org.apache.hadoop.hbase.io.encoding.TestLoadAndSwitchEncodeOnDisk
Tests run: 18, Failures: 0, Errors: 0, Skipped: 0, Time elapsed: 148.461 sec - in org.apache.hadoop.hbase.TestPartialResultsFromClientSide
Running org.apache.hadoop.hbase.io.encoding.TestBufferedDataBlockEncoder
Running org.apache.hadoop.hbase.io.hfile.TestCacheOnWrite
Tests run: 2, Failures: 0, Errors: 0, Skipped: 0, Time elapsed: 27.238 sec - in org.apache.hadoop.hbase.io.encoding.TestBufferedDataBlockEncoder
Running org.apache.hadoop.hbase.io.hfile.TestSeekBeforeWithInlineBlocks
Tests run: 1, Failures: 0, Errors: 0, Skipped: 0, Time elapsed: 24.999 sec - in org.apache.hadoop.hbase.io.hfile.TestSeekBeforeWithInlineBlocks
Running org.apache.hadoop.hbase.io.hfile.TestCacheConfig
Tests run: 7, Failures: 0, Errors: 0, Skipped: 0, Time elapsed: 5.54 sec - in org.apache.hadoop.hbase.io.hfile.TestCacheConfig
Running org.apache.hadoop.hbase.io.hfile.TestHFileSeek
Tests run: 1, Failures: 0, Errors: 0, Skipped: 0, Time elapsed: 5.335 sec - in org.apache.hadoop.hbase.io.hfile.TestHFileSeek
Tests run: 56, Failures: 0, Errors: 0, Skipped: 0, Time elapsed: 180.249 sec - in org.apache.hadoop.hbase.io.encoding.TestDataBlockEncoders
Running org.apache.hadoop.hbase.io.hfile.TestHFileBlock
Running org.apache.hadoop.hbase.io.hfile.TestHFileBackedByBucketCache
Tests run: 1, Failures: 0, Errors: 0, Skipped: 0, Time elapsed: 3.369 sec - in org.apache.hadoop.hbase.io.hfile.TestHFileBackedByBucketCache
Running org.apache.hadoop.hbase.io.hfile.TestForceCacheImportantBlocks
Tests run: 2, Failures: 0, Errors: 0, Skipped: 0, Time elapsed: 56.092 sec - in org.apache.hadoop.hbase.io.hfile.TestForceCacheImportantBlocks
Running org.apache.hadoop.hbase.io.hfile.TestScannerFromBucketCache
Tests run: 3, Failures: 0, Errors: 0, Skipped: 0, Time elapsed: 225.795 sec - in org.apache.hadoop.hbase.io.encoding.TestChangingEncoding
Tests run: 20, Failures: 0, Errors: 0, Skipped: 0, Time elapsed: 277.046 sec - in org.apache.hadoop.hbase.io.encoding.TestEncodedSeekers
Running org.apache.hadoop.hbase.io.hfile.TestScannerSelectionUsingTTL
Running org.apache.hadoop.hbase.io.hfile.TestHFileBlockIndex
Tests run: 4, Failures: 0, Errors: 0, Skipped: 0, Time elapsed: 12.353 sec - in org.apache.hadoop.hbase.io.hfile.TestScannerFromBucketCache
Running org.apache.hadoop.hbase.io.TestFileLink
Tests run: 28, Failures: 0, Errors: 0, Skipped: 0, Time elapsed: 105.301 sec - in org.apache.hadoop.hbase.io.hfile.TestHFileBlock
Tests run: 10, Failures: 0, Errors: 0, Skipped: 0, Time elapsed: 25.673 sec - in org.apache.hadoop.hbase.io.hfile.TestHFileBlockIndex
Tests run: 5, Failures: 0, Errors: 0, Skipped: 0, Time elapsed: 35.509 sec - in org.apache.hadoop.hbase.io.TestFileLink
Running org.apache.hadoop.hbase.security.access.TestAccessController
Running org.apache.hadoop.hbase.security.access.TestTablePermissions
Tests run: 6, Failures: 0, Errors: 0, Skipped: 0, Time elapsed: 69.53 sec - in org.apache.hadoop.hbase.io.hfile.TestScannerSelectionUsingTTL
Running org.apache.hadoop.hbase.security.access.TestAccessController3
Tests run: 1, Failures: 0, Errors: 0, Skipped: 0, Time elapsed: 9.061 sec - in org.apache.hadoop.hbase.security.access.TestAccessController3
Tests run: 7, Failures: 0, Errors: 0, Skipped: 0, Time elapsed: 30.188 sec - in org.apache.hadoop.hbase.security.access.TestTablePermissions
Running org.apache.hadoop.hbase.security.access.TestCellACLs
Running org.apache.hadoop.hbase.security.access.TestAccessControlFilter
Tests run: 1, Failures: 0, Errors: 0, Skipped: 0, Time elapsed: 8.283 sec - in org.apache.hadoop.hbase.security.access.TestAccessControlFilter
Tests run: 2, Failures: 0, Errors: 0, Skipped: 0, Time elapsed: 23.837 sec - in org.apache.hadoop.hbase.security.access.TestCellACLs
Running org.apache.hadoop.hbase.security.access.TestNamespaceCommands
Tests run: 7, Failures: 0, Errors: 0, Skipped: 0, Time elapsed: 16.428 sec - in org.apache.hadoop.hbase.security.access.TestNamespaceCommands
Running org.apache.hadoop.hbase.security.access.TestCellACLWithMultipleVersions
Running org.apache.hadoop.hbase.security.access.TestAccessController2
Running org.apache.hadoop.hbase.security.access.TestZKPermissionsWatcher
Tests run: 72, Failures: 0, Errors: 0, Skipped: 0, Time elapsed: 340.77 sec - in org.apache.hadoop.hbase.io.hfile.TestCacheOnWrite
Tests run: 1, Failures: 0, Errors: 0, Skipped: 0, Time elapsed: 4.884 sec - in org.apache.hadoop.hbase.security.access.TestZKPermissionsWatcher
Tests run: 63, Failures: 0, Errors: 0, Skipped: 0, Time elapsed: 125.404 sec - in org.apache.hadoop.hbase.security.access.TestAccessController
Running org.apache.hadoop.hbase.security.access.TestWithDisabledAuthorization
Running org.apache.hadoop.hbase.security.access.TestScanEarlyTermination
Running org.apache.hadoop.hbase.security.visibility.TestVisibilityLablesWithGroups
Tests run: 1, Failures: 0, Errors: 0, Skipped: 0, Time elapsed: 12.078 sec - in org.apache.hadoop.hbase.security.access.TestScanEarlyTermination
Tests run: 1, Failures: 0, Errors: 0, Skipped: 0, Time elapsed: 5.788 sec - in org.apache.hadoop.hbase.security.visibility.TestVisibilityLablesWithGroups
Tests run: 8, Failures: 0, Errors: 0, Skipped: 0, Time elapsed: 71.745 sec - in org.apache.hadoop.hbase.security.access.TestCellACLWithMultipleVersions
Tests run: 6, Failures: 0, Errors: 0, Skipped: 0, Time elapsed: 81.494 sec - in org.apache.hadoop.hbase.security.access.TestAccessController2
Running org.apache.hadoop.hbase.security.visibility.TestVisibilityLabelsWithDeletes
Running org.apache.hadoop.hbase.security.visibility.TestVisibilityLabelsWithDefaultVisLabelService
Running org.apache.hadoop.hbase.security.visibility.TestVisibilityLabelsWithCustomVisLabService
Tests run: 6, Failures: 0, Errors: 0, Skipped: 0, Time elapsed: 64.586 sec - in org.apache.hadoop.hbase.security.access.TestWithDisabledAuthorization
Running org.apache.hadoop.hbase.security.visibility.TestDefaultScanLabelGeneratorStack
Tests run: 1, Failures: 0, Errors: 0, Skipped: 0, Time elapsed: 5.453 sec - in org.apache.hadoop.hbase.security.visibility.TestDefaultScanLabelGeneratorStack
Running org.apache.hadoop.hbase.security.visibility.TestVisibilityWithCheckAuths
Tests run: 2, Failures: 0, Errors: 0, Skipped: 0, Time elapsed: 10.149 sec - in org.apache.hadoop.hbase.security.visibility.TestVisibilityWithCheckAuths
Running org.apache.hadoop.hbase.security.visibility.TestVisibilityLabelsOpWithDifferentUsersNoACL
Tests run: 1, Failures: 0, Errors: 0, Skipped: 0, Time elapsed: 5.414 sec - in org.apache.hadoop.hbase.security.visibility.TestVisibilityLabelsOpWithDifferentUsersNoACL
Tests run: 26, Failures: 0, Errors: 0, Skipped: 0, Time elapsed: 69.898 sec - in org.apache.hadoop.hbase.security.visibility.TestVisibilityLabelsWithDefaultVisLabelService
Tests run: 21, Failures: 0, Errors: 0, Skipped: 0, Time elapsed: 60.532 sec - in org.apache.hadoop.hbase.security.visibility.TestVisibilityLabelsWithCustomVisLabService
Running org.apache.hadoop.hbase.security.visibility.TestVisibilityLabelsReplication
Running org.apache.hadoop.hbase.security.visibility.TestVisibilityLabelReplicationWithExpAsString
Running org.apache.hadoop.hbase.security.visibility.TestVisibilityLabelsWithSLGStack
Running org.apache.hadoop.hbase.security.visibility.TestEnforcingScanLabelGenerator
Tests run: 1, Failures: 0, Errors: 0, Skipped: 0, Time elapsed: 5.378 sec - in org.apache.hadoop.hbase.security.visibility.TestVisibilityLabelsWithSLGStack
Tests run: 1, Failures: 0, Errors: 0, Skipped: 0, Time elapsed: 6.151 sec - in org.apache.hadoop.hbase.security.visibility.TestEnforcingScanLabelGenerator
Tests run: 1, Failures: 0, Errors: 0, Skipped: 0, Time elapsed: 51.053 sec - in org.apache.hadoop.hbase.security.visibility.TestVisibilityLabelsReplication
Tests run: 1, Failures: 0, Errors: 0, Skipped: 0, Time elapsed: 50.552 sec - in org.apache.hadoop.hbase.security.visibility.TestVisibilityLabelReplicationWithExpAsString
Running org.apache.hadoop.hbase.security.token.TestZKSecretWatcher
Running org.apache.hadoop.hbase.security.token.TestTokenAuthentication
Running org.apache.hadoop.hbase.security.visibility.TestVisibilityLabelsWithACL
Tests run: 3, Failures: 0, Errors: 0, Skipped: 0, Time elapsed: 1.465 sec - in org.apache.hadoop.hbase.security.token.TestTokenAuthentication
Running org.apache.hadoop.hbase.security.visibility.TestWithDisabledAuthorization
Tests run: 2, Failures: 0, Errors: 0, Skipped: 0, Time elapsed: 5.207 sec - in org.apache.hadoop.hbase.security.visibility.TestWithDisabledAuthorization
Tests run: 1, Failures: 0, Errors: 0, Skipped: 0, Time elapsed: 13.824 sec - in org.apache.hadoop.hbase.security.token.TestZKSecretWatcher
Running org.apache.hadoop.hbase.TestHBaseOnOtherDfsCluster
Tests run: 5, Failures: 0, Errors: 0, Skipped: 0, Time elapsed: 15.08 sec - in org.apache.hadoop.hbase.security.visibility.TestVisibilityLabelsWithACL
Tests run: 44, Failures: 0, Errors: 0, Skipped: 0, Time elapsed: 176.106 sec - in org.apache.hadoop.hbase.security.visibility.TestVisibilityLabelsWithDeletes
Tests run: 1, Failures: 0, Errors: 0, Skipped: 0, Time elapsed: 26.681 sec - in org.apache.hadoop.hbase.TestHBaseOnOtherDfsCluster
Running org.apache.hadoop.hbase.security.token.TestGenerateDelegationToken
Tests run: 1, Failures: 0, Errors: 0, Skipped: 0, Time elapsed: 6.201 sec - in org.apache.hadoop.hbase.security.token.TestGenerateDelegationToken

Results :

Failed tests: 
  TestBlockEvictionFromClient.testBlockEvictionAfterHBASE13082WithCompactionAndFlush:1041
expected:<3> but was:<2>
  TestStochasticLoadBalancer2.testRegionReplicasOnMidClusterHighReplication:73->BalancerTestBase.testWithCluster:422->BalancerTestBase.testWithCluster:450->BalancerTestBase.assertRegionReplicaPlacement:225
Two or more region replicas are hosted on the same host after balance

Tests run: 2670, Failures: 2, Errors: 0, Skipped: 65

[INFO] ------------------------------------------------------------------------
[INFO] Reactor Summary:
[INFO] 
[INFO] Apache HBase ...................................... SUCCESS [  6.912 s]
[INFO] Apache HBase - Checkstyle ......................... SUCCESS [  1.682 s]
[INFO] Apache HBase - Resource Bundle .................... SUCCESS [  0.423 s]
[INFO] Apache HBase - Annotations ........................ SUCCESS [  0.460 s]
[INFO] Apache HBase - Protocol ........................... SUCCESS [  5.696 s]
[INFO] Apache HBase - Common ............................. SUCCESS [02:44 min]
[INFO] Apache HBase - Procedure .......................... SUCCESS [03:40 min]
[INFO] Apache HBase - Client ............................. SUCCESS [01:11 min]
[INFO] Apache HBase - Hadoop Compatibility ............... SUCCESS [ 10.899 s]
[INFO] Apache HBase - Hadoop Two Compatibility ........... SUCCESS [ 17.459 s]
[INFO] Apache HBase - Prefix Tree ........................ SUCCESS [ 23.658 s]
[INFO] Apache HBase - Server ............................. FAILURE [  02:45 h]
[INFO] Apache HBase - Testing Util ....................... SKIPPED
[INFO] Apache HBase - Thrift ............................. SKIPPED
[INFO] Apache HBase - RSGroup ............................ SKIPPED
[INFO] Apache HBase - Shell .............................. SKIPPED
[INFO] Apache HBase - Integration Tests .................. SKIPPED
[INFO] Apache HBase - Examples ........................... SKIPPED
[INFO] Apache HBase - Rest ............................... SKIPPED
[INFO] Apache HBase - External Block Cache ............... SKIPPED
[INFO] Apache HBase - Spark .............................. SKIPPED
[INFO] Apache HBase - Assembly ........................... SKIPPED
[INFO] Apache HBase - Shaded ............................. SKIPPED
[INFO] Apache HBase - Shaded - Client .................... SKIPPED
[INFO] Apache HBase - Shaded - Server .................... SKIPPED
[INFO] Apache HBase - Archetypes ......................... SKIPPED
[INFO] Apache HBase - Exemplar for hbase-client archetype  SKIPPED
[INFO] Apache HBase - Exemplar for hbase-shaded-client archetype  SKIPPED
[INFO] Apache HBase - Archetype builder .................. SKIPPED
[INFO] ------------------------------------------------------------------------
[INFO] BUILD FAILURE
[INFO] ------------------------------------------------------------------------
[INFO] Total time: 02:54 h
[INFO] Finished at: 2016-03-21T12:57:42+00:00
[INFO] Final Memory: 69M/653M
[INFO] ------------------------------------------------------------------------
[ERROR] Failed to execute goal org.apache.maven.plugins:maven-surefire-plugin:2.18.1:test
(secondPartTestsExecution) on project hbase-server: There was a timeout or other error in
the fork -> [Help 1]
[ERROR] 
[ERROR] To see the full stack trace of the errors, re-run Maven with the -e switch.
[ERROR] Re-run Maven using the -X switch to enable full debug logging.
[ERROR] 
[ERROR] For more information about the errors and possible solutions, please read the following
articles:
[ERROR] [Help 1] http://cwiki.apache.org/confluence/display/MAVEN/MojoFailureException
[ERROR] 
[ERROR] After correcting the problems, you can resume the build with the command
[ERROR]   mvn <goals> -rf :hbase-server
Build step 'Invoke top-level Maven targets' marked build as failure
Performing Post build task...
Match found for :.* : True
Logical operation result is TRUE
Running script  : # Run zombie detector script
./dev-support/zombie-detector.sh --jenkins ${BUILD_ID}
[yahoo-not-h2] $ /bin/bash -xe /tmp/hudson7285721618028491197.sh
+ ./dev-support/zombie-detector.sh --jenkins 793
Mon Mar 21 12:57:45 UTC 2016 We're ok: there is no zombie test


    {color:green}+1 zombies{color}. No zombie tests found running at the end of the build.
POST BUILD TASK : SUCCESS
END OF POST BUILD TASK : 0
Archiving artifacts
Recording test results
[FINDBUGS] Skipping publisher since build result is FAILURE
[CHECKSTYLE] Skipping publisher since build result is FAILURE

Mime
View raw message