hbase-builds mailing list archives

Site index · List index
Message view « Date » · « Thread »
Top « Date » · « Thread »
From Apache Jenkins Server <jenk...@builds.apache.org>
Subject Build failed in Jenkins: HBase-1.1-JDK8 #1776
Date Tue, 29 Mar 2016 01:33:15 GMT
See <https://builds.apache.org/job/HBase-1.1-JDK8/1776/changes>

Changes:

[busbey] Revert "HBASE-15508 Add command for exporting snapshot in hbase command

------------------------------------------
[...truncated 3750 lines...]
	at org.apache.hadoop.hbase.master.handler.TestEnableTableHandler.testEnableTableWithNoRegionServers(TestEnableTableHandler.java:123)

Tests run: 1, Failures: 0, Errors: 0, Skipped: 0, Time elapsed: 44.595 sec - in org.apache.hadoop.hbase.master.TestWarmupRegion
Java HotSpot(TM) 64-Bit Server VM warning: ignoring option MaxPermSize=256m; support was removed
in 8.0
Java HotSpot(TM) 64-Bit Server VM warning: ignoring option MaxPermSize=256m; support was removed
in 8.0
Running org.apache.hadoop.hbase.master.TestSplitLogManager
Tests run: 1, Failures: 0, Errors: 0, Skipped: 0, Time elapsed: 39.284 sec - in org.apache.hadoop.hbase.master.TestGetInfoPort
Java HotSpot(TM) 64-Bit Server VM warning: ignoring option MaxPermSize=256m; support was removed
in 8.0
Running org.apache.hadoop.hbase.master.TestRollingRestart
Tests run: 1, Failures: 0, Errors: 0, Skipped: 0, Time elapsed: 191.294 sec - in org.apache.hadoop.hbase.master.handler.TestEnableTableHandler
Java HotSpot(TM) 64-Bit Server VM warning: ignoring option MaxPermSize=256m; support was removed
in 8.0
Running org.apache.hadoop.hbase.master.TestMasterPriorityRpc
Tests run: 3, Failures: 0, Errors: 0, Skipped: 0, Time elapsed: 7.893 sec - in org.apache.hadoop.hbase.master.TestMasterPriorityRpc
Java HotSpot(TM) 64-Bit Server VM warning: ignoring option MaxPermSize=256m; support was removed
in 8.0
Tests run: 1, Failures: 0, Errors: 0, Skipped: 0, Time elapsed: 42.047 sec - in org.apache.hadoop.hbase.master.TestGetLastFlushedSequenceId
Java HotSpot(TM) 64-Bit Server VM warning: ignoring option MaxPermSize=256m; support was removed
in 8.0
Java HotSpot(TM) 64-Bit Server VM warning: ignoring option MaxPermSize=256m; support was removed
in 8.0
Running org.apache.hadoop.hbase.master.TestMasterTransitions
Tests run: 3, Failures: 0, Errors: 0, Skipped: 3, Time elapsed: 0.005 sec - in org.apache.hadoop.hbase.master.TestMasterTransitions
Java HotSpot(TM) 64-Bit Server VM warning: ignoring option MaxPermSize=256m; support was removed
in 8.0
Running org.apache.hadoop.hbase.master.TestProcedureConf
Running org.apache.hadoop.hbase.master.TestMasterFileSystem
Tests run: 2, Failures: 0, Errors: 0, Skipped: 0, Time elapsed: 2.229 sec - in org.apache.hadoop.hbase.master.TestMasterFileSystem
Java HotSpot(TM) 64-Bit Server VM warning: ignoring option MaxPermSize=256m; support was removed
in 8.0
Tests run: 1, Failures: 0, Errors: 0, Skipped: 0, Time elapsed: 69.211 sec - in org.apache.hadoop.hbase.master.TestRollingRestart
Java HotSpot(TM) 64-Bit Server VM warning: ignoring option MaxPermSize=256m; support was removed
in 8.0
Java HotSpot(TM) 64-Bit Server VM warning: ignoring option MaxPermSize=256m; support was removed
in 8.0
Java HotSpot(TM) 64-Bit Server VM warning: ignoring option MaxPermSize=256m; support was removed
in 8.0
Running org.apache.hadoop.hbase.master.TestDistributedLogSplitting
Tests run: 3, Failures: 0, Errors: 0, Skipped: 0, Time elapsed: 54.988 sec - in org.apache.hadoop.hbase.master.TestProcedureConf
Java HotSpot(TM) 64-Bit Server VM warning: ignoring option MaxPermSize=256m; support was removed
in 8.0
Running org.apache.hadoop.hbase.master.TestMasterFailover
Running org.apache.hadoop.hbase.master.TestAssignmentManagerOnCluster
Tests run: 15, Failures: 0, Errors: 0, Skipped: 0, Time elapsed: 152.803 sec - in org.apache.hadoop.hbase.master.TestSplitLogManager
Java HotSpot(TM) 64-Bit Server VM warning: ignoring option MaxPermSize=256m; support was removed
in 8.0
Java HotSpot(TM) 64-Bit Server VM warning: ignoring option MaxPermSize=256m; support was removed
in 8.0
Java HotSpot(TM) 64-Bit Server VM warning: ignoring option MaxPermSize=256m; support was removed
in 8.0
Running org.apache.hadoop.hbase.master.snapshot.TestSnapshotFileCache
Tests run: 5, Failures: 0, Errors: 0, Skipped: 0, Time elapsed: 74.306 sec - in org.apache.hadoop.hbase.master.snapshot.TestSnapshotFileCache
Java HotSpot(TM) 64-Bit Server VM warning: ignoring option MaxPermSize=256m; support was removed
in 8.0
Java HotSpot(TM) 64-Bit Server VM warning: ignoring option MaxPermSize=256m; support was removed
in 8.0
Tests run: 7, Failures: 0, Errors: 0, Skipped: 0, Time elapsed: 174.321 sec - in org.apache.hadoop.hbase.master.TestMasterFailover
Java HotSpot(TM) 64-Bit Server VM warning: ignoring option MaxPermSize=256m; support was removed
in 8.0
Running org.apache.hadoop.hbase.master.TestMasterMetrics
Tests run: 2, Failures: 0, Errors: 0, Skipped: 0, Time elapsed: 1.868 sec - in org.apache.hadoop.hbase.master.TestMasterMetrics
Java HotSpot(TM) 64-Bit Server VM warning: ignoring option MaxPermSize=256m; support was removed
in 8.0
Running org.apache.hadoop.hbase.master.TestMasterFailoverBalancerPersistence
Running org.apache.hadoop.hbase.master.TestMaster
Tests run: 4, Failures: 0, Errors: 0, Skipped: 0, Time elapsed: 32.867 sec - in org.apache.hadoop.hbase.master.TestMaster
Java HotSpot(TM) 64-Bit Server VM warning: ignoring option MaxPermSize=256m; support was removed
in 8.0
Tests run: 21, Failures: 0, Errors: 0, Skipped: 0, Time elapsed: 214.796 sec - in org.apache.hadoop.hbase.master.TestAssignmentManagerOnCluster
Running org.apache.hadoop.hbase.master.TestMasterShutdown
Java HotSpot(TM) 64-Bit Server VM warning: ignoring option MaxPermSize=256m; support was removed
in 8.0
Tests run: 1, Failures: 0, Errors: 0, Skipped: 0, Time elapsed: 38.226 sec - in org.apache.hadoop.hbase.master.TestMasterFailoverBalancerPersistence
Java HotSpot(TM) 64-Bit Server VM warning: ignoring option MaxPermSize=256m; support was removed
in 8.0
Running org.apache.hadoop.hbase.master.TestMasterStatusServlet
Tests run: 4, Failures: 0, Errors: 0, Skipped: 0, Time elapsed: 5.759 sec - in org.apache.hadoop.hbase.master.TestMasterStatusServlet
Java HotSpot(TM) 64-Bit Server VM warning: ignoring option MaxPermSize=256m; support was removed
in 8.0
Running org.apache.hadoop.hbase.master.TestMasterOperationsForRegionReplicas
Running org.apache.hadoop.hbase.master.TestMasterMetricsWrapper
Tests run: 2, Failures: 0, Errors: 0, Skipped: 0, Time elapsed: 58.152 sec - in org.apache.hadoop.hbase.master.TestMasterShutdown
Tests run: 1, Failures: 0, Errors: 0, Skipped: 0, Time elapsed: 2.982 sec - in org.apache.hadoop.hbase.master.TestMasterMetricsWrapper
Java HotSpot(TM) 64-Bit Server VM warning: ignoring option MaxPermSize=256m; support was removed
in 8.0
Java HotSpot(TM) 64-Bit Server VM warning: ignoring option MaxPermSize=256m; support was removed
in 8.0
Running org.apache.hadoop.hbase.master.TestHMasterRPCException
Running org.apache.hadoop.hbase.master.TestTableLockManager
Tests run: 1, Failures: 0, Errors: 0, Skipped: 0, Time elapsed: 13.689 sec - in org.apache.hadoop.hbase.master.TestHMasterRPCException
Java HotSpot(TM) 64-Bit Server VM warning: ignoring option MaxPermSize=256m; support was removed
in 8.0
Running org.apache.hadoop.hbase.master.TestActiveMasterManager
Tests run: 2, Failures: 0, Errors: 0, Skipped: 0, Time elapsed: 4.266 sec - in org.apache.hadoop.hbase.master.TestActiveMasterManager
Java HotSpot(TM) 64-Bit Server VM warning: ignoring option MaxPermSize=256m; support was removed
in 8.0
Tests run: 2, Failures: 0, Errors: 0, Skipped: 0, Time elapsed: 56.045 sec - in org.apache.hadoop.hbase.master.TestMasterOperationsForRegionReplicas
Tests run: 4, Failures: 0, Errors: 0, Skipped: 0, Time elapsed: 148.806 sec - in org.apache.hadoop.hbase.master.TestTableLockManager
Tests run: 18, Failures: 0, Errors: 0, Skipped: 1, Time elapsed: 474.447 sec - in org.apache.hadoop.hbase.master.TestDistributedLogSplitting

Results :

Tests in error: 
org.apache.hadoop.hbase.procedure.TestZKProcedureControllers.testZKCoordinatorControllerMultipleCohort(org.apache.hadoop.hbase.procedure.TestZKProcedureControllers)
  Run 1: TestZKProcedureControllers.testZKCoordinatorControllerMultipleCohort:168->runMockCommitWithOrchestratedControllers:235->verifyCohort:364

procedureMember.submitSubprocedure(<any>);
Wanted 3 times:
-> at org.apache.hadoop.hbase.procedure.TestZKProcedureControllers.verifyCohort(TestZKProcedureControllers.java:364)
But was 6 times. Undesired invocation:
-> at org.apache.hadoop.hbase.procedure.ZKProcedureMemberRpcs.startNewSubprocedure(ZKProcedureMemberRpcs.java:214)

  Run 2: TestZKProcedureControllers.testZKCoordinatorControllerMultipleCohort:166->runMockCommitWithOrchestratedControllers:191
» ConnectionLoss
  Run 3: TestZKProcedureControllers.testZKCoordinatorControllerMultipleCohort:166->runMockCommitWithOrchestratedControllers:191
» ConnectionLoss

org.apache.hadoop.hbase.regionserver.TestWALLockup.testLockupWhenSyncInMiddleOfZigZagSetup(org.apache.hadoop.hbase.regionserver.TestWALLockup)
  Run 1: TestWALLockup.testLockupWhenSyncInMiddleOfZigZagSetup » DamagedWAL Append sequ...
  Run 2: TestWALLockup.testLockupWhenSyncInMiddleOfZigZagSetup » DamagedWAL Append sequ...
  Run 3: TestWALLockup.testLockupWhenSyncInMiddleOfZigZagSetup » DamagedWAL Append sequ...

org.apache.hadoop.hbase.util.TestHBaseFsck.testQuarantineMissingHFile(org.apache.hadoop.hbase.util.TestHBaseFsck)
  Run 1: TestHBaseFsck.testQuarantineMissingHFile:2177->doQuarantineTest:2148->cleanupTable:475->deleteTable:2816
» TableNotDisabled
  Run 2: TestHBaseFsck.testQuarantineMissingHFile:2177->doQuarantineTest:2148->cleanupTable:475->deleteTable:2816
» TableNotDisabled
  Run 3: TestHBaseFsck.testQuarantineMissingHFile:2177->doQuarantineTest:2148->cleanupTable:475->deleteTable:2816
» TableNotDisabled

Flaked tests: 
org.apache.hadoop.hbase.master.TestAssignmentManager.testBalanceOnMasterFailoverScenarioWithOfflineNode(org.apache.hadoop.hbase.master.TestAssignmentManager)
  Run 1: TestAssignmentManager.testBalanceOnMasterFailoverScenarioWithOfflineNode:364 expected
not same
  Run 2: TestAssignmentManager.testBalanceOnMasterFailoverScenarioWithOfflineNode:364 expected
not same
  Run 3: PASS

org.apache.hadoop.hbase.master.handler.TestEnableTableHandler.testEnableTableWithNoRegionServers(org.apache.hadoop.hbase.master.handler.TestEnableTableHandler)
  Run 1: TestEnableTableHandler.testEnableTableWithNoRegionServers:123 Waiting timed out after
[60,000] msec table enabled in zk,
  Run 2: PASS

org.apache.hadoop.hbase.regionserver.TestFailedAppendAndSync.testLockupAroundBadAssignSync(org.apache.hadoop.hbase.regionserver.TestFailedAppendAndSync)
  Run 1: TestFailedAppendAndSync.testLockupAroundBadAssignSync:239 » TestTimedOut test ...
  Run 2: PASS

org.apache.hadoop.hbase.regionserver.TestRegionServerHostname.testInvalidRegionServerHostnameAbortsServer(org.apache.hadoop.hbase.regionserver.TestRegionServerHostname)
  Run 1: TestRegionServerHostname.testInvalidRegionServerHostnameAbortsServer:53 » TestTimedOut
  Run 2: TestRegionServerHostname.testInvalidRegionServerHostnameAbortsServer:53 » IllegalState
  Run 3: PASS

org.apache.hadoop.hbase.regionserver.TestRegionServerHostname.testRegionServerHostname(org.apache.hadoop.hbase.regionserver.TestRegionServerHostname)
  Run 1: TestRegionServerHostname.testRegionServerHostname:86 » IllegalState A mini-clu...
  Run 2: PASS

org.apache.hadoop.hbase.util.TestHBaseFsck.testHbckThreadpooling(org.apache.hadoop.hbase.util.TestHBaseFsck)
  Run 1: TestHBaseFsck.testHbckThreadpooling:516 expected:<[]> but was:<[NOT_IN_META_OR_DEPLOYED,
HOLE_IN_REGION_CHAIN]>
  Run 2: TestHBaseFsck.testHbckThreadpooling:516 expected:<[]> but was:<[NOT_IN_META_OR_DEPLOYED,
HOLE_IN_REGION_CHAIN]>
  Run 3: PASS

org.apache.hadoop.hbase.util.TestHBaseFsck.testQuarantineMissingRegionDir(org.apache.hadoop.hbase.util.TestHBaseFsck)
  Run 1: TestHBaseFsck.testQuarantineMissingRegionDir:2236->doQuarantineTest:2148->cleanupTable:475->deleteTable:2816
» TableNotDisabled
  Run 2: TestHBaseFsck.testQuarantineMissingRegionDir:2236->doQuarantineTest:2148->cleanupTable:475->deleteTable:2816
» TableNotDisabled
  Run 3: PASS


Tests run: 2408, Failures: 0, Errors: 3, Skipped: 21, Flakes: 7

[INFO] ------------------------------------------------------------------------
[INFO] Reactor Summary:
[INFO] 
[INFO] Apache HBase ...................................... SUCCESS [10.084s]
[INFO] Apache HBase - Checkstyle ......................... SUCCESS [2.834s]
[INFO] Apache HBase - Resource Bundle .................... SUCCESS [0.672s]
[INFO] Apache HBase - Annotations ........................ SUCCESS [3.088s]
[INFO] Apache HBase - Protocol ........................... SUCCESS [32.618s]
[INFO] Apache HBase - Common ............................. SUCCESS [2:47.514s]
[INFO] Apache HBase - Procedure .......................... SUCCESS [3:54.204s]
[INFO] Apache HBase - Client ............................. SUCCESS [2:16.420s]
[INFO] Apache HBase - Hadoop Compatibility ............... SUCCESS [12.821s]
[INFO] Apache HBase - Hadoop Two Compatibility ........... SUCCESS [16.792s]
[INFO] Apache HBase - Prefix Tree ........................ SUCCESS [21.918s]
[INFO] Apache HBase - Server ............................. FAILURE [3:41:04.195s]
[INFO] Apache HBase - Testing Util ....................... SKIPPED
[INFO] Apache HBase - Thrift ............................. SKIPPED
[INFO] Apache HBase - Rest ............................... SKIPPED
[INFO] Apache HBase - Shell .............................. SKIPPED
[INFO] Apache HBase - Integration Tests .................. SKIPPED
[INFO] Apache HBase - Examples ........................... SKIPPED
[INFO] Apache HBase - Assembly ........................... SKIPPED
[INFO] Apache HBase - Shaded ............................. SKIPPED
[INFO] Apache HBase - Shaded - Client .................... SKIPPED
[INFO] Apache HBase - Shaded - Server .................... SKIPPED
[INFO] ------------------------------------------------------------------------
[INFO] BUILD FAILURE
[INFO] ------------------------------------------------------------------------
[INFO] Total time: 3:51:47.382s
[INFO] Finished at: Tue Mar 29 01:29:02 UTC 2016
[INFO] Final Memory: 431M/841M
[INFO] ------------------------------------------------------------------------
[ERROR] Failed to execute goal org.apache.maven.plugins:maven-surefire-plugin:2.18.1:test
(secondPartTestsExecution) on project hbase-server: There was a timeout or other error in
the fork -> [Help 1]
[ERROR] 
[ERROR] To see the full stack trace of the errors, re-run Maven with the -e switch.
[ERROR] Re-run Maven using the -X switch to enable full debug logging.
[ERROR] 
[ERROR] For more information about the errors and possible solutions, please read the following
articles:
[ERROR] [Help 1] http://cwiki.apache.org/confluence/display/MAVEN/MojoFailureException
[ERROR] 
[ERROR] After correcting the problems, you can resume the build with the command
[ERROR]   mvn <goals> -rf :hbase-server
Build step 'Invoke top-level Maven targets' marked build as failure
Performing Post build task...
Match found for :.* : True
Logical operation result is TRUE
Running script  : # Post-build task script. TODO: Check this in and have all builds reference
check-in.
pwd && ls
# NOTE!!!! The below code has been copied and pasted from ./dev-tools/run-test.sh
# Do not change here without syncing there and vice-versa.
ZOMBIE_TESTS_COUNT=`jps -v | grep surefirebooter | grep -e '-Dhbase.test' | wc -l`
if [[ $ZOMBIE_TESTS_COUNT != 0 ]] ; then
 echo "Suspicious java process found - waiting 30s to see if there are just slow to stop"
 sleep 30
 ZOMBIE_TESTS_COUNT=`jps -v | grep surefirebooter | grep -e '-Dhbase.test' | wc -l`
 if [[ $ZOMBIE_TESTS_COUNT != 0 ]] ; then
   echo " {color:red}There appear to be $ZOMBIE_TESTS_COUNT zombie tests{color}, they should
have been killed by surefire but survived"
   jps -v | grep surefirebooter | grep -e '-Dhbase.test'
   jps -v | grep surefirebooter | grep -e '-Dhbase.test' | cut -d ' ' -f 1 | xargs -n 1 jstack
   # Exit with error
   exit 1
 else
   echo "We're ok: there is no zombie test, but some tests took some time to stop"
 fi
else
  echo "We're ok: there is no zombie test"
fi
[HBase-1.1-JDK8] $ /bin/bash -xe /tmp/hudson2115657790631975064.sh
+ pwd
<https://builds.apache.org/job/HBase-1.1-JDK8/ws/>
+ ls
bin
CHANGES.txt
conf
dev-support
hbase-annotations
hbase-assembly
hbase-checkstyle
hbase-client
hbase-common
hbase-examples
hbase-hadoop2-compat
hbase-hadoop-compat
hbase-it
hbase-native-client
hbase-prefix-tree
hbase-procedure
hbase-protocol
hbase-resource-bundle
hbase-rest
hbase-server
hbase-shaded
hbase-shell
hbase-testing-util
hbase-thrift
LICENSE.txt
NOTICE.txt
pom.xml
README.txt
src
target
++ wc -l
++ grep -e -Dhbase.test
++ grep surefirebooter
++ jps -v
+ ZOMBIE_TESTS_COUNT=0
+ [[ 0 != 0 ]]
+ echo 'We'\''re ok: there is no zombie test'
We're ok: there is no zombie test
POST BUILD TASK : SUCCESS
END OF POST BUILD TASK : 0
Archiving artifacts
Recording test results
Updating HBASE-15508

Mime
View raw message