hbase-builds mailing list archives

Site index · List index
Message view « Date » · « Thread »
Top « Date » · « Thread »
From Apache Jenkins Server <jenk...@builds.apache.org>
Subject Build failed in Jenkins: HBase-Trunk_matrix » latest1.7,yahoo-not-h2 #813
Date Wed, 30 Mar 2016 05:38:19 GMT
See <https://builds.apache.org/job/HBase-Trunk_matrix/jdk=latest1.7,label=yahoo-not-h2/813/changes>

Changes:

[enis] HBASE-15295 MutateTableAccess.multiMutate() does not get high priority

------------------------------------------
[...truncated 5876 lines...]
Tests run: 4, Failures: 0, Errors: 0, Skipped: 0, Time elapsed: 11.755 sec - in org.apache.hadoop.hbase.regionserver.TestMobStoreCompaction
Running org.apache.hadoop.hbase.regionserver.TestHRegionOnCluster
Tests run: 16, Failures: 0, Errors: 0, Skipped: 1, Time elapsed: 63.56 sec - in org.apache.hadoop.hbase.regionserver.TestRegionServerMetrics
Running org.apache.hadoop.hbase.regionserver.TestScannerHeartbeatMessages
Tests run: 1, Failures: 0, Errors: 0, Skipped: 0, Time elapsed: 35.989 sec - in org.apache.hadoop.hbase.regionserver.TestHRegionOnCluster
Running org.apache.hadoop.hbase.regionserver.TestRowTooBig
Tests run: 4, Failures: 0, Errors: 0, Skipped: 0, Time elapsed: 80.423 sec - in org.apache.hadoop.hbase.regionserver.TestTags
Running org.apache.hadoop.hbase.regionserver.TestPerColumnFamilyFlush
Tests run: 2, Failures: 0, Errors: 0, Skipped: 0, Time elapsed: 37.514 sec - in org.apache.hadoop.hbase.regionserver.TestRowTooBig
Running org.apache.hadoop.hbase.regionserver.TestSCVFWithMiniCluster
Tests run: 5, Failures: 0, Errors: 0, Skipped: 0, Time elapsed: 0.954 sec - in org.apache.hadoop.hbase.regionserver.TestSCVFWithMiniCluster
Running org.apache.hadoop.hbase.regionserver.TestSeekOptimizations
Tests run: 6, Failures: 0, Errors: 0, Skipped: 0, Time elapsed: 17.064 sec - in org.apache.hadoop.hbase.regionserver.TestSeekOptimizations
Running org.apache.hadoop.hbase.regionserver.TestCompactionState
Running org.apache.hadoop.hbase.regionserver.TestRegionReplicas
Tests run: 6, Failures: 0, Errors: 0, Skipped: 0, Time elapsed: 317.886 sec - in org.apache.hadoop.hbase.regionserver.TestRegionReplicaFailover
Running org.apache.hadoop.hbase.regionserver.TestCompactionWithCoprocessor
Tests run: 5, Failures: 0, Errors: 0, Skipped: 0, Time elapsed: 28.4 sec - in org.apache.hadoop.hbase.regionserver.TestCompactionWithCoprocessor
Running org.apache.hadoop.hbase.regionserver.TestStoreScanner
Tests run: 1, Failures: 0, Errors: 0, Skipped: 0, Time elapsed: 176.386 sec - in org.apache.hadoop.hbase.regionserver.TestScannerHeartbeatMessages
Tests run: 19, Failures: 0, Errors: 0, Skipped: 0, Time elapsed: 2.807 sec - in org.apache.hadoop.hbase.regionserver.TestStoreScanner
Running org.apache.hadoop.hbase.regionserver.TestHRegionReplayEvents
Tests run: 5, Failures: 0, Errors: 0, Skipped: 0, Time elapsed: 86.044 sec - in org.apache.hadoop.hbase.regionserver.TestCompactionState
Running org.apache.hadoop.hbase.regionserver.TestCacheOnWriteInSchema
Tests run: 3, Failures: 0, Errors: 0, Skipped: 0, Time elapsed: 11.723 sec - in org.apache.hadoop.hbase.regionserver.TestCacheOnWriteInSchema
Running org.apache.hadoop.hbase.regionserver.wal.TestReadOldRootAndMetaEdits
Tests run: 1, Failures: 0, Errors: 0, Skipped: 0, Time elapsed: 1.418 sec - in org.apache.hadoop.hbase.regionserver.wal.TestReadOldRootAndMetaEdits
Tests run: 6, Failures: 0, Errors: 0, Skipped: 1, Time elapsed: 174.839 sec - in org.apache.hadoop.hbase.regionserver.TestPerColumnFamilyFlush
Running org.apache.hadoop.hbase.regionserver.wal.TestWALReplayCompressed
Tests run: 26, Failures: 0, Errors: 0, Skipped: 0, Time elapsed: 54.872 sec - in org.apache.hadoop.hbase.regionserver.TestHRegionReplayEvents
Running org.apache.hadoop.hbase.regionserver.wal.TestAsyncWALReplayCompressed
Running org.apache.hadoop.hbase.regionserver.wal.TestAsyncProtobufLog
Tests run: 1, Failures: 0, Errors: 0, Skipped: 0, Time elapsed: 5.525 sec - in org.apache.hadoop.hbase.regionserver.wal.TestAsyncProtobufLog
Running org.apache.hadoop.hbase.regionserver.wal.TestFSHLog
Tests run: 6, Failures: 0, Errors: 0, Skipped: 0, Time elapsed: 11.266 sec - in org.apache.hadoop.hbase.regionserver.wal.TestFSHLog
Running org.apache.hadoop.hbase.regionserver.wal.TestLogRollingNoCluster
Running org.apache.hadoop.hbase.regionserver.wal.TestSecureWALReplay
Tests run: 12, Failures: 0, Errors: 0, Skipped: 0, Time elapsed: 71.518 sec - in org.apache.hadoop.hbase.regionserver.wal.TestWALReplayCompressed
Tests run: 1, Failures: 0, Errors: 0, Skipped: 0, Time elapsed: 29.402 sec - in org.apache.hadoop.hbase.regionserver.wal.TestLogRollingNoCluster
Running org.apache.hadoop.hbase.regionserver.wal.TestLogRollAbort
Tests run: 12, Failures: 0, Errors: 0, Skipped: 0, Time elapsed: 67.587 sec - in org.apache.hadoop.hbase.regionserver.wal.TestAsyncWALReplayCompressed
Running org.apache.hadoop.hbase.regionserver.wal.TestLogRolling
Running org.apache.hadoop.hbase.regionserver.wal.TestWALReplay
Tests run: 2, Failures: 0, Errors: 0, Skipped: 0, Time elapsed: 58.125 sec - in org.apache.hadoop.hbase.regionserver.wal.TestLogRollAbort
Tests run: 12, Failures: 0, Errors: 0, Skipped: 0, Time elapsed: 79.707 sec - in org.apache.hadoop.hbase.regionserver.wal.TestSecureWALReplay
Running org.apache.hadoop.hbase.regionserver.wal.TestAsyncLogRolling
Tests run: 7, Failures: 0, Errors: 0, Skipped: 0, Time elapsed: 249.313 sec - in org.apache.hadoop.hbase.regionserver.TestRegionReplicas
Running org.apache.hadoop.hbase.regionserver.wal.TestProtobufLog
Tests run: 1, Failures: 0, Errors: 0, Skipped: 0, Time elapsed: 4.67 sec - in org.apache.hadoop.hbase.regionserver.wal.TestProtobufLog
Running org.apache.hadoop.hbase.regionserver.wal.TestDurability
Tests run: 12, Failures: 0, Errors: 0, Skipped: 0, Time elapsed: 72.113 sec - in org.apache.hadoop.hbase.regionserver.wal.TestWALReplay
Tests run: 6, Failures: 0, Errors: 0, Skipped: 0, Time elapsed: 8.58 sec - in org.apache.hadoop.hbase.regionserver.wal.TestDurability
Running org.apache.hadoop.hbase.regionserver.wal.TestLogRollPeriod
Running org.apache.hadoop.hbase.regionserver.wal.TestAsyncWALReplay
Running org.apache.hadoop.hbase.regionserver.wal.TestAsyncLogRollPeriod
Tests run: 2, Failures: 0, Errors: 0, Skipped: 0, Time elapsed: 65.52 sec - in org.apache.hadoop.hbase.regionserver.wal.TestLogRollPeriod
Tests run: 12, Failures: 0, Errors: 0, Skipped: 0, Time elapsed: 64.08 sec - in org.apache.hadoop.hbase.regionserver.wal.TestAsyncWALReplay
Tests run: 2, Failures: 0, Errors: 0, Skipped: 0, Time elapsed: 64.891 sec - in org.apache.hadoop.hbase.regionserver.wal.TestAsyncLogRollPeriod
Running org.apache.hadoop.hbase.regionserver.TestScannerWithBulkload
Running org.apache.hadoop.hbase.regionserver.throttle.TestFlushWithThroughputController
Running org.apache.hadoop.hbase.regionserver.TestEncryptionRandomKeying
Tests run: 1, Failures: 0, Errors: 0, Skipped: 0, Time elapsed: 1.988 sec - in org.apache.hadoop.hbase.regionserver.TestEncryptionRandomKeying
Running org.apache.hadoop.hbase.regionserver.throttle.TestCompactionWithThroughputController
Tests run: 3, Failures: 0, Errors: 0, Skipped: 0, Time elapsed: 20.718 sec - in org.apache.hadoop.hbase.regionserver.TestScannerWithBulkload
Running org.apache.hadoop.hbase.regionserver.TestDefaultMemStore
Tests run: 4, Failures: 0, Errors: 0, Skipped: 0, Time elapsed: 198.715 sec - in org.apache.hadoop.hbase.regionserver.wal.TestAsyncLogRolling
Running org.apache.hadoop.hbase.regionserver.TestMasterAddressTracker
Tests run: 5, Failures: 0, Errors: 0, Skipped: 0, Time elapsed: 4.831 sec - in org.apache.hadoop.hbase.regionserver.TestMasterAddressTracker
Running org.apache.hadoop.hbase.regionserver.TestSplitTransactionOnCluster
Tests run: 23, Failures: 0, Errors: 0, Skipped: 0, Time elapsed: 77.79 sec - in org.apache.hadoop.hbase.regionserver.TestDefaultMemStore
Running org.apache.hadoop.hbase.regionserver.TestParallelPut
Tests run: 5, Failures: 0, Errors: 0, Skipped: 0, Time elapsed: 328.863 sec - in org.apache.hadoop.hbase.regionserver.wal.TestLogRolling
Running org.apache.hadoop.hbase.regionserver.TestColumnSeeking
Tests run: 2, Failures: 0, Errors: 0, Skipped: 0, Time elapsed: 27.675 sec - in org.apache.hadoop.hbase.regionserver.TestParallelPut
Tests run: 3, Failures: 0, Errors: 0, Skipped: 0, Time elapsed: 123.458 sec - in org.apache.hadoop.hbase.regionserver.throttle.TestCompactionWithThroughputController
Running org.apache.hadoop.hbase.regionserver.TestCorruptedRegionStoreFile
Running org.apache.hadoop.hbase.regionserver.TestRegionServerOnlineConfigChange
Tests run: 3, Failures: 0, Errors: 0, Skipped: 0, Time elapsed: 172.986 sec - in org.apache.hadoop.hbase.regionserver.throttle.TestFlushWithThroughputController
Tests run: 2, Failures: 0, Errors: 0, Skipped: 0, Time elapsed: 42.235 sec - in org.apache.hadoop.hbase.regionserver.TestColumnSeeking
Tests run: 2, Failures: 0, Errors: 0, Skipped: 0, Time elapsed: 2.962 sec - in org.apache.hadoop.hbase.regionserver.TestRegionServerOnlineConfigChange
Running org.apache.hadoop.hbase.regionserver.TestRegionIncrement
Running org.apache.hadoop.hbase.regionserver.TestCompaction
Tests run: 3, Failures: 0, Errors: 0, Skipped: 0, Time elapsed: 47.96 sec - in org.apache.hadoop.hbase.regionserver.TestRegionIncrement
Running org.apache.hadoop.hbase.regionserver.TestRegionMergeTransactionOnCluster
Tests run: 5, Failures: 0, Errors: 0, Skipped: 0, Time elapsed: 53.43 sec - in org.apache.hadoop.hbase.regionserver.TestCompaction
Running org.apache.hadoop.hbase.regionserver.TestRecoveredEdits
Tests run: 15, Failures: 0, Errors: 0, Skipped: 0, Time elapsed: 165.689 sec - in org.apache.hadoop.hbase.regionserver.TestSplitTransactionOnCluster
Running org.apache.hadoop.hbase.regionserver.TestRemoveRegionMetrics
Running org.apache.hadoop.hbase.regionserver.TestGetClosestAtOrBefore
Tests run: 3, Failures: 0, Errors: 0, Skipped: 0, Time elapsed: 9.171 sec - in org.apache.hadoop.hbase.regionserver.TestGetClosestAtOrBefore
Running org.apache.hadoop.hbase.regionserver.TestCompoundBloomFilter
Tests run: 1, Failures: 0, Errors: 0, Skipped: 0, Time elapsed: 39.464 sec - in org.apache.hadoop.hbase.regionserver.TestRecoveredEdits
Running org.apache.hadoop.hbase.regionserver.TestRegionServerReportForDuty
Tests run: 1, Failures: 0, Errors: 0, Skipped: 0, Time elapsed: 39.208 sec - in org.apache.hadoop.hbase.regionserver.TestRegionServerReportForDuty
Tests run: 5, Failures: 0, Errors: 0, Skipped: 0, Time elapsed: 135.888 sec - in org.apache.hadoop.hbase.regionserver.TestRegionMergeTransactionOnCluster
Running org.apache.hadoop.hbase.regionserver.TestHRegion
Tests run: 2, Failures: 0, Errors: 0, Skipped: 0, Time elapsed: 231.165 sec - in org.apache.hadoop.hbase.regionserver.TestCorruptedRegionStoreFile
Running org.apache.hadoop.hbase.regionserver.TestMobStoreScanner
Running org.apache.hadoop.hbase.regionserver.compactions.TestCompactedHFilesDischarger
Tests run: 3, Failures: 0, Errors: 0, Skipped: 0, Time elapsed: 9.129 sec - in org.apache.hadoop.hbase.regionserver.compactions.TestCompactedHFilesDischarger
Running org.apache.hadoop.hbase.regionserver.compactions.TestFIFOCompactionPolicy
Tests run: 1, Failures: 0, Errors: 0, Skipped: 0, Time elapsed: 165.049 sec - in org.apache.hadoop.hbase.regionserver.TestRemoveRegionMetrics
Running org.apache.hadoop.hbase.regionserver.TestAtomicOperation
Tests run: 6, Failures: 0, Errors: 0, Skipped: 0, Time elapsed: 65.07 sec - in org.apache.hadoop.hbase.regionserver.TestMobStoreScanner
Tests run: 4, Failures: 0, Errors: 0, Skipped: 0, Time elapsed: 84.558 sec - in org.apache.hadoop.hbase.regionserver.compactions.TestFIFOCompactionPolicy
Running org.apache.hadoop.hbase.regionserver.TestDeleteMobTable
Running org.apache.hadoop.hbase.regionserver.TestTimestampFilterSeekHint
Tests run: 3, Failures: 0, Errors: 0, Skipped: 0, Time elapsed: 31.099 sec - in org.apache.hadoop.hbase.regionserver.TestDeleteMobTable
Running org.apache.hadoop.hbase.regionserver.TestFSErrorsExposed
Tests run: 8, Failures: 0, Errors: 0, Skipped: 0, Time elapsed: 93.255 sec - in org.apache.hadoop.hbase.regionserver.TestAtomicOperation
Running org.apache.hadoop.hbase.regionserver.TestRSKilledWhenInitializing
Tests run: 2, Failures: 0, Errors: 0, Skipped: 0, Time elapsed: 64.678 sec - in org.apache.hadoop.hbase.regionserver.TestTimestampFilterSeekHint
Running org.apache.hadoop.hbase.regionserver.TestMultiColumnScanner
Tests run: 1, Failures: 0, Errors: 0, Skipped: 0, Time elapsed: 46.217 sec - in org.apache.hadoop.hbase.regionserver.TestRSKilledWhenInitializing
Tests run: 102, Failures: 0, Errors: 0, Skipped: 0, Time elapsed: 213.999 sec - in org.apache.hadoop.hbase.regionserver.TestHRegion
Running org.apache.hadoop.hbase.regionserver.TestFlushRegionEntry
Tests run: 1, Failures: 0, Errors: 0, Skipped: 0, Time elapsed: 1.569 sec - in org.apache.hadoop.hbase.regionserver.TestFlushRegionEntry
Running org.apache.hadoop.hbase.regionserver.TestStore
Tests run: 3, Failures: 0, Errors: 0, Skipped: 0, Time elapsed: 75.954 sec - in org.apache.hadoop.hbase.regionserver.TestFSErrorsExposed
Running org.apache.hadoop.hbase.TestMetaTableLocator
Tests run: 7, Failures: 0, Errors: 0, Skipped: 0, Time elapsed: 8.998 sec - in org.apache.hadoop.hbase.TestMetaTableLocator
Tests run: 18, Failures: 0, Errors: 0, Skipped: 0, Time elapsed: 25.437 sec - in org.apache.hadoop.hbase.regionserver.TestStore
Running org.apache.hadoop.hbase.TestStochasticBalancerJmxMetrics
Tests run: 1, Failures: 0, Errors: 0, Skipped: 1, Time elapsed: 0.002 sec - in org.apache.hadoop.hbase.TestStochasticBalancerJmxMetrics
Running org.apache.hadoop.hbase.namespace.TestNamespaceAuditor
Tests run: 12, Failures: 0, Errors: 0, Skipped: 0, Time elapsed: 133.164 sec - in org.apache.hadoop.hbase.regionserver.TestMultiColumnScanner
Tests run: 3, Failures: 0, Errors: 0, Skipped: 0, Time elapsed: 440.475 sec - in org.apache.hadoop.hbase.regionserver.TestCompoundBloomFilter
Tests run: 13, Failures: 0, Errors: 2, Skipped: 0, Time elapsed: 347.319 sec <<<
FAILURE! - in org.apache.hadoop.hbase.namespace.TestNamespaceAuditor
testRegionOperations(org.apache.hadoop.hbase.namespace.TestNamespaceAuditor)  Time elapsed:
180.121 sec  <<< ERROR!
org.junit.runners.model.TestTimedOutException: test timed out after 180 seconds
	at sun.misc.Unsafe.park(Native Method)
	at java.util.concurrent.locks.LockSupport.park(LockSupport.java:186)
	at java.util.concurrent.locks.AbstractQueuedSynchronizer.parkAndCheckInterrupt(AbstractQueuedSynchronizer.java:834)
	at java.util.concurrent.locks.AbstractQueuedSynchronizer.doAcquireSharedInterruptibly(AbstractQueuedSynchronizer.java:994)
	at java.util.concurrent.locks.AbstractQueuedSynchronizer.acquireSharedInterruptibly(AbstractQueuedSynchronizer.java:1303)
	at java.util.concurrent.CountDownLatch.await(CountDownLatch.java:236)
	at org.apache.hadoop.hbase.namespace.TestNamespaceAuditor.testRegionOperations(TestNamespaceAuditor.java:490)

testRegionOperations(org.apache.hadoop.hbase.namespace.TestNamespaceAuditor)  Time elapsed:
180.135 sec  <<< ERROR!
java.lang.Exception: Appears to be stuck in thread RpcServer.reader=1,bindAddress=priapus.apache.org,port=55919
	at sun.nio.ch.EPollArrayWrapper.epollWait(Native Method)
	at sun.nio.ch.EPollArrayWrapper.poll(EPollArrayWrapper.java:269)
	at sun.nio.ch.EPollSelectorImpl.doSelect(EPollSelectorImpl.java:79)
	at sun.nio.ch.SelectorImpl.lockAndDoSelect(SelectorImpl.java:87)
	at sun.nio.ch.SelectorImpl.select(SelectorImpl.java:98)
	at sun.nio.ch.SelectorImpl.select(SelectorImpl.java:102)
	at org.apache.hadoop.hbase.ipc.RpcServer$Listener$Reader.doRunLoop(RpcServer.java:680)
	at org.apache.hadoop.hbase.ipc.RpcServer$Listener$Reader.run(RpcServer.java:667)
	at java.util.concurrent.ThreadPoolExecutor.runWorker(ThreadPoolExecutor.java:1145)
	at java.util.concurrent.ThreadPoolExecutor$Worker.run(ThreadPoolExecutor.java:615)
	at java.lang.Thread.run(Thread.java:745)


Results :

Tests in error: 
  TestAdmin1.tearDown:108 » RetriesExhausted Failed after attempts=7, exceptions...
org.apache.hadoop.hbase.client.TestAdmin1.testGetTableDescriptor(org.apache.hadoop.hbase.client.TestAdmin1)
  Run 1: TestAdmin1.testGetTableDescriptor:424 » RetriesExhausted Failed after attempts...
  Run 2: TestAdmin1.tearDown:108 » RetriesExhausted Failed after attempts=7, exceptions...

org.apache.hadoop.hbase.client.TestAdmin1.testHFileReplication(org.apache.hadoop.hbase.client.TestAdmin1)
  Run 1: TestAdmin1.testHFileReplication:1358 » RetriesExhausted Failed after attempts=...
  Run 2: TestAdmin1.tearDown:108 » RetriesExhausted Failed after attempts=7, exceptions...

  TestAdmin1.tearDown:108 » RetriesExhausted Failed after attempts=7, exceptions...
org.apache.hadoop.hbase.client.TestAdmin1.testMergeRegions(org.apache.hadoop.hbase.client.TestAdmin1)
  Run 1: TestAdmin1.testMergeRegions:1432 » RetriesExhausted Failed after attempts=7, e...
  Run 2: TestAdmin1.tearDown:108 » RetriesExhausted Failed after attempts=7, exceptions...

org.apache.hadoop.hbase.client.TestAdmin1.testTableExist(org.apache.hadoop.hbase.client.TestAdmin1)
  Run 1: TestAdmin1.testTableExist:934->Object.wait:-2 » TestTimedOut test timed out af...
  Run 2: TestAdmin1.tearDown:108 » RetriesExhausted Failed after attempts=7, exceptions...

  TestMetaCache.testPreserveMetaCacheOnException:125 » IllegalArgument Row lengt...
org.apache.hadoop.hbase.namespace.TestNamespaceAuditor.testRegionOperations(org.apache.hadoop.hbase.namespace.TestNamespaceAuditor)
  Run 1: TestNamespaceAuditor.testRegionOperations:490 » TestTimedOut test timed out af...
  Run 2: TestNamespaceAuditor.testRegionOperations »  Appears to be stuck in thread Rpc...


Tests run: 2696, Failures: 0, Errors: 8, Skipped: 65

[INFO] ------------------------------------------------------------------------
[INFO] Reactor Summary:
[INFO] 
[INFO] Apache HBase ...................................... SUCCESS [  4.072 s]
[INFO] Apache HBase - Checkstyle ......................... SUCCESS [  1.147 s]
[INFO] Apache HBase - Resource Bundle .................... SUCCESS [  0.488 s]
[INFO] Apache HBase - Annotations ........................ SUCCESS [  0.303 s]
[INFO] Apache HBase - Protocol ........................... SUCCESS [  4.126 s]
[INFO] Apache HBase - Common ............................. SUCCESS [02:16 min]
[INFO] Apache HBase - Procedure .......................... SUCCESS [02:55 min]
[INFO] Apache HBase - Client ............................. SUCCESS [01:01 min]
[INFO] Apache HBase - Hadoop Compatibility ............... SUCCESS [ 10.835 s]
[INFO] Apache HBase - Hadoop Two Compatibility ........... SUCCESS [ 14.386 s]
[INFO] Apache HBase - Prefix Tree ........................ SUCCESS [ 18.233 s]
[INFO] Apache HBase - Server ............................. FAILURE [  03:03 h]
[INFO] Apache HBase - Testing Util ....................... SKIPPED
[INFO] Apache HBase - Thrift ............................. SKIPPED
[INFO] Apache HBase - RSGroup ............................ SKIPPED
[INFO] Apache HBase - Shell .............................. SKIPPED
[INFO] Apache HBase - Integration Tests .................. SKIPPED
[INFO] Apache HBase - Examples ........................... SKIPPED
[INFO] Apache HBase - Rest ............................... SKIPPED
[INFO] Apache HBase - External Block Cache ............... SKIPPED
[INFO] Apache HBase - Spark .............................. SKIPPED
[INFO] Apache HBase - Assembly ........................... SKIPPED
[INFO] Apache HBase - Shaded ............................. SKIPPED
[INFO] Apache HBase - Shaded - Client .................... SKIPPED
[INFO] Apache HBase - Shaded - Server .................... SKIPPED
[INFO] Apache HBase - Archetypes ......................... SKIPPED
[INFO] Apache HBase - Exemplar for hbase-client archetype  SKIPPED
[INFO] Apache HBase - Exemplar for hbase-shaded-client archetype  SKIPPED
[INFO] Apache HBase - Archetype builder .................. SKIPPED
[INFO] ------------------------------------------------------------------------
[INFO] BUILD FAILURE
[INFO] ------------------------------------------------------------------------
[INFO] Total time: 03:11 h
[INFO] Finished at: 2016-03-30T05:33:06+00:00
[INFO] Final Memory: 69M/644M
[INFO] ------------------------------------------------------------------------
[ERROR] Failed to execute goal org.apache.maven.plugins:maven-surefire-plugin:2.18.1:test
(secondPartTestsExecution) on project hbase-server: There was a timeout or other error in
the fork -> [Help 1]
[ERROR] 
[ERROR] To see the full stack trace of the errors, re-run Maven with the -e switch.
[ERROR] Re-run Maven using the -X switch to enable full debug logging.
[ERROR] 
[ERROR] For more information about the errors and possible solutions, please read the following
articles:
[ERROR] [Help 1] http://cwiki.apache.org/confluence/display/MAVEN/MojoFailureException
[ERROR] 
[ERROR] After correcting the problems, you can resume the build with the command
[ERROR]   mvn <goals> -rf :hbase-server
Build step 'Invoke top-level Maven targets' marked build as failure
Performing Post build task...
Match found for :.* : True
Logical operation result is TRUE
Running script  : # Run zombie detector script
./dev-support/zombie-detector.sh --jenkins ${BUILD_ID}
[yahoo-not-h2] $ /bin/bash -xe /tmp/hudson7694980834753131137.sh
+ ./dev-support/zombie-detector.sh --jenkins 813
Wed Mar 30 05:33:08 UTC 2016 We're ok: there is no zombie test


    {color:green}+1 zombies{color}. No zombie tests found running at the end of the build.
POST BUILD TASK : SUCCESS
END OF POST BUILD TASK : 0
Archiving artifacts
Recording test results
[FINDBUGS] Skipping publisher since build result is FAILURE
[CHECKSTYLE] Skipping publisher since build result is FAILURE

Mime
View raw message