hbase-builds mailing list archives

Site index · List index
Message view « Date » · « Thread »
Top « Date » · « Thread »
From Apache Jenkins Server <jenk...@builds.apache.org>
Subject Build failed in Jenkins: HBase-0.98-matrix » latest1.7,yahoo-not-h2 #315
Date Fri, 18 Mar 2016 17:46:27 GMT
See <https://builds.apache.org/job/HBase-0.98-matrix/jdk=latest1.7,label=yahoo-not-h2/315/changes>

Changes:

[apurtell] HBASE-15435 Add WAL (in bytes) written metric (Alicia Ying Shu)

[apurtell] HBASE-12940 Expose listPeerConfigs and getPeerConfig to the HBase shell

------------------------------------------
[...truncated 41554 lines...]
13281/13509 KB   
13285/13509 KB   
13289/13509 KB   
13293/13509 KB   
13297/13509 KB   
13301/13509 KB   
13305/13509 KB   
13309/13509 KB   
13313/13509 KB   
13317/13509 KB   
13321/13509 KB   
13325/13509 KB   
13329/13509 KB   
13333/13509 KB   
13337/13509 KB   
13341/13509 KB   
13345/13509 KB   
13349/13509 KB   
13353/13509 KB   
13354/13509 KB   
13355/13509 KB   
13359/13509 KB   
13363/13509 KB   
13367/13509 KB   
13371/13509 KB   
13375/13509 KB   
13379/13509 KB   
13382/13509 KB   
13386/13509 KB   
13387/13509 KB   
13388/13509 KB   
13392/13509 KB   
13396/13509 KB   
13399/13509 KB   
13403/13509 KB   
13404/13509 KB   
13408/13509 KB   
13412/13509 KB   
13416/13509 KB   
13417/13509 KB   
13421/13509 KB   
13424/13509 KB   
13428/13509 KB   
13429/13509 KB   
13433/13509 KB   
13436/13509 KB   
13440/13509 KB   
13444/13509 KB   
13448/13509 KB   
13452/13509 KB   
13453/13509 KB   
13457/13509 KB   
13458/13509 KB   
13462/13509 KB   
13466/13509 KB   
13470/13509 KB   
13474/13509 KB   
13478/13509 KB   
13482/13509 KB   
13486/13509 KB   
13490/13509 KB   
13494/13509 KB   
13498/13509 KB   
13502/13509 KB   
13506/13509 KB   
13509/13509 KB   
                 
Downloaded: http://repository.jboss.org/nexus/content/groups/public-jboss/org/jruby/jruby-complete/1.6.8/jruby-complete-1.6.8.jar
(13509 KB at 10627.9 KB/sec)
[INFO] 
[INFO] --- maven-enforcer-plugin:1.0.1:enforce (enforce) @ hbase-shell ---
[INFO] 
[INFO] --- buildnumber-maven-plugin:1.3:create-timestamp (default) @ hbase-shell ---
[INFO] 
[INFO] --- build-helper-maven-plugin:1.5:add-source (jspcSource-packageInfo-source) @ hbase-shell
---
[INFO] Source directory: <https://builds.apache.org/job/HBase-0.98-matrix/jdk=latest1.7,label=yahoo-not-h2/ws/hbase-shell/target/generated-jamon>
added.
[INFO] Source directory: <https://builds.apache.org/job/HBase-0.98-matrix/jdk=latest1.7,label=yahoo-not-h2/ws/hbase-shell/target/generated-sources/java>
added.
[INFO] 
[INFO] --- maven-remote-resources-plugin:1.5:process (default) @ hbase-shell ---
[INFO] 
[INFO] --- maven-resources-plugin:2.6:resources (default-resources) @ hbase-shell ---
[INFO] Using 'UTF-8' encoding to copy filtered resources.
[INFO] Copying 0 resource
[INFO] Copying 3 resources
[INFO] 
[INFO] --- maven-compiler-plugin:2.5.1:compile (default-compile) @ hbase-shell ---
[INFO] No sources to compile
[INFO] 
[INFO] --- maven-dependency-plugin:2.1:build-classpath (create-mrapp-generated-classpath)
@ hbase-shell ---
[INFO] Wrote classpath file '<https://builds.apache.org/job/HBase-0.98-matrix/jdk=latest1.7,label=yahoo-not-h2/ws/hbase-shell/target/test-classes/mrapp-generated-classpath'.>
[INFO] 
[INFO] --- maven-resources-plugin:2.6:testResources (default-testResources) @ hbase-shell
---
[INFO] Using 'UTF-8' encoding to copy filtered resources.
[INFO] Copying 1 resource
[INFO] Copying 3 resources
[INFO] 
[INFO] --- maven-compiler-plugin:2.5.1:testCompile (default-testCompile) @ hbase-shell ---
[INFO] Compiling 1 source file to <https://builds.apache.org/job/HBase-0.98-matrix/jdk=latest1.7,label=yahoo-not-h2/ws/hbase-shell/target/test-classes>
[INFO] 
[INFO] --- maven-surefire-plugin:2.18.1:test (default-test) @ hbase-shell ---
[INFO] Surefire report directory: <https://builds.apache.org/job/HBase-0.98-matrix/jdk=latest1.7,label=yahoo-not-h2/ws/hbase-shell/target/surefire-reports>
[INFO] Using configured provider org.apache.maven.surefire.junitcore.JUnitCoreProvider
[INFO] parallel='none', perCoreThreadCount=true, threadCount=0, useUnlimitedThreads=false,
threadCountSuites=0, threadCountClasses=0, threadCountMethods=0, parallelOptimized=true

-------------------------------------------------------
 T E S T S
-------------------------------------------------------

Results :

Tests run: 0, Failures: 0, Errors: 0, Skipped: 0

[INFO] 
[INFO] --- maven-surefire-plugin:2.18.1:test (secondPartTestsExecution) @ hbase-shell ---
[INFO] Surefire report directory: <https://builds.apache.org/job/HBase-0.98-matrix/jdk=latest1.7,label=yahoo-not-h2/ws/hbase-shell/target/surefire-reports>
[INFO] Using configured provider org.apache.maven.surefire.junitcore.JUnitCoreProvider
[INFO] parallel='none', perCoreThreadCount=true, threadCount=0, useUnlimitedThreads=false,
threadCountSuites=0, threadCountClasses=0, threadCountMethods=0, parallelOptimized=true

-------------------------------------------------------
 T E S T S
-------------------------------------------------------
Running org.apache.hadoop.hbase.client.TestShell
Tests run: 1, Failures: 0, Errors: 1, Skipped: 0, Time elapsed: 196.224 sec <<< FAILURE!
- in org.apache.hadoop.hbase.client.TestShell
testRunShellTests(org.apache.hadoop.hbase.client.TestShell)  Time elapsed: 190.526 sec  <<<
ERROR!
org.jruby.embed.EvalFailedException: (RuntimeError) Shell unit tests failed. Check output
file for details.
	at org.jruby.embed.internal.EmbedEvalUnitImpl.run(EmbedEvalUnitImpl.java:136)
	at org.jruby.embed.ScriptingContainer.runUnit(ScriptingContainer.java:1263)
	at org.jruby.embed.ScriptingContainer.runScriptlet(ScriptingContainer.java:1308)
	at org.apache.hadoop.hbase.client.TestShell.testRunShellTests(TestShell.java:78)
Caused by: org.jruby.exceptions.RaiseException: (RuntimeError) Shell unit tests failed. Check
output file for details.
	at (Anonymous).(root)(src/test/ruby/tests_runner.rb:66)


Results :

Tests in error: 
  TestShell.testRunShellTests:78 » EvalFailed (RuntimeError) Shell unit tests fa...

Tests run: 1, Failures: 0, Errors: 1, Skipped: 0

[INFO] ------------------------------------------------------------------------
[INFO] Reactor Summary:
[INFO] 
[INFO] Apache HBase ...................................... SUCCESS [1:08.525s]
[INFO] Apache HBase - Checkstyle ......................... SUCCESS [5.746s]
[INFO] Apache HBase - Resource Bundle .................... SUCCESS [0.195s]
[INFO] Apache HBase - Annotations ........................ SUCCESS [1.065s]
[INFO] Apache HBase - Common ............................. SUCCESS [2:19.070s]
[INFO] Apache HBase - Protocol ........................... SUCCESS [10.260s]
[INFO] Apache HBase - Client ............................. SUCCESS [1:09.008s]
[INFO] Apache HBase - Hadoop Compatibility ............... SUCCESS [7.354s]
[INFO] Apache HBase - Hadoop Two Compatibility ........... SUCCESS [9.664s]
[INFO] Apache HBase - Prefix Tree ........................ SUCCESS [9.917s]
[INFO] Apache HBase - Server ............................. SUCCESS [4:11:37.924s]
[INFO] Apache HBase - Testing Util ....................... SUCCESS [2.910s]
[INFO] Apache HBase - Thrift ............................. SUCCESS [2:57.290s]
[INFO] Apache HBase - Rest ............................... SUCCESS [11:04.241s]
[INFO] Apache HBase - Shell .............................. FAILURE [3:41.052s]
[INFO] Apache HBase - Integration Tests .................. SKIPPED
[INFO] Apache HBase - Examples ........................... SKIPPED
[INFO] Apache HBase - Assembly ........................... SKIPPED
[INFO] ------------------------------------------------------------------------
[INFO] BUILD FAILURE
[INFO] ------------------------------------------------------------------------
[INFO] Total time: 4:35:02.882s
[INFO] Finished at: Fri Mar 18 17:41:36 UTC 2016
[INFO] Final Memory: 67M/537M
[INFO] ------------------------------------------------------------------------
[ERROR] Failed to execute goal org.apache.maven.plugins:maven-surefire-plugin:2.18.1:test
(secondPartTestsExecution) on project hbase-shell: There are test failures.
[ERROR] 
[ERROR] Please refer to <https://builds.apache.org/job/HBase-0.98-matrix/jdk=latest1.7,label=yahoo-not-h2/ws/hbase-shell/target/surefire-reports>
for the individual test results.
[ERROR] -> [Help 1]
[ERROR] 
[ERROR] To see the full stack trace of the errors, re-run Maven with the -e switch.
[ERROR] Re-run Maven using the -X switch to enable full debug logging.
[ERROR] 
[ERROR] For more information about the errors and possible solutions, please read the following
articles:
[ERROR] [Help 1] http://cwiki.apache.org/confluence/display/MAVEN/MojoFailureException
[ERROR] 
[ERROR] After correcting the problems, you can resume the build with the command
[ERROR]   mvn <goals> -rf :hbase-shell
Build step 'Invoke top-level Maven targets' marked build as failure
Performing Post build task...
Match found for :.* : True
Logical operation result is TRUE
Running script  : # Post-build task script. TODO: Check this in and have all builds reference
check-in.
pwd && ls
# NOTE!!!! The below code has been copied and pasted from ./dev-tools/run-test.sh
# Do not change here without syncing there and vice-versa.
ZOMBIE_TESTS_COUNT=`jps -v | grep surefirebooter | grep -e '-Dhbase.test' | wc -l`
if [[ $ZOMBIE_TESTS_COUNT != 0 ]] ; then
 echo "Suspicious java process found - waiting 30s to see if there are just slow to stop"
 sleep 30
 ZOMBIE_TESTS_COUNT=`jps -v | grep surefirebooter | grep -e '-Dhbase.test' | wc -l`
 if [[ $ZOMBIE_TESTS_COUNT != 0 ]] ; then
   echo " {color:red}There appear to be $ZOMBIE_TESTS_COUNT zombie tests{color}, they should
have been killed by surefire but survived"
   jps -v | grep surefirebooter | grep -e '-Dhbase.test'
   jps -v | grep surefirebooter | grep -e '-Dhbase.test' | cut -d ' ' -f 1 | xargs -n 1 jstack
   # Exit with error
   exit 1
 else
   echo "We're ok: there is no zombie test, but some tests took some time to stop"
 fi
else
  echo "We're ok: there is no zombie test"
fi
[yahoo-not-h2] $ /bin/bash -xe /tmp/hudson2184400815378379993.sh
+ pwd
<https://builds.apache.org/job/HBase-0.98-matrix/jdk=latest1.7,label=yahoo-not-h2/ws/>
+ ls
bin
CHANGES.txt
conf
dev-support
hbase-annotations
hbase-assembly
hbase-checkstyle
hbase-client
hbase-common
hbase-examples
hbase-hadoop1-compat
hbase-hadoop2-compat
hbase-hadoop-compat
hbase-it
hbase-prefix-tree
hbase-protocol
hbase-resource-bundle
hbase-rest
hbase-server
hbase-shell
hbase-testing-util
hbase-thrift
LICENSE.txt
NOTICE.txt
pom.xml
README.txt
src
target
++ jps -v
++ grep surefirebooter
++ grep -e -Dhbase.test
++ wc -l
+ ZOMBIE_TESTS_COUNT=0
+ [[ 0 != 0 ]]
+ echo 'We'\''re ok: there is no zombie test'
We're ok: there is no zombie test
POST BUILD TASK : SUCCESS
END OF POST BUILD TASK : 0
Archiving artifacts
Recording test results

Mime
View raw message