hbase-builds mailing list archives

Site index · List index
Message view « Date » · « Thread »
Top « Date » · « Thread »
From Apache Jenkins Server <jenk...@builds.apache.org>
Subject Build failed in Jenkins: HBase-Trunk_matrix » latest1.7,yahoo-not-h2 #792
Date Sun, 20 Mar 2016 21:52:46 GMT
See <https://builds.apache.org/job/HBase-Trunk_matrix/jdk=latest1.7,label=yahoo-not-h2/792/changes>

Changes:

[stack] HBASE-15349 Update surefire version to 2.19.1; Trying a REVERT to see if

------------------------------------------
[...truncated 2364 lines...]
[INFO] 
[INFO] --- maven-compiler-plugin:3.2:compile (default-compile) @ hbase-prefix-tree ---
[INFO] Nothing to compile - all classes are up to date
[INFO] 
[INFO] --- maven-resources-plugin:2.6:testResources (default-testResources) @ hbase-prefix-tree
---
[INFO] Using 'UTF-8' encoding to copy filtered resources.
[INFO] Copying 1 resource
[INFO] Copying 3 resources
[INFO] 
[INFO] --- maven-compiler-plugin:3.2:testCompile (default-testCompile) @ hbase-prefix-tree
---
[INFO] Nothing to compile - all classes are up to date
[INFO] 
[INFO] --- maven-surefire-plugin:2.18.1:test (default-test) @ hbase-prefix-tree ---
[INFO] Tests are skipped.
[INFO] 
[INFO] --- maven-surefire-plugin:2.18.1:test (secondPartTestsExecution) @ hbase-prefix-tree
---
[INFO] Tests are skipped.
[INFO] 
[INFO] --- maven-source-plugin:2.2.1:jar-no-fork (attach-sources) @ hbase-prefix-tree ---
[INFO] Building jar: <https://builds.apache.org/job/HBase-Trunk_matrix/jdk=latest1.7,label=yahoo-not-h2/ws/hbase-prefix-tree/target/hbase-prefix-tree-2.0.0-SNAPSHOT-sources.jar>
[INFO] 
[INFO] --- maven-jar-plugin:2.4:test-jar (default) @ hbase-prefix-tree ---
[INFO] Building jar: <https://builds.apache.org/job/HBase-Trunk_matrix/jdk=latest1.7,label=yahoo-not-h2/ws/hbase-prefix-tree/target/hbase-prefix-tree-2.0.0-SNAPSHOT-tests.jar>
[INFO] 
[INFO] --- maven-jar-plugin:2.4:jar (default-jar) @ hbase-prefix-tree ---
[INFO] Building jar: <https://builds.apache.org/job/HBase-Trunk_matrix/jdk=latest1.7,label=yahoo-not-h2/ws/hbase-prefix-tree/target/hbase-prefix-tree-2.0.0-SNAPSHOT.jar>
[INFO] 
[INFO] --- maven-checkstyle-plugin:2.17:checkstyle (default-cli) @ hbase-prefix-tree ---
[INFO] There are 138 errors reported by Checkstyle 6.11.2 with hbase/checkstyle.xml ruleset.
[INFO]                                                                         
[INFO] ------------------------------------------------------------------------
[INFO] Building Apache HBase - Server 2.0.0-SNAPSHOT
[INFO] ------------------------------------------------------------------------
[INFO] 
[INFO] --- maven-enforcer-plugin:1.0.1:enforce (enforce) @ hbase-server ---
[INFO] 
[INFO] --- buildnumber-maven-plugin:1.3:create-timestamp (default) @ hbase-server ---
[INFO] 
[INFO] --- build-helper-maven-plugin:1.9.1:add-source (jspcSource-packageInfo-source) @ hbase-server
---
[INFO] Source directory: <https://builds.apache.org/job/HBase-Trunk_matrix/jdk=latest1.7,label=yahoo-not-h2/ws/hbase-server/target/generated-jamon>
added.
[INFO] Source directory: <https://builds.apache.org/job/HBase-Trunk_matrix/jdk=latest1.7,label=yahoo-not-h2/ws/hbase-server/target/generated-sources/java>
added.
[INFO] 
[INFO] --- jamon-maven-plugin:2.4.1:translate (default) @ hbase-server ---
[INFO] 
[INFO] --- maven-antrun-plugin:1.8:run (generate) @ hbase-server ---
[INFO] Executing tasks

main:
[INFO] Logging to org.slf4j.impl.SimpleLogger(org.mortbay.log) via org.mortbay.log.Slf4jLog
[INFO] Executed tasks
[INFO] 
[INFO] --- maven-remote-resources-plugin:1.5:process (default) @ hbase-server ---
[INFO] 
[INFO] --- maven-resources-plugin:2.6:resources (default-resources) @ hbase-server ---
[INFO] Using 'UTF-8' encoding to copy filtered resources.
[INFO] Copying 22 resources
[INFO] Copying 2 resources
[INFO] 
[INFO] --- maven-compiler-plugin:3.2:compile (default-compile) @ hbase-server ---
[INFO] Compiling 7 source files to <https://builds.apache.org/job/HBase-Trunk_matrix/jdk=latest1.7,label=yahoo-not-h2/ws/hbase-server/target/classes>
[INFO] 
[INFO] --- maven-dependency-plugin:2.8:build-classpath (create-mrapp-generated-classpath)
@ hbase-server ---
[INFO] Skipped writing classpath file '<https://builds.apache.org/job/HBase-Trunk_matrix/jdk=latest1.7,label=yahoo-not-h2/ws/hbase-server/target/test-classes/mrapp-generated-classpath'.>
 No changes found.
[INFO] 
[INFO] --- maven-resources-plugin:2.6:testResources (default-testResources) @ hbase-server
---
[INFO] Using 'UTF-8' encoding to copy filtered resources.
[INFO] Copying 1 resource to META-INF/
[INFO] Copying 16 resources
[INFO] 
[INFO] --- maven-compiler-plugin:3.2:testCompile (default-testCompile) @ hbase-server ---
[INFO] Nothing to compile - all classes are up to date
[INFO] 
[INFO] --- maven-surefire-plugin:2.18.1:test (default-test) @ hbase-server ---
[INFO] Tests are skipped.
[INFO] 
[INFO] --- maven-surefire-plugin:2.18.1:test (secondPartTestsExecution) @ hbase-server ---
[INFO] Tests are skipped.
[INFO] 
[INFO] --- maven-jar-plugin:2.4:test-jar (default) @ hbase-server ---
[INFO] Building jar: <https://builds.apache.org/job/HBase-Trunk_matrix/jdk=latest1.7,label=yahoo-not-h2/ws/hbase-server/target/hbase-server-2.0.0-SNAPSHOT-tests.jar>
[INFO] 
[INFO] --- maven-source-plugin:2.2.1:jar-no-fork (attach-sources) @ hbase-server ---
[INFO] Building jar: <https://builds.apache.org/job/HBase-Trunk_matrix/jdk=latest1.7,label=yahoo-not-h2/ws/hbase-server/target/hbase-server-2.0.0-SNAPSHOT-sources.jar>
[INFO] 
[INFO] --- maven-jar-plugin:2.4:jar (default-jar) @ hbase-server ---
[INFO] Building jar: <https://builds.apache.org/job/HBase-Trunk_matrix/jdk=latest1.7,label=yahoo-not-h2/ws/hbase-server/target/hbase-server-2.0.0-SNAPSHOT.jar>
[INFO] 
[INFO] >>> maven-source-plugin:2.2.1:jar (default) @ hbase-server >>>
[INFO] 
[INFO] --- maven-enforcer-plugin:1.0.1:enforce (enforce) @ hbase-server ---
[INFO] 
[INFO] --- buildnumber-maven-plugin:1.3:create-timestamp (default) @ hbase-server ---
[INFO] 
[INFO] --- build-helper-maven-plugin:1.9.1:add-source (jspcSource-packageInfo-source) @ hbase-server
---
[INFO] Source directory: <https://builds.apache.org/job/HBase-Trunk_matrix/jdk=latest1.7,label=yahoo-not-h2/ws/hbase-server/target/generated-jamon>
added.
[INFO] Source directory: <https://builds.apache.org/job/HBase-Trunk_matrix/jdk=latest1.7,label=yahoo-not-h2/ws/hbase-server/target/generated-sources/java>
added.
[INFO] 
[INFO] --- jamon-maven-plugin:2.4.1:translate (default) @ hbase-server ---
[INFO] 
[INFO] --- maven-antrun-plugin:1.8:run (generate) @ hbase-server ---
[INFO] Executing tasks

main:
[INFO] Logging to org.slf4j.impl.SimpleLogger(org.mortbay.log) via org.mortbay.log.Slf4jLog
[INFO] Executed tasks
[INFO] 
[INFO] <<< maven-source-plugin:2.2.1:jar (default) @ hbase-server <<<
[INFO] 
[INFO] --- maven-source-plugin:2.2.1:jar (default) @ hbase-server ---
[INFO] Building jar: <https://builds.apache.org/job/HBase-Trunk_matrix/jdk=latest1.7,label=yahoo-not-h2/ws/hbase-server/target/hbase-server-2.0.0-SNAPSHOT-sources.jar>
[INFO] 
[INFO] >>> maven-source-plugin:2.2.1:test-jar (default) @ hbase-server >>>
[INFO] 
[INFO] --- maven-enforcer-plugin:1.0.1:enforce (enforce) @ hbase-server ---
[INFO] 
[INFO] --- buildnumber-maven-plugin:1.3:create-timestamp (default) @ hbase-server ---
[INFO] 
[INFO] --- build-helper-maven-plugin:1.9.1:add-source (jspcSource-packageInfo-source) @ hbase-server
---
[INFO] Source directory: <https://builds.apache.org/job/HBase-Trunk_matrix/jdk=latest1.7,label=yahoo-not-h2/ws/hbase-server/target/generated-jamon>
added.
[INFO] Source directory: <https://builds.apache.org/job/HBase-Trunk_matrix/jdk=latest1.7,label=yahoo-not-h2/ws/hbase-server/target/generated-sources/java>
added.
[INFO] 
[INFO] --- jamon-maven-plugin:2.4.1:translate (default) @ hbase-server ---
[INFO] 
[INFO] --- maven-antrun-plugin:1.8:run (generate) @ hbase-server ---
[INFO] Executing tasks

main:
[INFO] Logging to org.slf4j.impl.SimpleLogger(org.mortbay.log) via org.mortbay.log.Slf4jLog
[INFO] Executed tasks
[INFO] 
[INFO] <<< maven-source-plugin:2.2.1:test-jar (default) @ hbase-server <<<
[INFO] 
[INFO] --- maven-source-plugin:2.2.1:test-jar (default) @ hbase-server ---
[INFO] Building jar: <https://builds.apache.org/job/HBase-Trunk_matrix/jdk=latest1.7,label=yahoo-not-h2/ws/hbase-server/target/hbase-server-2.0.0-SNAPSHOT-test-sources.jar>
[INFO] 
[INFO] --- maven-checkstyle-plugin:2.17:checkstyle (default-cli) @ hbase-server ---
[INFO] There are 7024 errors reported by Checkstyle 6.11.2 with hbase/checkstyle.xml ruleset.
[INFO]                                                                         
[INFO] ------------------------------------------------------------------------
[INFO] Building Apache HBase - Testing Util 2.0.0-SNAPSHOT
[INFO] ------------------------------------------------------------------------
[INFO] 
[INFO] --- maven-enforcer-plugin:1.0.1:enforce (enforce) @ hbase-testing-util ---
[INFO] 
[INFO] --- buildnumber-maven-plugin:1.3:create-timestamp (default) @ hbase-testing-util ---
[INFO] 
[INFO] --- maven-remote-resources-plugin:1.5:process (default) @ hbase-testing-util ---
[INFO] 
[INFO] --- maven-resources-plugin:2.6:resources (default-resources) @ hbase-testing-util ---
[INFO] Using 'UTF-8' encoding to copy filtered resources.
[INFO] skip non existing resourceDirectory <https://builds.apache.org/job/HBase-Trunk_matrix/jdk=latest1.7,label=yahoo-not-h2/ws/hbase-testing-util/src/main/resources>
[INFO] Copying 3 resources
[INFO] 
[INFO] --- maven-compiler-plugin:3.2:compile (default-compile) @ hbase-testing-util ---
[INFO] No sources to compile
[INFO] 
[INFO] --- maven-resources-plugin:2.6:testResources (default-testResources) @ hbase-testing-util
---
[INFO] Using 'UTF-8' encoding to copy filtered resources.
[INFO] skip non existing resourceDirectory <https://builds.apache.org/job/HBase-Trunk_matrix/jdk=latest1.7,label=yahoo-not-h2/ws/hbase-testing-util/src/test/resources>
[INFO] Copying 3 resources
[INFO] 
[INFO] --- maven-compiler-plugin:3.2:testCompile (default-testCompile) @ hbase-testing-util
---
[INFO] No sources to compile
[INFO] 
[INFO] --- maven-surefire-plugin:2.18.1:test (default-test) @ hbase-testing-util ---
[INFO] Tests are skipped.
[INFO] 
[INFO] --- maven-surefire-plugin:2.18.1:test (secondPartTestsExecution) @ hbase-testing-util
---
[INFO] Tests are skipped.
[INFO] 
[INFO] --- maven-jar-plugin:2.4:test-jar (default) @ hbase-testing-util ---
[INFO] Building jar: <https://builds.apache.org/job/HBase-Trunk_matrix/jdk=latest1.7,label=yahoo-not-h2/ws/hbase-testing-util/target/hbase-testing-util-2.0.0-SNAPSHOT-tests.jar>
[INFO] 
[INFO] --- maven-jar-plugin:2.4:jar (default-jar) @ hbase-testing-util ---
[INFO] Building jar: <https://builds.apache.org/job/HBase-Trunk_matrix/jdk=latest1.7,label=yahoo-not-h2/ws/hbase-testing-util/target/hbase-testing-util-2.0.0-SNAPSHOT.jar>
[INFO] 
[INFO] --- maven-checkstyle-plugin:2.17:checkstyle (default-cli) @ hbase-testing-util ---
[INFO] ------------------------------------------------------------------------
[INFO] Reactor Summary:
[INFO] 
[INFO] Apache HBase ...................................... SUCCESS [  4.711 s]
[INFO] Apache HBase - Checkstyle ......................... SUCCESS [  1.236 s]
[INFO] Apache HBase - Resource Bundle .................... SUCCESS [  0.663 s]
[INFO] Apache HBase - Annotations ........................ SUCCESS [  2.652 s]
[INFO] Apache HBase - Protocol ........................... SUCCESS [03:37 min]
[INFO] Apache HBase - Common ............................. SUCCESS [01:05 min]
[INFO] Apache HBase - Procedure .......................... SUCCESS [  7.182 s]
[INFO] Apache HBase - Client ............................. SUCCESS [01:53 min]
[INFO] Apache HBase - Hadoop Compatibility ............... SUCCESS [  6.515 s]
[INFO] Apache HBase - Hadoop Two Compatibility ........... SUCCESS [  7.254 s]
[INFO] Apache HBase - Prefix Tree ........................ SUCCESS [  6.421 s]
[INFO] Apache HBase - Server ............................. SUCCESS [04:39 min]
[INFO] Apache HBase - Testing Util ....................... FAILURE [  1.885 s]
[INFO] Apache HBase - Thrift ............................. SKIPPED
[INFO] Apache HBase - RSGroup ............................ SKIPPED
[INFO] Apache HBase - Shell .............................. SKIPPED
[INFO] Apache HBase - Integration Tests .................. SKIPPED
[INFO] Apache HBase - Examples ........................... SKIPPED
[INFO] Apache HBase - Rest ............................... SKIPPED
[INFO] Apache HBase - External Block Cache ............... SKIPPED
[INFO] Apache HBase - Spark .............................. SKIPPED
[INFO] Apache HBase - Assembly ........................... SKIPPED
[INFO] Apache HBase - Shaded ............................. SKIPPED
[INFO] Apache HBase - Shaded - Client .................... SKIPPED
[INFO] Apache HBase - Shaded - Server .................... SKIPPED
[INFO] Apache HBase - Archetypes ......................... SKIPPED
[INFO] Apache HBase - Exemplar for hbase-client archetype  SKIPPED
[INFO] Apache HBase - Exemplar for hbase-shaded-client archetype  SKIPPED
[INFO] Apache HBase - Archetype builder .................. SKIPPED
[INFO] ------------------------------------------------------------------------
[INFO] BUILD FAILURE
[INFO] ------------------------------------------------------------------------
[INFO] Total time: 11:57 min
[INFO] Finished at: 2016-03-20T21:49:51+00:00
[INFO] Final Memory: 93M/910M
[INFO] ------------------------------------------------------------------------
[ERROR] Failed to execute goal org.apache.maven.plugins:maven-checkstyle-plugin:2.17:checkstyle
(default-cli) on project hbase-testing-util: An error has occurred in Checkstyle report generation.
Failed during checkstyle execution: Unable to process suppressions file location: hbase/checkstyle-suppressions.xml:
Cannot create file-based resource:invalid block type -> [Help 1]
[ERROR] 
[ERROR] To see the full stack trace of the errors, re-run Maven with the -e switch.
[ERROR] Re-run Maven using the -X switch to enable full debug logging.
[ERROR] 
[ERROR] For more information about the errors and possible solutions, please read the following
articles:
[ERROR] [Help 1] http://cwiki.apache.org/confluence/display/MAVEN/MojoExecutionException
[ERROR] 
[ERROR] After correcting the problems, you can resume the build with the command
[ERROR]   mvn <goals> -rf :hbase-testing-util
Build step 'Invoke top-level Maven targets' marked build as failure
Performing Post build task...
Match found for :.* : True
Logical operation result is TRUE
Running script  : # Run zombie detector script
./dev-support/zombie-detector.sh --jenkins ${BUILD_ID}
[yahoo-not-h2] $ /bin/bash -xe /tmp/hudson221342256524042008.sh
+ ./dev-support/zombie-detector.sh --jenkins 792
Sun Mar 20 21:49:52 UTC 2016 Found 1 suspicious java process(es) listed below; waiting 30s
to see if just slow to stop
7905 surefirebooter5700506516032575187.jar -enableassertions -Dhbase.build.id=792 -Xmx2800m
-XX:MaxPermSize=256m -Djava.security.egd=file:/dev/./urandom -Djava.net.preferIPv4Stack=true
-Djava.awt.headless=true
tail: cannot open '+2' for reading: No such file or directory
Sun Mar 20 21:50:22 UTC 2016 We're ok: there was a zombie candidate but it went away


    {color:green}+1 zombies{color}. No zombie tests found running at the end of the build
(There were candidates but they seem to have gone away).
POST BUILD TASK : SUCCESS
END OF POST BUILD TASK : 0
Archiving artifacts
Compressed 10.96 MB of artifacts by 28.8% relative to #745
Recording test results
ERROR: Step ?Publish JUnit test result report? failed: No test report files were found. Configuration
error?
[FINDBUGS] Skipping publisher since build result is FAILURE
[CHECKSTYLE] Skipping publisher since build result is FAILURE

Mime
View raw message