hbase-builds mailing list archives

Site index · List index
Message view « Date » · « Thread »
Top « Date » · « Thread »
From Apache Jenkins Server <jenk...@builds.apache.org>
Subject Build failed in Jenkins: HBase-0.98-on-Hadoop-1.1 #1165
Date Thu, 04 Feb 2016 17:21:24 GMT
See <https://builds.apache.org/job/HBase-0.98-on-Hadoop-1.1/1165/changes>

Changes:

[apurtell] HBASE-15200 ZooKeeper znode ACL checks should only compare the shortname

------------------------------------------
[...truncated 1602 lines...]
Tests run: 1, Failures: 0, Errors: 0, Skipped: 0, Time elapsed: 4.806 sec - in org.apache.hadoop.hbase.mapreduce.TestHRegionPartitioner
Running org.apache.hadoop.hbase.mapreduce.TestImportExport
Tests run: 12, Failures: 0, Errors: 0, Skipped: 0, Time elapsed: 464.964 sec - in org.apache.hadoop.hbase.mapreduce.TestImportExport
Running org.apache.hadoop.hbase.TestDrainingServer
Tests run: 2, Failures: 0, Errors: 0, Skipped: 0, Time elapsed: 3.808 sec - in org.apache.hadoop.hbase.TestDrainingServer
Running org.apache.hadoop.hbase.TestGlobalMemStoreSize
Tests run: 1, Failures: 0, Errors: 0, Skipped: 0, Time elapsed: 20.884 sec - in org.apache.hadoop.hbase.TestGlobalMemStoreSize
Running org.apache.hadoop.hbase.coprocessor.TestBatchCoprocessorEndpoint
Tests run: 4, Failures: 0, Errors: 0, Skipped: 0, Time elapsed: 4.328 sec - in org.apache.hadoop.hbase.coprocessor.TestBatchCoprocessorEndpoint
Running org.apache.hadoop.hbase.coprocessor.TestCoprocessorHConnection
Tests run: 1, Failures: 0, Errors: 0, Skipped: 0, Time elapsed: 4.36 sec - in org.apache.hadoop.hbase.coprocessor.TestCoprocessorHConnection
Running org.apache.hadoop.hbase.coprocessor.TestRegionServerObserver
Tests run: 1, Failures: 0, Errors: 0, Skipped: 0, Time elapsed: 19.533 sec - in org.apache.hadoop.hbase.coprocessor.TestRegionServerObserver
Running org.apache.hadoop.hbase.coprocessor.TestClassLoading
Tests run: 9, Failures: 0, Errors: 0, Skipped: 0, Time elapsed: 24.845 sec - in org.apache.hadoop.hbase.coprocessor.TestClassLoading
Running org.apache.hadoop.hbase.coprocessor.TestOpenTableInCoprocessor
Tests run: 2, Failures: 0, Errors: 0, Skipped: 0, Time elapsed: 10.986 sec - in org.apache.hadoop.hbase.coprocessor.TestOpenTableInCoprocessor
Running org.apache.hadoop.hbase.coprocessor.TestRegionServerCoprocessorExceptionWithRemove
Tests run: 1, Failures: 0, Errors: 0, Skipped: 0, Time elapsed: 18.299 sec - in org.apache.hadoop.hbase.coprocessor.TestRegionServerCoprocessorExceptionWithRemove
Running org.apache.hadoop.hbase.coprocessor.TestDoubleColumnInterpreter
Tests run: 38, Failures: 0, Errors: 0, Skipped: 0, Time elapsed: 5.827 sec - in org.apache.hadoop.hbase.coprocessor.TestDoubleColumnInterpreter
Running org.apache.hadoop.hbase.coprocessor.TestRegionServerCoprocessorEndpoint
Tests run: 2, Failures: 0, Errors: 0, Skipped: 0, Time elapsed: 2.911 sec - in org.apache.hadoop.hbase.coprocessor.TestRegionServerCoprocessorEndpoint
Running org.apache.hadoop.hbase.coprocessor.TestHTableWrapper
Tests run: 1, Failures: 0, Errors: 0, Skipped: 0, Time elapsed: 5.641 sec - in org.apache.hadoop.hbase.coprocessor.TestHTableWrapper
Running org.apache.hadoop.hbase.coprocessor.TestRegionServerCoprocessorExceptionWithAbort
Tests run: 2, Failures: 0, Errors: 0, Skipped: 0, Time elapsed: 29.703 sec - in org.apache.hadoop.hbase.coprocessor.TestRegionServerCoprocessorExceptionWithAbort
Running org.apache.hadoop.hbase.coprocessor.TestMasterCoprocessorExceptionWithAbort
Tests run: 1, Failures: 0, Errors: 0, Skipped: 0, Time elapsed: 18.455 sec - in org.apache.hadoop.hbase.coprocessor.TestMasterCoprocessorExceptionWithAbort
Running org.apache.hadoop.hbase.coprocessor.TestRegionObserverScannerOpenHook
Tests run: 3, Failures: 0, Errors: 0, Skipped: 0, Time elapsed: 13.455 sec - in org.apache.hadoop.hbase.coprocessor.TestRegionObserverScannerOpenHook
Running org.apache.hadoop.hbase.coprocessor.TestAggregateProtocol
Tests run: 44, Failures: 0, Errors: 0, Skipped: 0, Time elapsed: 5.74 sec - in org.apache.hadoop.hbase.coprocessor.TestAggregateProtocol
Running org.apache.hadoop.hbase.coprocessor.TestCoprocessorEndpoint
Tests run: 6, Failures: 0, Errors: 0, Skipped: 0, Time elapsed: 4.459 sec - in org.apache.hadoop.hbase.coprocessor.TestCoprocessorEndpoint
Running org.apache.hadoop.hbase.coprocessor.TestRowProcessorEndpoint
Tests run: 4, Failures: 0, Errors: 0, Skipped: 0, Time elapsed: 14.886 sec - in org.apache.hadoop.hbase.coprocessor.TestRowProcessorEndpoint
Running org.apache.hadoop.hbase.coprocessor.TestCoprocessorStop
Tests run: 1, Failures: 0, Errors: 0, Skipped: 0, Time elapsed: 17.812 sec - in org.apache.hadoop.hbase.coprocessor.TestCoprocessorStop
Running org.apache.hadoop.hbase.coprocessor.TestRegionObserverInterface
Tests run: 13, Failures: 0, Errors: 0, Skipped: 0, Time elapsed: 55.773 sec - in org.apache.hadoop.hbase.coprocessor.TestRegionObserverInterface
Running org.apache.hadoop.hbase.coprocessor.TestRegionObserverBypass
Tests run: 2, Failures: 0, Errors: 0, Skipped: 0, Time elapsed: 6.764 sec - in org.apache.hadoop.hbase.coprocessor.TestRegionObserverBypass
Running org.apache.hadoop.hbase.coprocessor.TestMasterCoprocessorExceptionWithRemove
Tests run: 1, Failures: 0, Errors: 0, Skipped: 0, Time elapsed: 7.566 sec - in org.apache.hadoop.hbase.coprocessor.TestMasterCoprocessorExceptionWithRemove
Running org.apache.hadoop.hbase.coprocessor.TestMasterObserver
Tests run: 6, Failures: 0, Errors: 0, Skipped: 0, Time elapsed: 24.519 sec - in org.apache.hadoop.hbase.coprocessor.TestMasterObserver
Running org.apache.hadoop.hbase.coprocessor.TestCoprocessorTableEndpoint
Tests run: 2, Failures: 0, Errors: 0, Skipped: 0, Time elapsed: 8.736 sec - in org.apache.hadoop.hbase.coprocessor.TestCoprocessorTableEndpoint
Running org.apache.hadoop.hbase.coprocessor.TestBigDecimalColumnInterpreter
Tests run: 38, Failures: 0, Errors: 0, Skipped: 0, Time elapsed: 6.335 sec - in org.apache.hadoop.hbase.coprocessor.TestBigDecimalColumnInterpreter
Running org.apache.hadoop.hbase.coprocessor.TestWALObserver
Tests run: 3, Failures: 0, Errors: 0, Skipped: 0, Time elapsed: 13.811 sec - in org.apache.hadoop.hbase.coprocessor.TestWALObserver
Running org.apache.hadoop.hbase.TestClusterBootOrder
Tests run: 2, Failures: 0, Errors: 0, Skipped: 0, Time elapsed: 35.961 sec - in org.apache.hadoop.hbase.TestClusterBootOrder
Running org.apache.hadoop.hbase.ipc.TestHBaseClient
Tests run: 1, Failures: 0, Errors: 0, Skipped: 0, Time elapsed: 0.285 sec - in org.apache.hadoop.hbase.ipc.TestHBaseClient
Running org.apache.hadoop.hbase.ipc.TestProtoBufRpc
Tests run: 1, Failures: 0, Errors: 0, Skipped: 0, Time elapsed: 1.453 sec - in org.apache.hadoop.hbase.ipc.TestProtoBufRpc
Running org.apache.hadoop.hbase.ipc.TestDelayedRpc
Tests run: 4, Failures: 0, Errors: 0, Skipped: 0, Time elapsed: 3.392 sec - in org.apache.hadoop.hbase.ipc.TestDelayedRpc
Running org.apache.hadoop.hbase.trace.TestHTraceHooks
Tests run: 1, Failures: 0, Errors: 0, Skipped: 0, Time elapsed: 5.81 sec - in org.apache.hadoop.hbase.trace.TestHTraceHooks
Running org.apache.hadoop.hbase.TestInfoServers
Tests run: 3, Failures: 0, Errors: 0, Skipped: 0, Time elapsed: 4.338 sec - in org.apache.hadoop.hbase.TestInfoServers
Running org.apache.hadoop.hbase.TestHBaseOnOtherDfsCluster
Tests run: 1, Failures: 0, Errors: 0, Skipped: 0, Time elapsed: 14.599 sec - in org.apache.hadoop.hbase.TestHBaseOnOtherDfsCluster
Running org.apache.hadoop.hbase.client.TestCloneSnapshotFromClient
Tests run: 5, Failures: 0, Errors: 0, Skipped: 0, Time elapsed: 96.757 sec - in org.apache.hadoop.hbase.client.TestCloneSnapshotFromClient
Running org.apache.hadoop.hbase.client.TestSnapshotMetadata
Tests run: 4, Failures: 0, Errors: 0, Skipped: 0, Time elapsed: 33.292 sec - in org.apache.hadoop.hbase.client.TestSnapshotMetadata
Running org.apache.hadoop.hbase.client.TestHTableMultiplexer
Tests run: 1, Failures: 0, Errors: 0, Skipped: 0, Time elapsed: 11.742 sec - in org.apache.hadoop.hbase.client.TestHTableMultiplexer
Running org.apache.hadoop.hbase.client.TestClientOperationInterrupt
Tests run: 1, Failures: 0, Errors: 0, Skipped: 0, Time elapsed: 55.779 sec - in org.apache.hadoop.hbase.client.TestClientOperationInterrupt
Running org.apache.hadoop.hbase.client.TestSizeFailures
Tests run: 2, Failures: 0, Errors: 0, Skipped: 0, Time elapsed: 32.811 sec - in org.apache.hadoop.hbase.client.TestSizeFailures
Running org.apache.hadoop.hbase.client.TestHTablePool$TestHTableReusablePool
Tests run: 9, Failures: 0, Errors: 0, Skipped: 0, Time elapsed: 15.682 sec - in org.apache.hadoop.hbase.client.TestHTablePool$TestHTableReusablePool
Running org.apache.hadoop.hbase.client.TestHTablePool$TestHTableThreadLocalPool
Tests run: 9, Failures: 0, Errors: 0, Skipped: 0, Time elapsed: 7.216 sec - in org.apache.hadoop.hbase.client.TestHTablePool$TestHTableThreadLocalPool
Running org.apache.hadoop.hbase.client.TestMultipleTimestamps
Tests run: 8, Failures: 0, Errors: 0, Skipped: 0, Time elapsed: 16.713 sec - in org.apache.hadoop.hbase.client.TestMultipleTimestamps
Running org.apache.hadoop.hbase.client.TestSnapshotCloneIndependence
Tests run: 8, Failures: 0, Errors: 2, Skipped: 0, Time elapsed: 80.828 sec <<< FAILURE!
- in org.apache.hadoop.hbase.client.TestSnapshotCloneIndependence
testOnlineSnapshotAppendIndependent(org.apache.hadoop.hbase.client.TestSnapshotCloneIndependence)
 Time elapsed: 7.916 sec  <<< ERROR!
org.apache.hadoop.hbase.snapshot.RestoreSnapshotException: org.apache.hadoop.hbase.snapshot.RestoreSnapshotException:
clone snapshot={ ss=snapshot_test1454604831356 table=test1454604831356 type=FLUSH } failed
because java.util.concurrent.ExecutionException: org.apache.hadoop.ipc.RemoteException: org.apache.hadoop.hdfs.server.namenode.LeaseExpiredException:
No lease on /user/jenkins/hbase/archive/data/default/test1454604831356/942bf327db1cf84969b5c65eca8167bd/fam/.links-d52594d628bd46cab03e397e7bbe508f/89fef287e64a32abbfcf7446400c1ce2.test-clone-test1454604831356
File does not exist. Holder DFSClient_NONMAPREDUCE_-20242488_1 does not have any open files
	at org.apache.hadoop.hbase.ipc.RpcClient.call(RpcClient.java:1489)
	at org.apache.hadoop.hbase.ipc.RpcClient.callBlockingMethod(RpcClient.java:1691)
	at org.apache.hadoop.hbase.ipc.RpcClient$BlockingRpcChannelImplementation.callBlockingMethod(RpcClient.java:1750)
	at org.apache.hadoop.hbase.protobuf.generated.MasterProtos$MasterService$BlockingStub.isRestoreSnapshotDone(MasterProtos.java:45837)
	at org.apache.hadoop.hbase.client.HConnectionManager$HConnectionImplementation$5.isRestoreSnapshotDone(HConnectionManager.java:2168)
	at org.apache.hadoop.hbase.client.HBaseAdmin$30.call(HBaseAdmin.java:3222)
	at org.apache.hadoop.hbase.client.HBaseAdmin$30.call(HBaseAdmin.java:3219)
	at org.apache.hadoop.hbase.client.RpcRetryingCaller.callWithRetries(RpcRetryingCaller.java:115)
	at org.apache.hadoop.hbase.client.RpcRetryingCaller.callWithRetries(RpcRetryingCaller.java:91)
	at org.apache.hadoop.hbase.client.HBaseAdmin.executeCallable(HBaseAdmin.java:3479)
	at org.apache.hadoop.hbase.client.HBaseAdmin.internalRestoreSnapshot(HBaseAdmin.java:3218)
	at org.apache.hadoop.hbase.client.HBaseAdmin.cloneSnapshot(HBaseAdmin.java:3080)
	at org.apache.hadoop.hbase.client.HBaseAdmin.cloneSnapshot(HBaseAdmin.java:3030)
	at org.apache.hadoop.hbase.client.TestSnapshotCloneIndependence.runTestSnapshotAppendIndependent(TestSnapshotCloneIndependence.java:232)
	at org.apache.hadoop.hbase.client.TestSnapshotCloneIndependence.testOnlineSnapshotAppendIndependent(TestSnapshotCloneIndependence.java:128)

testOfflineSnapshotDeleteIndependent(org.apache.hadoop.hbase.client.TestSnapshotCloneIndependence)
 Time elapsed: 5.969 sec  <<< ERROR!
org.apache.hadoop.hbase.snapshot.RestoreSnapshotException: org.apache.hadoop.hbase.snapshot.RestoreSnapshotException:
clone snapshot={ ss=snapshot_test1454604839201 table=test1454604839201 type=DISABLED } failed
because java.util.concurrent.ExecutionException: org.apache.hadoop.ipc.RemoteException: org.apache.hadoop.hdfs.server.namenode.LeaseExpiredException:
No lease on /user/jenkins/hbase/archive/data/default/test1454604839201/e208ac5d00418aac2d3e1e8835b35f94/fam/.links-646e1681817f40e591461a87a810021a/28fa3a3468bd2f4e4aac99c55cdebdfa.test-clone-test1454604839201
File does not exist. Holder DFSClient_NONMAPREDUCE_-20242488_1 does not have any open files
	at org.apache.hadoop.hbase.ipc.RpcClient.call(RpcClient.java:1489)
	at org.apache.hadoop.hbase.ipc.RpcClient.callBlockingMethod(RpcClient.java:1691)
	at org.apache.hadoop.hbase.ipc.RpcClient$BlockingRpcChannelImplementation.callBlockingMethod(RpcClient.java:1750)
	at org.apache.hadoop.hbase.protobuf.generated.MasterProtos$MasterService$BlockingStub.isRestoreSnapshotDone(MasterProtos.java:45837)
	at org.apache.hadoop.hbase.client.HConnectionManager$HConnectionImplementation$5.isRestoreSnapshotDone(HConnectionManager.java:2168)
	at org.apache.hadoop.hbase.client.HBaseAdmin$30.call(HBaseAdmin.java:3222)
	at org.apache.hadoop.hbase.client.HBaseAdmin$30.call(HBaseAdmin.java:3219)
	at org.apache.hadoop.hbase.client.RpcRetryingCaller.callWithRetries(RpcRetryingCaller.java:115)
	at org.apache.hadoop.hbase.client.RpcRetryingCaller.callWithRetries(RpcRetryingCaller.java:91)
	at org.apache.hadoop.hbase.client.HBaseAdmin.executeCallable(HBaseAdmin.java:3479)
	at org.apache.hadoop.hbase.client.HBaseAdmin.internalRestoreSnapshot(HBaseAdmin.java:3218)
	at org.apache.hadoop.hbase.client.HBaseAdmin.cloneSnapshot(HBaseAdmin.java:3080)
	at org.apache.hadoop.hbase.client.HBaseAdmin.cloneSnapshot(HBaseAdmin.java:3045)
	at org.apache.hadoop.hbase.client.TestSnapshotCloneIndependence.runTestSnapshotDeleteIndependent(TestSnapshotCloneIndependence.java:425)
	at org.apache.hadoop.hbase.client.TestSnapshotCloneIndependence.testOfflineSnapshotDeleteIndependent(TestSnapshotCloneIndependence.java:178)

Running org.apache.hadoop.hbase.client.TestSnapshotFromClient
Tests run: 9, Failures: 0, Errors: 0, Skipped: 0, Time elapsed: 55.902 sec - in org.apache.hadoop.hbase.client.TestSnapshotFromClient
Running org.apache.hadoop.hbase.client.TestHTablePool$TestHTableThreadLocalPool
Tests run: 9, Failures: 0, Errors: 0, Skipped: 0, Time elapsed: 6.329 sec - in org.apache.hadoop.hbase.client.TestHTablePool$TestHTableThreadLocalPool
Running org.apache.hadoop.hbase.client.TestHCM
Tests run: 15, Failures: 0, Errors: 0, Skipped: 3, Time elapsed: 52.978 sec - in org.apache.hadoop.hbase.client.TestHCM
Running org.apache.hadoop.hbase.client.TestAdmin2
Tests run: 24, Failures: 0, Errors: 0, Skipped: 0, Time elapsed: 74.249 sec - in org.apache.hadoop.hbase.client.TestAdmin2
Running org.apache.hadoop.hbase.client.TestClientTimeouts
Tests run: 1, Failures: 0, Errors: 0, Skipped: 0, Time elapsed: 4.249 sec - in org.apache.hadoop.hbase.client.TestClientTimeouts
Running org.apache.hadoop.hbase.client.replication.TestReplicationAdmin
Tests run: 4, Failures: 0, Errors: 0, Skipped: 0, Time elapsed: 0.57 sec - in org.apache.hadoop.hbase.client.replication.TestReplicationAdmin
Running org.apache.hadoop.hbase.client.replication.TestReplicationAdminWithClusters
Tests run: 8, Failures: 0, Errors: 0, Skipped: 0, Time elapsed: 28.552 sec - in org.apache.hadoop.hbase.client.replication.TestReplicationAdminWithClusters
Running org.apache.hadoop.hbase.client.TestScannerTimeout
Tests run: 4, Failures: 0, Errors: 0, Skipped: 0, Time elapsed: 44.125 sec - in org.apache.hadoop.hbase.client.TestScannerTimeout
Running org.apache.hadoop.hbase.client.TestFromClientSideNoCodec
Tests run: 2, Failures: 0, Errors: 0, Skipped: 0, Time elapsed: 4.578 sec - in org.apache.hadoop.hbase.client.TestFromClientSideNoCodec
Running org.apache.hadoop.hbase.client.TestLeaseRenewal
Tests run: 1, Failures: 0, Errors: 0, Skipped: 0, Time elapsed: 26.6 sec - in org.apache.hadoop.hbase.client.TestLeaseRenewal
Running org.apache.hadoop.hbase.client.TestScannersFromClientSide
Tests run: 7, Failures: 0, Errors: 0, Skipped: 0, Time elapsed: 13.566 sec - in org.apache.hadoop.hbase.client.TestScannersFromClientSide
Running org.apache.hadoop.hbase.client.TestHTableUtil
Tests run: 2, Failures: 0, Errors: 0, Skipped: 0, Time elapsed: 4.406 sec - in org.apache.hadoop.hbase.client.TestHTableUtil
Running org.apache.hadoop.hbase.client.TestFromClientSide
Tests run: 81, Failures: 0, Errors: 0, Skipped: 4, Time elapsed: 179.151 sec - in org.apache.hadoop.hbase.client.TestFromClientSide
Running org.apache.hadoop.hbase.client.TestCheckAndMutate
Tests run: 1, Failures: 0, Errors: 0, Skipped: 0, Time elapsed: 3.773 sec - in org.apache.hadoop.hbase.client.TestCheckAndMutate
Running org.apache.hadoop.hbase.client.TestHTableMultiplexerFlushCache
Tests run: 1, Failures: 0, Errors: 0, Skipped: 0, Time elapsed: 7.853 sec - in org.apache.hadoop.hbase.client.TestHTableMultiplexerFlushCache
Running org.apache.hadoop.hbase.client.TestTimestampsFilter
Tests run: 3, Failures: 0, Errors: 0, Skipped: 0, Time elapsed: 12.533 sec - in org.apache.hadoop.hbase.client.TestTimestampsFilter
Running org.apache.hadoop.hbase.client.TestResultSizeEstimation
Tests run: 2, Failures: 0, Errors: 0, Skipped: 0, Time elapsed: 5.807 sec - in org.apache.hadoop.hbase.client.TestResultSizeEstimation
Running org.apache.hadoop.hbase.client.TestClientPushback
Tests run: 1, Failures: 0, Errors: 0, Skipped: 0, Time elapsed: 3.439 sec - in org.apache.hadoop.hbase.client.TestClientPushback
Running org.apache.hadoop.hbase.client.TestTableSnapshotScanner
Tests run: 3, Failures: 0, Errors: 0, Skipped: 0, Time elapsed: 108.517 sec - in org.apache.hadoop.hbase.client.TestTableSnapshotScanner
Running org.apache.hadoop.hbase.client.TestRpcControllerFactory
Tests run: 2, Failures: 0, Errors: 0, Skipped: 0, Time elapsed: 4.547 sec - in org.apache.hadoop.hbase.client.TestRpcControllerFactory
Running org.apache.hadoop.hbase.client.TestMultiParallel
Tests run: 12, Failures: 0, Errors: 0, Skipped: 0, Time elapsed: 28.64 sec - in org.apache.hadoop.hbase.client.TestMultiParallel
Running org.apache.hadoop.hbase.client.TestClientScannerRPCTimeout
Tests run: 1, Failures: 0, Errors: 0, Skipped: 0, Time elapsed: 24.709 sec - in org.apache.hadoop.hbase.client.TestClientScannerRPCTimeout
Running org.apache.hadoop.hbase.client.TestHTablePool$TestHTableReusablePool
Tests run: 9, Failures: 0, Errors: 0, Skipped: 0, Time elapsed: 6.554 sec - in org.apache.hadoop.hbase.client.TestHTablePool$TestHTableReusablePool
Running org.apache.hadoop.hbase.client.TestMetaScanner
Tests run: 2, Failures: 0, Errors: 0, Skipped: 0, Time elapsed: 57.635 sec - in org.apache.hadoop.hbase.client.TestMetaScanner
Running org.apache.hadoop.hbase.client.TestRestoreSnapshotFromClient
Tests run: 5, Failures: 0, Errors: 0, Skipped: 0, Time elapsed: 126.609 sec - in org.apache.hadoop.hbase.client.TestRestoreSnapshotFromClient
Running org.apache.hadoop.hbase.client.TestPutWithDelete
Tests run: 1, Failures: 0, Errors: 0, Skipped: 0, Time elapsed: 4.113 sec - in org.apache.hadoop.hbase.client.TestPutWithDelete
Running org.apache.hadoop.hbase.client.TestAdmin1
Tests run: 26, Failures: 0, Errors: 0, Skipped: 0, Time elapsed: 86.468 sec - in org.apache.hadoop.hbase.client.TestAdmin1
Running org.apache.hadoop.hbase.client.TestFromClientSide3
Tests run: 8, Failures: 0, Errors: 0, Skipped: 0, Time elapsed: 109.69 sec - in org.apache.hadoop.hbase.client.TestFromClientSide3
Running org.apache.hadoop.hbase.client.TestFromClientSideWithCoprocessor
Build timed out (after 300 minutes). Marking the build as failed.
Build was aborted
Performing Post build task...
Match found for :.* : True
Logical operation result is TRUE
Running script  : # Post-build task script. TODO: Check this in and have all builds reference
check-in.
pwd && ls
# NOTE!!!! The below code has been copied and pasted from ./dev-tools/run-test.sh
# Do not change here without syncing there and vice-versa.
ZOMBIE_TESTS_COUNT=`jps -v | grep surefirebooter | grep -e '-Dhbase.test' | wc -l`
if [[ $ZOMBIE_TESTS_COUNT != 0 ]] ; then
 echo "Suspicious java process found - waiting 30s to see if there are just slow to stop"
 sleep 30
 ZOMBIE_TESTS_COUNT=`jps -v | grep surefirebooter | grep -e '-Dhbase.test' | wc -l`
 if [[ $ZOMBIE_TESTS_COUNT != 0 ]] ; then
   echo " {color:red}There appear to be $ZOMBIE_TESTS_COUNT zombie tests{color}, they should
have been killed by surefire but survived"
   jps -v | grep surefirebooter | grep -e '-Dhbase.test'
   jps -v | grep surefirebooter | grep -e '-Dhbase.test' | cut -d ' ' -f 1 | xargs -n 1 jstack
   # Exit with error
   exit 1
 else
   echo "We're ok: there is no zombie test, but some tests took some time to stop"
 fi
else
  echo "We're ok: there is no zombie test"
fi
[HBase-0.98-on-Hadoop-1.1] $ /bin/bash -xe /tmp/hudson6122285446464366580.sh
+ pwd
<https://builds.apache.org/job/HBase-0.98-on-Hadoop-1.1/ws/>
+ ls
bin
CHANGES.txt
conf
dev-support
hbase-annotations
hbase-assembly
hbase-checkstyle
hbase-client
hbase-common
hbase-examples
hbase-hadoop1-compat
hbase-hadoop2-compat
hbase-hadoop-compat
hbase-it
hbase-prefix-tree
hbase-protocol
hbase-resource-bundle
hbase-rest
hbase-server
hbase-shell
hbase-testing-util
hbase-thrift
LICENSE.txt
NOTICE.txt
pom.xml
README.txt
src
target
++ jps -v
++ grep surefirebooter
++ grep -e -Dhbase.test
++ wc -l
+ ZOMBIE_TESTS_COUNT=0
+ [[ 0 != 0 ]]
+ echo 'We'\''re ok: there is no zombie test'
We're ok: there is no zombie test
POST BUILD TASK : SUCCESS
END OF POST BUILD TASK : 0
Archiving artifacts
Recording test results
Updating HBASE-15200

Mime
View raw message