hbase-builds mailing list archives

Site index · List index
Message view « Date » · « Thread »
Top « Date » · « Thread »
From Apache Jenkins Server <jenk...@builds.apache.org>
Subject Build failed in Jenkins: HBase-1.1-JDK7 #1662
Date Fri, 12 Feb 2016 17:19:18 GMT
See <https://builds.apache.org/job/HBase-1.1-JDK7/1662/changes>

Changes:

[ndimiduk] HBASE-14812 Fix ResultBoundedCompletionService deadlock

[zhangduo] HBASE-15252 Data loss when replaying wal if HDFS timeout

------------------------------------------
[...truncated 2103 lines...]
Tests run: 4, Failures: 0, Errors: 0, Skipped: 0, Time elapsed: 6.346 sec - in org.apache.hadoop.hbase.regionserver.TestBlocksRead
Tests run: 2, Failures: 0, Errors: 0, Skipped: 0, Time elapsed: 23.4 sec - in org.apache.hadoop.hbase.regionserver.TestEncryptionKeyRotation
Running org.apache.hadoop.hbase.regionserver.TestRegionServerHostname
Running org.apache.hadoop.hbase.regionserver.TestJoinedScanners
Tests run: 7, Failures: 0, Errors: 0, Skipped: 0, Time elapsed: 27.391 sec - in org.apache.hadoop.hbase.regionserver.TestSplitLogWorker
Tests run: 7, Failures: 0, Errors: 0, Skipped: 0, Time elapsed: 57.781 sec - in org.apache.hadoop.hbase.regionserver.TestServerCustomProtocol
Running org.apache.hadoop.hbase.regionserver.TestMinorCompaction
Tests run: 2, Failures: 0, Errors: 0, Skipped: 0, Time elapsed: 34.783 sec - in org.apache.hadoop.hbase.regionserver.TestRegionServerHostname
Tests run: 6, Failures: 0, Errors: 0, Skipped: 0, Time elapsed: 9.674 sec - in org.apache.hadoop.hbase.regionserver.TestMinorCompaction
Running org.apache.hadoop.hbase.regionserver.TestRegionServerMetrics
Tests run: 1, Failures: 0, Errors: 0, Skipped: 0, Time elapsed: 45.71 sec - in org.apache.hadoop.hbase.regionserver.TestJoinedScanners
Running org.apache.hadoop.hbase.regionserver.TestHRegionOnCluster
Running org.apache.hadoop.hbase.regionserver.TestTags
Running org.apache.hadoop.hbase.regionserver.TestScannerHeartbeatMessages
Tests run: 1, Failures: 0, Errors: 0, Skipped: 0, Time elapsed: 29.921 sec - in org.apache.hadoop.hbase.regionserver.TestHRegionOnCluster
Tests run: 11, Failures: 0, Errors: 0, Skipped: 0, Time elapsed: 39.356 sec - in org.apache.hadoop.hbase.regionserver.TestRegionServerMetrics
Tests run: 1, Failures: 0, Errors: 0, Skipped: 0, Time elapsed: 28.942 sec - in org.apache.hadoop.hbase.regionserver.TestScannerHeartbeatMessages
Running org.apache.hadoop.hbase.regionserver.TestPerColumnFamilyFlush
Running org.apache.hadoop.hbase.regionserver.TestRowTooBig
Running org.apache.hadoop.hbase.regionserver.TestSCVFWithMiniCluster
Tests run: 5, Failures: 0, Errors: 0, Skipped: 0, Time elapsed: 0.945 sec - in org.apache.hadoop.hbase.regionserver.TestSCVFWithMiniCluster
Tests run: 2, Failures: 0, Errors: 0, Skipped: 0, Time elapsed: 28.933 sec - in org.apache.hadoop.hbase.regionserver.TestRowTooBig
Tests run: 4, Failures: 0, Errors: 0, Skipped: 0, Time elapsed: 80.421 sec - in org.apache.hadoop.hbase.regionserver.TestTags
Running org.apache.hadoop.hbase.regionserver.TestSeekOptimizations
Running org.apache.hadoop.hbase.regionserver.TestCompactionState
Tests run: 6, Failures: 0, Errors: 0, Skipped: 0, Time elapsed: 14.452 sec - in org.apache.hadoop.hbase.regionserver.TestSeekOptimizations
Running org.apache.hadoop.hbase.regionserver.TestCompactionWithCoprocessor
Running org.apache.hadoop.hbase.regionserver.TestRegionReplicas
Tests run: 5, Failures: 0, Errors: 0, Skipped: 0, Time elapsed: 44.551 sec - in org.apache.hadoop.hbase.regionserver.TestCompactionWithCoprocessor
Running org.apache.hadoop.hbase.regionserver.TestStoreScanner
Tests run: 16, Failures: 0, Errors: 0, Skipped: 0, Time elapsed: 2.632 sec - in org.apache.hadoop.hbase.regionserver.TestStoreScanner
Running org.apache.hadoop.hbase.regionserver.TestHRegionReplayEvents
Tests run: 5, Failures: 0, Errors: 0, Skipped: 0, Time elapsed: 86.87 sec - in org.apache.hadoop.hbase.regionserver.TestCompactionState
Running org.apache.hadoop.hbase.regionserver.TestCacheOnWriteInSchema
Tests run: 3, Failures: 0, Errors: 0, Skipped: 0, Time elapsed: 8.454 sec - in org.apache.hadoop.hbase.regionserver.TestCacheOnWriteInSchema
Tests run: 26, Failures: 0, Errors: 0, Skipped: 0, Time elapsed: 38.83 sec - in org.apache.hadoop.hbase.regionserver.TestHRegionReplayEvents
Running org.apache.hadoop.hbase.regionserver.wal.TestReadOldRootAndMetaEdits
Tests run: 1, Failures: 0, Errors: 0, Skipped: 0, Time elapsed: 0.953 sec - in org.apache.hadoop.hbase.regionserver.wal.TestReadOldRootAndMetaEdits
Tests run: 6, Failures: 0, Errors: 0, Skipped: 0, Time elapsed: 152.991 sec - in org.apache.hadoop.hbase.regionserver.TestPerColumnFamilyFlush
Running org.apache.hadoop.hbase.regionserver.wal.TestFSHLog
Running org.apache.hadoop.hbase.regionserver.wal.TestWALReplayCompressed
Tests run: 7, Failures: 0, Errors: 0, Skipped: 0, Time elapsed: 8.612 sec - in org.apache.hadoop.hbase.regionserver.wal.TestFSHLog
Running org.apache.hadoop.hbase.regionserver.wal.TestSecureWALReplay
Running org.apache.hadoop.hbase.regionserver.wal.TestWALReplay
Tests run: 10, Failures: 0, Errors: 0, Skipped: 0, Time elapsed: 58.709 sec - in org.apache.hadoop.hbase.regionserver.wal.TestWALReplayCompressed
Running org.apache.hadoop.hbase.regionserver.wal.TestLogRollAbort
Tests run: 10, Failures: 0, Errors: 0, Skipped: 0, Time elapsed: 62.534 sec - in org.apache.hadoop.hbase.regionserver.wal.TestSecureWALReplay
Running org.apache.hadoop.hbase.regionserver.wal.TestLogRolling
Tests run: 10, Failures: 0, Errors: 0, Skipped: 0, Time elapsed: 54.685 sec - in org.apache.hadoop.hbase.regionserver.wal.TestWALReplay
Running org.apache.hadoop.hbase.regionserver.wal.TestProtobufLog
Tests run: 1, Failures: 0, Errors: 0, Skipped: 0, Time elapsed: 2.539 sec - in org.apache.hadoop.hbase.regionserver.wal.TestProtobufLog
Tests run: 2, Failures: 0, Errors: 0, Skipped: 0, Time elapsed: 40.06 sec - in org.apache.hadoop.hbase.regionserver.wal.TestLogRollAbort
Tests run: 7, Failures: 0, Errors: 0, Skipped: 0, Time elapsed: 212.463 sec - in org.apache.hadoop.hbase.regionserver.TestRegionReplicas
Running org.apache.hadoop.hbase.regionserver.wal.TestDurability
Tests run: 3, Failures: 0, Errors: 0, Skipped: 0, Time elapsed: 4.584 sec - in org.apache.hadoop.hbase.regionserver.wal.TestDurability
Running org.apache.hadoop.hbase.regionserver.wal.TestLogRollPeriod
Running org.apache.hadoop.hbase.regionserver.TestScannerWithBulkload
Running org.apache.hadoop.hbase.regionserver.TestEncryptionRandomKeying
Tests run: 1, Failures: 0, Errors: 0, Skipped: 0, Time elapsed: 1.262 sec - in org.apache.hadoop.hbase.regionserver.TestEncryptionRandomKeying
Tests run: 3, Failures: 0, Errors: 0, Skipped: 0, Time elapsed: 15.474 sec - in org.apache.hadoop.hbase.regionserver.TestScannerWithBulkload
Running org.apache.hadoop.hbase.regionserver.TestDefaultMemStore
Running org.apache.hadoop.hbase.regionserver.handler.TestOpenRegionHandler
Tests run: 12, Failures: 0, Errors: 0, Skipped: 0, Time elapsed: 494.307 sec - in org.apache.hadoop.hbase.regionserver.TestRegionReplicaFailover
Tests run: 6, Failures: 0, Errors: 0, Skipped: 0, Time elapsed: 5.086 sec - in org.apache.hadoop.hbase.regionserver.handler.TestOpenRegionHandler
Running org.apache.hadoop.hbase.regionserver.handler.TestCloseRegionHandler
Running org.apache.hadoop.hbase.regionserver.TestMasterAddressTracker
Tests run: 5, Failures: 0, Errors: 0, Skipped: 0, Time elapsed: 3.079 sec - in org.apache.hadoop.hbase.regionserver.TestMasterAddressTracker
Tests run: 3, Failures: 0, Errors: 0, Skipped: 0, Time elapsed: 4.749 sec - in org.apache.hadoop.hbase.regionserver.handler.TestCloseRegionHandler
Running org.apache.hadoop.hbase.regionserver.TestParallelPut
Tests run: 2, Failures: 0, Errors: 0, Skipped: 0, Time elapsed: 63.281 sec - in org.apache.hadoop.hbase.regionserver.wal.TestLogRollPeriod
Tests run: 2, Failures: 0, Errors: 0, Skipped: 0, Time elapsed: 18.108 sec - in org.apache.hadoop.hbase.regionserver.TestParallelPut
Running org.apache.hadoop.hbase.regionserver.TestSplitTransactionOnCluster
Running org.apache.hadoop.hbase.regionserver.TestRegionIncrement
Tests run: 24, Failures: 0, Errors: 0, Skipped: 0, Time elapsed: 49.683 sec - in org.apache.hadoop.hbase.regionserver.TestDefaultMemStore
Running org.apache.hadoop.hbase.regionserver.TestRegionServerOnlineConfigChange
Tests run: 2, Failures: 0, Errors: 0, Skipped: 0, Time elapsed: 1.518 sec - in org.apache.hadoop.hbase.regionserver.TestRegionServerOnlineConfigChange
Running org.apache.hadoop.hbase.regionserver.TestCompaction
Tests run: 2, Failures: 0, Errors: 0, Skipped: 0, Time elapsed: 24.69 sec - in org.apache.hadoop.hbase.regionserver.TestRegionIncrement
Running org.apache.hadoop.hbase.regionserver.TestRecoveredEdits
Running org.apache.hadoop.hbase.regionserver.TestRegionMergeTransactionOnCluster
Tests run: 1, Failures: 0, Errors: 0, Skipped: 0, Time elapsed: 25.673 sec - in org.apache.hadoop.hbase.regionserver.TestRecoveredEdits
Running org.apache.hadoop.hbase.regionserver.TestGetClosestAtOrBefore
Tests run: 3, Failures: 0, Errors: 0, Skipped: 0, Time elapsed: 4.039 sec - in org.apache.hadoop.hbase.regionserver.TestGetClosestAtOrBefore
Running org.apache.hadoop.hbase.regionserver.TestCompoundBloomFilter
Tests run: 5, Failures: 0, Errors: 0, Skipped: 0, Time elapsed: 42.598 sec - in org.apache.hadoop.hbase.regionserver.TestCompaction
Running org.apache.hadoop.hbase.regionserver.TestRegionServerReportForDuty
Tests run: 4, Failures: 0, Errors: 0, Skipped: 0, Time elapsed: 44.08 sec - in org.apache.hadoop.hbase.regionserver.TestRegionMergeTransactionOnCluster
Tests run: 3, Failures: 0, Errors: 0, Skipped: 0, Time elapsed: 35.947 sec - in org.apache.hadoop.hbase.regionserver.TestCompoundBloomFilter
Running org.apache.hadoop.hbase.regionserver.TestHRegion
Tests run: 1, Failures: 0, Errors: 0, Skipped: 0, Time elapsed: 34.378 sec - in org.apache.hadoop.hbase.regionserver.TestRegionServerReportForDuty
Running org.apache.hadoop.hbase.regionserver.TestAtomicOperation
Running org.apache.hadoop.hbase.regionserver.compactions.TestCompactionWithThroughputController
Tests run: 17, Failures: 0, Errors: 0, Skipped: 0, Time elapsed: 160.354 sec - in org.apache.hadoop.hbase.regionserver.TestSplitTransactionOnCluster
Running org.apache.hadoop.hbase.regionserver.TestFSErrorsExposed
Tests run: 3, Failures: 0, Errors: 0, Skipped: 0, Time elapsed: 100.785 sec - in org.apache.hadoop.hbase.regionserver.compactions.TestCompactionWithThroughputController
Running org.apache.hadoop.hbase.regionserver.TestRSKilledWhenInitializing
Tests run: 3, Failures: 0, Errors: 0, Skipped: 0, Time elapsed: 61.053 sec - in org.apache.hadoop.hbase.regionserver.TestFSErrorsExposed
Tests run: 6, Failures: 0, Errors: 0, Skipped: 0, Time elapsed: 121.22 sec - in org.apache.hadoop.hbase.regionserver.TestAtomicOperation
Running org.apache.hadoop.hbase.regionserver.TestMultiColumnScanner
Running org.apache.hadoop.hbase.regionserver.TestFlushRegionEntry
Tests run: 1, Failures: 0, Errors: 0, Skipped: 0, Time elapsed: 2.019 sec - in org.apache.hadoop.hbase.regionserver.TestFlushRegionEntry
Tests run: 1, Failures: 0, Errors: 0, Skipped: 0, Time elapsed: 26.392 sec - in org.apache.hadoop.hbase.regionserver.TestRSKilledWhenInitializing
Running org.apache.hadoop.hbase.regionserver.TestStore
Running org.apache.hadoop.hbase.TestMetaTableLocator
Tests run: 7, Failures: 0, Errors: 0, Skipped: 0, Time elapsed: 7.29 sec - in org.apache.hadoop.hbase.TestMetaTableLocator
Tests run: 18, Failures: 0, Errors: 0, Skipped: 0, Time elapsed: 23.561 sec - in org.apache.hadoop.hbase.regionserver.TestStore
Running org.apache.hadoop.hbase.namespace.TestNamespaceAuditor
Tests run: 5, Failures: 0, Errors: 0, Skipped: 0, Time elapsed: 399.776 sec - in org.apache.hadoop.hbase.regionserver.wal.TestLogRolling
Tests run: 99, Failures: 0, Errors: 0, Skipped: 0, Time elapsed: 213.613 sec - in org.apache.hadoop.hbase.regionserver.TestHRegion
Tests run: 12, Failures: 0, Errors: 0, Skipped: 0, Time elapsed: 112.683 sec - in org.apache.hadoop.hbase.regionserver.TestMultiColumnScanner
Tests run: 12, Failures: 0, Errors: 0, Skipped: 0, Time elapsed: 157.714 sec - in org.apache.hadoop.hbase.namespace.TestNamespaceAuditor

Results :

Flaked tests: 
org.apache.hadoop.hbase.client.TestMultiParallel.testActiveThreadsCount(org.apache.hadoop.hbase.client.TestMultiParallel)
  Run 1: TestMultiParallel.testActiveThreadsCount:164 expected:<5> but was:<4>
  Run 2: PASS

org.apache.hadoop.hbase.master.TestAssignmentManager.testBalanceOnMasterFailoverScenarioWithClosedNode(org.apache.hadoop.hbase.master.TestAssignmentManager)
  Run 1: TestAssignmentManager.testBalanceOnMasterFailoverScenarioWithClosedNode:314 expected
not same
  Run 2: PASS

org.apache.hadoop.hbase.regionserver.TestFailedAppendAndSync.testLockupAroundBadAssignSync(org.apache.hadoop.hbase.regionserver.TestFailedAppendAndSync)
  Run 1: TestFailedAppendAndSync.testLockupAroundBadAssignSync:242 » TestTimedOut test ...
  Run 2: PASS

org.apache.hadoop.hbase.util.TestHBaseFsck.testQuarantineMissingHFile(org.apache.hadoop.hbase.util.TestHBaseFsck)
  Run 1: TestHBaseFsck.testQuarantineMissingHFile:2177->doQuarantineTest:2148->cleanupTable:475->deleteTable:2816
» TableNotDisabled
  Run 2: PASS


Tests run: 2484, Failures: 0, Errors: 0, Skipped: 21, Flakes: 4

[INFO] ------------------------------------------------------------------------
[INFO] Reactor Summary:
[INFO] 
[INFO] Apache HBase ...................................... SUCCESS [13.684s]
[INFO] Apache HBase - Checkstyle ......................... SUCCESS [3.004s]
[INFO] Apache HBase - Resource Bundle .................... SUCCESS [1.248s]
[INFO] Apache HBase - Annotations ........................ SUCCESS [5.172s]
[INFO] Apache HBase - Protocol ........................... SUCCESS [47.855s]
[INFO] Apache HBase - Common ............................. SUCCESS [4:24.382s]
[INFO] Apache HBase - Procedure .......................... SUCCESS [4:02.681s]
[INFO] Apache HBase - Client ............................. SUCCESS [4:11.828s]
[INFO] Apache HBase - Hadoop Compatibility ............... SUCCESS [11.567s]
[INFO] Apache HBase - Hadoop Two Compatibility ........... SUCCESS [15.609s]
[INFO] Apache HBase - Prefix Tree ........................ SUCCESS [22.329s]
[INFO] Apache HBase - Server ............................. FAILURE [2:58:05.246s]
[INFO] Apache HBase - Testing Util ....................... SKIPPED
[INFO] Apache HBase - Thrift ............................. SKIPPED
[INFO] Apache HBase - Rest ............................... SKIPPED
[INFO] Apache HBase - Shell .............................. SKIPPED
[INFO] Apache HBase - Integration Tests .................. SKIPPED
[INFO] Apache HBase - Examples ........................... SKIPPED
[INFO] Apache HBase - Assembly ........................... SKIPPED
[INFO] Apache HBase - Shaded ............................. SKIPPED
[INFO] Apache HBase - Shaded - Client .................... SKIPPED
[INFO] Apache HBase - Shaded - Server .................... SKIPPED
[INFO] ------------------------------------------------------------------------
[INFO] BUILD FAILURE
[INFO] ------------------------------------------------------------------------
[INFO] Total time: 3:12:53.351s
[INFO] Finished at: Fri Feb 12 17:15:01 UTC 2016
[INFO] Final Memory: 54M/563M
[INFO] ------------------------------------------------------------------------
[ERROR] Failed to execute goal org.apache.maven.plugins:maven-surefire-plugin:2.18.1:test
(secondPartTestsExecution) on project hbase-server: There was a timeout or other error in
the fork -> [Help 1]
[ERROR] 
[ERROR] To see the full stack trace of the errors, re-run Maven with the -e switch.
[ERROR] Re-run Maven using the -X switch to enable full debug logging.
[ERROR] 
[ERROR] For more information about the errors and possible solutions, please read the following
articles:
[ERROR] [Help 1] http://cwiki.apache.org/confluence/display/MAVEN/MojoFailureException
[ERROR] 
[ERROR] After correcting the problems, you can resume the build with the command
[ERROR]   mvn <goals> -rf :hbase-server
Build step 'Invoke top-level Maven targets' marked build as failure
Performing Post build task...
Match found for :.* : True
Logical operation result is TRUE
Running script  : # Post-build task script. TODO: Check this in and have all builds reference
check-in.
pwd && ls
# NOTE!!!! The below code has been copied and pasted from ./dev-tools/run-test.sh
# Do not change here without syncing there and vice-versa.
ZOMBIE_TESTS_COUNT=`jps -v | grep surefirebooter | grep -e '-Dhbase.test' | wc -l`
if [[ $ZOMBIE_TESTS_COUNT != 0 ]] ; then
 echo "Suspicious java process found - waiting 30s to see if there are just slow to stop"
 sleep 30
 ZOMBIE_TESTS_COUNT=`jps -v | grep surefirebooter | grep -e '-Dhbase.test' | wc -l`
 if [[ $ZOMBIE_TESTS_COUNT != 0 ]] ; then
   echo " {color:red}There appear to be $ZOMBIE_TESTS_COUNT zombie tests{color}, they should
have been killed by surefire but survived"
   jps -v | grep surefirebooter | grep -e '-Dhbase.test'
   jps -v | grep surefirebooter | grep -e '-Dhbase.test' | cut -d ' ' -f 1 | xargs -n 1 jstack
   # Exit with error
   exit 1
 else
   echo "We're ok: there is no zombie test, but some tests took some time to stop"
 fi
else
  echo "We're ok: there is no zombie test"
fi
[HBase-1.1-JDK7] $ /bin/bash -xe /tmp/hudson510054161769934896.sh
+ pwd
<https://builds.apache.org/job/HBase-1.1-JDK7/ws/>
+ ls
bin
CHANGES.txt
conf
dev-support
hbase-annotations
hbase-assembly
hbase-checkstyle
hbase-client
hbase-common
hbase-examples
hbase-hadoop2-compat
hbase-hadoop-compat
hbase-it
hbase-native-client
hbase-prefix-tree
hbase-procedure
hbase-protocol
hbase-resource-bundle
hbase-rest
hbase-server
hbase-shaded
hbase-shell
hbase-testing-util
hbase-thrift
LICENSE.txt
NOTICE.txt
pom.xml
README.txt
src
target
++ wc -l
++ grep -e -Dhbase.test
++ grep surefirebooter
++ jps -v
+ ZOMBIE_TESTS_COUNT=0
+ [[ 0 != 0 ]]
+ echo 'We'\''re ok: there is no zombie test'
We're ok: there is no zombie test
POST BUILD TASK : SUCCESS
END OF POST BUILD TASK : 0
Archiving artifacts
Recording test results
Updating HBASE-15252
Updating HBASE-14812

Mime
View raw message