hbase-builds mailing list archives

Site index · List index
Message view « Date » · « Thread »
Top « Date » · « Thread »
From Apache Jenkins Server <jenk...@builds.apache.org>
Subject Build failed in Jenkins: HBase-Trunk_matrix » latest1.7,yahoo-not-h2 #738
Date Fri, 26 Feb 2016 00:52:56 GMT
See <https://builds.apache.org/job/HBase-Trunk_matrix/jdk=latest1.7,label=yahoo-not-h2/738/changes>

Changes:

[eclark] HBASE-15222 Addendum - Use less contended classes for metrics

[matteo.bertozzi] HBASE-15144 Procedure v2 - Web UI displaying Store state

------------------------------------------
[...truncated 5190 lines...]
Running org.apache.hadoop.hbase.coprocessor.TestHTableWrapper
Tests run: 1, Failures: 0, Errors: 0, Skipped: 0, Time elapsed: 6.458 sec - in org.apache.hadoop.hbase.regionserver.TestFailedAppendAndSync
Tests run: 1, Failures: 0, Errors: 0, Skipped: 0, Time elapsed: 9.63 sec - in org.apache.hadoop.hbase.coprocessor.TestHTableWrapper
Running org.apache.hadoop.hbase.backup.TestHFileArchiving
Tests run: 14, Failures: 0, Errors: 0, Skipped: 2, Time elapsed: 91.512 sec - in org.apache.hadoop.hbase.coprocessor.TestRegionObserverInterface
Running org.apache.hadoop.hbase.regionserver.TestReversibleScanners
Running org.apache.hadoop.hbase.regionserver.TestScannerRetriableFailure
Tests run: 5, Failures: 0, Errors: 0, Skipped: 0, Time elapsed: 15.671 sec - in org.apache.hadoop.hbase.regionserver.TestReversibleScanners
Running org.apache.hadoop.hbase.regionserver.TestSplitWalDataLoss
Running org.apache.hadoop.hbase.regionserver.TestRegionFavoredNodes
Tests run: 1, Failures: 0, Errors: 0, Skipped: 0, Time elapsed: 38.799 sec - in org.apache.hadoop.hbase.regionserver.TestScannerRetriableFailure
Tests run: 1, Failures: 0, Errors: 0, Skipped: 0, Time elapsed: 35.872 sec - in org.apache.hadoop.hbase.regionserver.TestSplitWalDataLoss
Tests run: 1, Failures: 0, Errors: 0, Skipped: 0, Time elapsed: 24.19 sec - in org.apache.hadoop.hbase.regionserver.TestRegionFavoredNodes
Running org.apache.hadoop.hbase.regionserver.TestClusterId
Tests run: 5, Failures: 0, Errors: 0, Skipped: 0, Time elapsed: 81.724 sec - in org.apache.hadoop.hbase.backup.TestHFileArchiving
Running org.apache.hadoop.hbase.regionserver.TestMajorCompaction
Running org.apache.hadoop.hbase.regionserver.TestEndToEndSplitTransaction
Running org.apache.hadoop.hbase.regionserver.TestRegionServerNoMaster
Tests run: 2, Failures: 0, Errors: 0, Skipped: 0, Time elapsed: 120.004 sec - in org.apache.hadoop.hbase.regionserver.TestHRegionServerBulkLoad
Running org.apache.hadoop.hbase.regionserver.TestCompactSplitThread
Tests run: 2, Failures: 0, Errors: 0, Skipped: 0, Time elapsed: 25.851 sec - in org.apache.hadoop.hbase.regionserver.TestEndToEndSplitTransaction
Tests run: 4, Failures: 0, Errors: 0, Skipped: 0, Time elapsed: 18.115 sec - in org.apache.hadoop.hbase.regionserver.TestRegionServerNoMaster
Running org.apache.hadoop.hbase.regionserver.TestWALLockup
Running org.apache.hadoop.hbase.regionserver.TestRegionReplicaFailover
Tests run: 1, Failures: 0, Errors: 0, Skipped: 0, Time elapsed: 7.236 sec - in org.apache.hadoop.hbase.regionserver.TestWALLockup
Tests run: 2, Failures: 0, Errors: 0, Skipped: 0, Time elapsed: 50.176 sec - in org.apache.hadoop.hbase.regionserver.TestClusterId
Running org.apache.hadoop.hbase.regionserver.TestHMobStore
Tests run: 1, Failures: 0, Errors: 0, Skipped: 0, Time elapsed: 25.419 sec - in org.apache.hadoop.hbase.regionserver.TestCompactSplitThread
Tests run: 8, Failures: 0, Errors: 0, Skipped: 0, Time elapsed: 11.366 sec - in org.apache.hadoop.hbase.regionserver.TestHMobStore
Running org.apache.hadoop.hbase.regionserver.TestPriorityRpc
Tests run: 7, Failures: 0, Errors: 0, Skipped: 0, Time elapsed: 55.78 sec - in org.apache.hadoop.hbase.regionserver.TestMajorCompaction
Running org.apache.hadoop.hbase.regionserver.TestBlocksRead
Running org.apache.hadoop.hbase.regionserver.TestServerCustomProtocol
Tests run: 4, Failures: 0, Errors: 0, Skipped: 0, Time elapsed: 8.907 sec - in org.apache.hadoop.hbase.regionserver.TestPriorityRpc
Running org.apache.hadoop.hbase.regionserver.TestSplitLogWorker
Tests run: 4, Failures: 0, Errors: 0, Skipped: 0, Time elapsed: 9.626 sec - in org.apache.hadoop.hbase.regionserver.TestBlocksRead
Running org.apache.hadoop.hbase.regionserver.TestEncryptionKeyRotation
Running org.apache.hadoop.hbase.regionserver.TestRegionServerHostname
Tests run: 7, Failures: 0, Errors: 0, Skipped: 0, Time elapsed: 27.085 sec - in org.apache.hadoop.hbase.regionserver.TestSplitLogWorker
Running org.apache.hadoop.hbase.regionserver.TestJoinedScanners
Tests run: 2, Failures: 0, Errors: 0, Skipped: 0, Time elapsed: 22.589 sec - in org.apache.hadoop.hbase.regionserver.TestEncryptionKeyRotation
Tests run: 2, Failures: 0, Errors: 0, Skipped: 0, Time elapsed: 34.124 sec - in org.apache.hadoop.hbase.regionserver.TestRegionServerHostname
Tests run: 7, Failures: 0, Errors: 0, Skipped: 0, Time elapsed: 51.901 sec - in org.apache.hadoop.hbase.regionserver.TestServerCustomProtocol
Running org.apache.hadoop.hbase.regionserver.TestMinorCompaction
Running org.apache.hadoop.hbase.regionserver.TestRegionServerMetrics
Tests run: 6, Failures: 0, Errors: 0, Skipped: 0, Time elapsed: 9.774 sec - in org.apache.hadoop.hbase.regionserver.TestMinorCompaction
Running org.apache.hadoop.hbase.regionserver.TestTags
Tests run: 1, Failures: 0, Errors: 0, Skipped: 0, Time elapsed: 54.926 sec - in org.apache.hadoop.hbase.regionserver.TestJoinedScanners
Running org.apache.hadoop.hbase.regionserver.TestMobStoreCompaction
Tests run: 4, Failures: 0, Errors: 0, Skipped: 0, Time elapsed: 9.164 sec - in org.apache.hadoop.hbase.regionserver.TestMobStoreCompaction
Running org.apache.hadoop.hbase.regionserver.TestHRegionOnCluster
Tests run: 13, Failures: 1, Errors: 0, Skipped: 0, Time elapsed: 49.923 sec <<< FAILURE!
- in org.apache.hadoop.hbase.regionserver.TestRegionServerMetrics
testRangeCountMetrics(org.apache.hadoop.hbase.regionserver.TestRegionServerMetrics)  Time
elapsed: 2.721 sec  <<< FAILURE!
java.lang.AssertionError: expected:<true> but was:<false>
	at org.junit.Assert.fail(Assert.java:88)
	at org.junit.Assert.failNotEquals(Assert.java:834)
	at org.junit.Assert.assertEquals(Assert.java:118)
	at org.junit.Assert.assertEquals(Assert.java:144)
	at org.apache.hadoop.hbase.regionserver.TestRegionServerMetrics.testRangeCountMetrics(TestRegionServerMetrics.java:577)

Running org.apache.hadoop.hbase.regionserver.TestScannerHeartbeatMessages
Running org.apache.hadoop.hbase.regionserver.TestRowTooBig
Tests run: 1, Failures: 0, Errors: 0, Skipped: 0, Time elapsed: 34.124 sec - in org.apache.hadoop.hbase.regionserver.TestHRegionOnCluster
Tests run: 1, Failures: 0, Errors: 0, Skipped: 0, Time elapsed: 28.542 sec - in org.apache.hadoop.hbase.regionserver.TestScannerHeartbeatMessages
Tests run: 4, Failures: 0, Errors: 0, Skipped: 0, Time elapsed: 73.247 sec - in org.apache.hadoop.hbase.regionserver.TestTags
Running org.apache.hadoop.hbase.regionserver.TestPerColumnFamilyFlush
Tests run: 2, Failures: 0, Errors: 0, Skipped: 0, Time elapsed: 27.139 sec - in org.apache.hadoop.hbase.regionserver.TestRowTooBig
Running org.apache.hadoop.hbase.regionserver.TestSeekOptimizations
Running org.apache.hadoop.hbase.regionserver.TestSCVFWithMiniCluster
Tests run: 5, Failures: 0, Errors: 0, Skipped: 0, Time elapsed: 1.642 sec - in org.apache.hadoop.hbase.regionserver.TestSCVFWithMiniCluster
Running org.apache.hadoop.hbase.regionserver.TestCompactionState
Tests run: 6, Failures: 0, Errors: 0, Skipped: 0, Time elapsed: 16.424 sec - in org.apache.hadoop.hbase.regionserver.TestSeekOptimizations
Running org.apache.hadoop.hbase.regionserver.TestCompactionWithCoprocessor
Running org.apache.hadoop.hbase.regionserver.TestRegionReplicas
Tests run: 5, Failures: 0, Errors: 0, Skipped: 0, Time elapsed: 35.253 sec - in org.apache.hadoop.hbase.regionserver.TestCompactionWithCoprocessor
Running org.apache.hadoop.hbase.regionserver.TestStoreScanner
Tests run: 16, Failures: 0, Errors: 0, Skipped: 0, Time elapsed: 1.923 sec - in org.apache.hadoop.hbase.regionserver.TestStoreScanner
Running org.apache.hadoop.hbase.regionserver.TestHRegionReplayEvents
Tests run: 6, Failures: 0, Errors: 0, Skipped: 0, Time elapsed: 295.693 sec - in org.apache.hadoop.hbase.regionserver.TestRegionReplicaFailover
Running org.apache.hadoop.hbase.regionserver.TestCacheOnWriteInSchema
Tests run: 5, Failures: 0, Errors: 0, Skipped: 0, Time elapsed: 82.283 sec - in org.apache.hadoop.hbase.regionserver.TestCompactionState
Tests run: 3, Failures: 0, Errors: 0, Skipped: 0, Time elapsed: 7.236 sec - in org.apache.hadoop.hbase.regionserver.TestCacheOnWriteInSchema
Tests run: 26, Failures: 0, Errors: 0, Skipped: 0, Time elapsed: 38.402 sec - in org.apache.hadoop.hbase.regionserver.TestHRegionReplayEvents
Running org.apache.hadoop.hbase.regionserver.wal.TestReadOldRootAndMetaEdits
Tests run: 1, Failures: 0, Errors: 0, Skipped: 0, Time elapsed: 0.53 sec - in org.apache.hadoop.hbase.regionserver.wal.TestReadOldRootAndMetaEdits
Running org.apache.hadoop.hbase.regionserver.wal.TestFSHLog
Tests run: 6, Failures: 0, Errors: 0, Skipped: 0, Time elapsed: 9.614 sec - in org.apache.hadoop.hbase.regionserver.wal.TestFSHLog
Running org.apache.hadoop.hbase.regionserver.wal.TestWALReplayCompressed
Running org.apache.hadoop.hbase.regionserver.wal.TestLogRollingNoCluster
Running org.apache.hadoop.hbase.regionserver.wal.TestSecureWALReplay
Tests run: 1, Failures: 0, Errors: 0, Skipped: 0, Time elapsed: 12.158 sec - in org.apache.hadoop.hbase.regionserver.wal.TestLogRollingNoCluster
Tests run: 6, Failures: 0, Errors: 0, Skipped: 1, Time elapsed: 172.23 sec - in org.apache.hadoop.hbase.regionserver.TestPerColumnFamilyFlush
Running org.apache.hadoop.hbase.regionserver.wal.TestLogRollAbort
Running org.apache.hadoop.hbase.regionserver.wal.TestWALReplay
Tests run: 12, Failures: 0, Errors: 0, Skipped: 0, Time elapsed: 63.152 sec - in org.apache.hadoop.hbase.regionserver.wal.TestWALReplayCompressed
Running org.apache.hadoop.hbase.regionserver.wal.TestLogRolling
Tests run: 2, Failures: 0, Errors: 0, Skipped: 0, Time elapsed: 49.527 sec - in org.apache.hadoop.hbase.regionserver.wal.TestLogRollAbort
Tests run: 12, Failures: 0, Errors: 0, Skipped: 0, Time elapsed: 72.697 sec - in org.apache.hadoop.hbase.regionserver.wal.TestSecureWALReplay
Running org.apache.hadoop.hbase.regionserver.wal.TestProtobufLog
Running org.apache.hadoop.hbase.regionserver.wal.TestDurability
Tests run: 1, Failures: 0, Errors: 0, Skipped: 0, Time elapsed: 2.453 sec - in org.apache.hadoop.hbase.regionserver.wal.TestProtobufLog
Tests run: 3, Failures: 0, Errors: 0, Skipped: 0, Time elapsed: 4.156 sec - in org.apache.hadoop.hbase.regionserver.wal.TestDurability
Tests run: 12, Failures: 0, Errors: 0, Skipped: 0, Time elapsed: 57.815 sec - in org.apache.hadoop.hbase.regionserver.wal.TestWALReplay
Running org.apache.hadoop.hbase.regionserver.wal.TestLogRollPeriod
Running org.apache.hadoop.hbase.regionserver.TestScannerWithBulkload
Running org.apache.hadoop.hbase.regionserver.TestEncryptionRandomKeying
Tests run: 1, Failures: 0, Errors: 0, Skipped: 0, Time elapsed: 1.822 sec - in org.apache.hadoop.hbase.regionserver.TestEncryptionRandomKeying
Tests run: 3, Failures: 0, Errors: 0, Skipped: 0, Time elapsed: 16.144 sec - in org.apache.hadoop.hbase.regionserver.TestScannerWithBulkload
Running org.apache.hadoop.hbase.regionserver.throttle.TestFlushWithThroughputController
Running org.apache.hadoop.hbase.regionserver.throttle.TestCompactionWithThroughputController
Tests run: 7, Failures: 0, Errors: 0, Skipped: 0, Time elapsed: 256.315 sec - in org.apache.hadoop.hbase.regionserver.TestRegionReplicas
Running org.apache.hadoop.hbase.regionserver.TestDefaultMemStore
Tests run: 2, Failures: 0, Errors: 0, Skipped: 0, Time elapsed: 61.663 sec - in org.apache.hadoop.hbase.regionserver.wal.TestLogRollPeriod
Running org.apache.hadoop.hbase.regionserver.TestMasterAddressTracker
Tests run: 5, Failures: 0, Errors: 0, Skipped: 0, Time elapsed: 1.96 sec - in org.apache.hadoop.hbase.regionserver.TestMasterAddressTracker
Running org.apache.hadoop.hbase.regionserver.TestSplitTransactionOnCluster
Tests run: 23, Failures: 0, Errors: 0, Skipped: 0, Time elapsed: 50.914 sec - in org.apache.hadoop.hbase.regionserver.TestDefaultMemStore
Running org.apache.hadoop.hbase.regionserver.TestParallelPut
Tests run: 2, Failures: 0, Errors: 0, Skipped: 0, Time elapsed: 18.121 sec - in org.apache.hadoop.hbase.regionserver.TestParallelPut
Running org.apache.hadoop.hbase.regionserver.TestColumnSeeking
Tests run: 3, Failures: 0, Errors: 0, Skipped: 0, Time elapsed: 98.25 sec - in org.apache.hadoop.hbase.regionserver.throttle.TestCompactionWithThroughputController
Tests run: 2, Failures: 0, Errors: 0, Skipped: 0, Time elapsed: 26.154 sec - in org.apache.hadoop.hbase.regionserver.TestColumnSeeking
Running org.apache.hadoop.hbase.regionserver.TestRegionServerOnlineConfigChange
Running org.apache.hadoop.hbase.regionserver.TestCorruptedRegionStoreFile
Tests run: 2, Failures: 0, Errors: 0, Skipped: 0, Time elapsed: 3.01 sec - in org.apache.hadoop.hbase.regionserver.TestRegionServerOnlineConfigChange
Running org.apache.hadoop.hbase.regionserver.TestRegionIncrement
Tests run: 3, Failures: 0, Errors: 0, Skipped: 0, Time elapsed: 23.52 sec - in org.apache.hadoop.hbase.regionserver.TestRegionIncrement
Tests run: 3, Failures: 0, Errors: 0, Skipped: 0, Time elapsed: 155.134 sec - in org.apache.hadoop.hbase.regionserver.throttle.TestFlushWithThroughputController
Running org.apache.hadoop.hbase.regionserver.TestCompaction
Running org.apache.hadoop.hbase.regionserver.TestRegionMergeTransactionOnCluster
Tests run: 5, Failures: 0, Errors: 0, Skipped: 0, Time elapsed: 26.706 sec - in org.apache.hadoop.hbase.regionserver.TestCompaction
Tests run: 5, Failures: 0, Errors: 0, Skipped: 0, Time elapsed: 291.86 sec - in org.apache.hadoop.hbase.regionserver.wal.TestLogRolling
Tests run: 15, Failures: 0, Errors: 0, Skipped: 0, Time elapsed: 142.82 sec - in org.apache.hadoop.hbase.regionserver.TestSplitTransactionOnCluster
Running org.apache.hadoop.hbase.regionserver.TestRecoveredEdits
Running org.apache.hadoop.hbase.regionserver.TestGetClosestAtOrBefore
Running org.apache.hadoop.hbase.regionserver.TestRemoveRegionMetrics
Tests run: 3, Failures: 0, Errors: 0, Skipped: 0, Time elapsed: 7.694 sec - in org.apache.hadoop.hbase.regionserver.TestGetClosestAtOrBefore
Running org.apache.hadoop.hbase.regionserver.TestCompoundBloomFilter
Tests run: 1, Failures: 0, Errors: 0, Skipped: 0, Time elapsed: 23.847 sec - in org.apache.hadoop.hbase.regionserver.TestRecoveredEdits
Running org.apache.hadoop.hbase.regionserver.TestRegionServerReportForDuty
Tests run: 5, Failures: 0, Errors: 0, Skipped: 0, Time elapsed: 61.585 sec - in org.apache.hadoop.hbase.regionserver.TestRegionMergeTransactionOnCluster
Tests run: 1, Failures: 0, Errors: 0, Skipped: 0, Time elapsed: 39.354 sec - in org.apache.hadoop.hbase.regionserver.TestRegionServerReportForDuty
Running org.apache.hadoop.hbase.regionserver.TestHRegion
Running org.apache.hadoop.hbase.regionserver.TestMobStoreScanner
Tests run: 2, Failures: 0, Errors: 0, Skipped: 0, Time elapsed: 186.973 sec - in org.apache.hadoop.hbase.regionserver.TestCorruptedRegionStoreFile
Running org.apache.hadoop.hbase.regionserver.compactions.TestCompactedHFilesDischarger
Tests run: 3, Failures: 0, Errors: 0, Skipped: 0, Time elapsed: 6.508 sec - in org.apache.hadoop.hbase.regionserver.compactions.TestCompactedHFilesDischarger
Running org.apache.hadoop.hbase.regionserver.compactions.TestFIFOCompactionPolicy
Tests run: 6, Failures: 0, Errors: 0, Skipped: 0, Time elapsed: 53.753 sec - in org.apache.hadoop.hbase.regionserver.TestMobStoreScanner
Running org.apache.hadoop.hbase.regionserver.TestAtomicOperation
Tests run: 1, Failures: 0, Errors: 0, Skipped: 0, Time elapsed: 163.359 sec - in org.apache.hadoop.hbase.regionserver.TestRemoveRegionMetrics
Tests run: 4, Failures: 0, Errors: 0, Skipped: 0, Time elapsed: 59.124 sec - in org.apache.hadoop.hbase.regionserver.compactions.TestFIFOCompactionPolicy
Running org.apache.hadoop.hbase.regionserver.TestFSErrorsExposed
Running org.apache.hadoop.hbase.regionserver.TestDeleteMobTable
Tests run: 8, Failures: 0, Errors: 0, Skipped: 0, Time elapsed: 75.804 sec - in org.apache.hadoop.hbase.regionserver.TestAtomicOperation
Running org.apache.hadoop.hbase.regionserver.TestRSKilledWhenInitializing
Tests run: 3, Failures: 0, Errors: 0, Skipped: 0, Time elapsed: 27.406 sec - in org.apache.hadoop.hbase.regionserver.TestDeleteMobTable
Tests run: 102, Failures: 0, Errors: 0, Skipped: 0, Time elapsed: 155.651 sec - in org.apache.hadoop.hbase.regionserver.TestHRegion
Running org.apache.hadoop.hbase.regionserver.TestMultiColumnScanner
Running org.apache.hadoop.hbase.regionserver.TestFlushRegionEntry
Tests run: 1, Failures: 0, Errors: 0, Skipped: 0, Time elapsed: 1.084 sec - in org.apache.hadoop.hbase.regionserver.TestFlushRegionEntry
Running org.apache.hadoop.hbase.regionserver.TestStore
Tests run: 1, Failures: 0, Errors: 0, Skipped: 0, Time elapsed: 39.661 sec - in org.apache.hadoop.hbase.regionserver.TestRSKilledWhenInitializing
Tests run: 3, Failures: 0, Errors: 0, Skipped: 0, Time elapsed: 71.741 sec - in org.apache.hadoop.hbase.regionserver.TestFSErrorsExposed
Tests run: 18, Failures: 0, Errors: 0, Skipped: 0, Time elapsed: 21.484 sec - in org.apache.hadoop.hbase.regionserver.TestStore
Running org.apache.hadoop.hbase.TestMetaTableLocator
Tests run: 7, Failures: 0, Errors: 0, Skipped: 0, Time elapsed: 7.014 sec - in org.apache.hadoop.hbase.TestMetaTableLocator
Running org.apache.hadoop.hbase.namespace.TestNamespaceAuditor
Running org.apache.hadoop.hbase.TestStochasticBalancerJmxMetrics
Tests run: 2, Failures: 0, Errors: 0, Skipped: 0, Time elapsed: 2.278 sec - in org.apache.hadoop.hbase.TestStochasticBalancerJmxMetrics
Tests run: 3, Failures: 0, Errors: 0, Skipped: 0, Time elapsed: 306.51 sec - in org.apache.hadoop.hbase.regionserver.TestCompoundBloomFilter
Tests run: 12, Failures: 0, Errors: 0, Skipped: 0, Time elapsed: 91.932 sec - in org.apache.hadoop.hbase.regionserver.TestMultiColumnScanner
Tests run: 12, Failures: 0, Errors: 0, Skipped: 0, Time elapsed: 168.007 sec - in org.apache.hadoop.hbase.namespace.TestNamespaceAuditor

Results :

Failed tests: 
  TestRegionServerMetrics.testRangeCountMetrics:577 expected:<true> but was:<false>

Tests run: 2654, Failures: 1, Errors: 0, Skipped: 63

[INFO] ------------------------------------------------------------------------
[INFO] Reactor Summary:
[INFO] 
[INFO] Apache HBase ...................................... SUCCESS [  4.331 s]
[INFO] Apache HBase - Checkstyle ......................... SUCCESS [  1.157 s]
[INFO] Apache HBase - Resource Bundle .................... SUCCESS [  0.379 s]
[INFO] Apache HBase - Annotations ........................ SUCCESS [  0.372 s]
[INFO] Apache HBase - Protocol ........................... SUCCESS [  4.223 s]
[INFO] Apache HBase - Common ............................. SUCCESS [02:12 min]
[INFO] Apache HBase - Procedure .......................... SUCCESS [02:50 min]
[INFO] Apache HBase - Client ............................. SUCCESS [ 59.013 s]
[INFO] Apache HBase - Hadoop Compatibility ............... SUCCESS [  9.843 s]
[INFO] Apache HBase - Hadoop Two Compatibility ........... SUCCESS [ 13.739 s]
[INFO] Apache HBase - Prefix Tree ........................ SUCCESS [ 16.360 s]
[INFO] Apache HBase - Server ............................. FAILURE [  02:32 h]
[INFO] Apache HBase - Testing Util ....................... SKIPPED
[INFO] Apache HBase - Thrift ............................. SKIPPED
[INFO] Apache HBase - Shell .............................. SKIPPED
[INFO] Apache HBase - Integration Tests .................. SKIPPED
[INFO] Apache HBase - Examples ........................... SKIPPED
[INFO] Apache HBase - Rest ............................... SKIPPED
[INFO] Apache HBase - External Block Cache ............... SKIPPED
[INFO] Apache HBase - Spark .............................. SKIPPED
[INFO] Apache HBase - Assembly ........................... SKIPPED
[INFO] Apache HBase - Shaded ............................. SKIPPED
[INFO] Apache HBase - Shaded - Client .................... SKIPPED
[INFO] Apache HBase - Shaded - Server .................... SKIPPED
[INFO] Apache HBase - Archetypes ......................... SKIPPED
[INFO] Apache HBase - Exemplar for hbase-client archetype  SKIPPED
[INFO] Apache HBase - Archetype builder .................. SKIPPED
[INFO] ------------------------------------------------------------------------
[INFO] BUILD FAILURE
[INFO] ------------------------------------------------------------------------
[INFO] Total time: 02:38 h
[INFO] Finished at: 2016-02-26T00:47:25+00:00
[INFO] Final Memory: 68M/656M
[INFO] ------------------------------------------------------------------------
[ERROR] Failed to execute goal org.apache.maven.plugins:maven-surefire-plugin:2.18.1:test
(secondPartTestsExecution) on project hbase-server: There are test failures.
[ERROR] 
[ERROR] Please refer to <https://builds.apache.org/job/HBase-Trunk_matrix/jdk=latest1.7,label=yahoo-not-h2/ws/hbase-server/target/surefire-reports>
for the individual test results.
[ERROR] -> [Help 1]
[ERROR] 
[ERROR] To see the full stack trace of the errors, re-run Maven with the -e switch.
[ERROR] Re-run Maven using the -X switch to enable full debug logging.
[ERROR] 
[ERROR] For more information about the errors and possible solutions, please read the following
articles:
[ERROR] [Help 1] http://cwiki.apache.org/confluence/display/MAVEN/MojoFailureException
[ERROR] 
[ERROR] After correcting the problems, you can resume the build with the command
[ERROR]   mvn <goals> -rf :hbase-server
Build step 'Invoke top-level Maven targets' marked build as failure
Performing Post build task...
Match found for :.* : True
Logical operation result is TRUE
Running script  : # Run zombie detector script
./dev-support/zombie-detector.sh --jenkins ${BUILD_ID}
[yahoo-not-h2] $ /bin/bash -xe /tmp/hudson7962165209613703331.sh
+ ./dev-support/zombie-detector.sh --jenkins 738
Fri Feb 26 00:47:27 UTC 2016 We're ok: there is no zombie test


    {color:green}+1 zombies{color}. No zombie tests found running at the end of the build.
POST BUILD TASK : SUCCESS
END OF POST BUILD TASK : 0
Archiving artifacts
Recording test results
[FINDBUGS] Skipping publisher since build result is FAILURE
[CHECKSTYLE] Skipping publisher since build result is FAILURE

Mime
View raw message