hbase-builds mailing list archives

Site index · List index
Message view « Date » · « Thread »
Top « Date » · « Thread »
From Apache Jenkins Server <jenk...@builds.apache.org>
Subject Build failed in Jenkins: HBase-Trunk_matrix » latest1.7,yahoo-not-h2 #673
Date Mon, 01 Feb 2016 19:16:47 GMT
See <https://builds.apache.org/job/HBase-Trunk_matrix/jdk=latest1.7,label=yahoo-not-h2/673/changes>

Changes:

[stack] HBASE-14969 Add throughput controller for flush; ADDENDUM

------------------------------------------
[...truncated 4774 lines...]
Tests run: 1, Failures: 0, Errors: 0, Skipped: 0, Time elapsed: 2.579 sec - in org.apache.hadoop.hbase.filter.TestFuzzyRowAndColumnRangeFilter
Running org.apache.hadoop.hbase.filter.TestFilterWrapper
Tests run: 1, Failures: 0, Errors: 0, Skipped: 0, Time elapsed: 3.835 sec - in org.apache.hadoop.hbase.filter.TestFilterWrapper
Running org.apache.hadoop.hbase.filter.TestMultiRowRangeFilter
Tests run: 5, Failures: 0, Errors: 0, Skipped: 0, Time elapsed: 22.639 sec - in org.apache.hadoop.hbase.constraint.TestConstraint
Running org.apache.hadoop.hbase.filter.TestColumnRangeFilter
Tests run: 8, Failures: 0, Errors: 0, Skipped: 0, Time elapsed: 37.407 sec - in org.apache.hadoop.hbase.TestNamespace
Running org.apache.hadoop.hbase.filter.TestScanRowPrefix
Tests run: 20, Failures: 0, Errors: 0, Skipped: 0, Time elapsed: 18.892 sec - in org.apache.hadoop.hbase.filter.TestMultiRowRangeFilter
Tests run: 1, Failures: 0, Errors: 0, Skipped: 0, Time elapsed: 9.773 sec - in org.apache.hadoop.hbase.filter.TestColumnRangeFilter
Tests run: 1, Failures: 0, Errors: 0, Skipped: 0, Time elapsed: 8.293 sec - in org.apache.hadoop.hbase.filter.TestScanRowPrefix
Running org.apache.hadoop.hbase.TestHBaseTestingUtility
Running org.apache.hadoop.hbase.filter.TestFuzzyRowFilterEndToEnd
Running org.apache.hadoop.hbase.filter.TestFilterWithScanLimits
Running org.apache.hadoop.hbase.quotas.TestQuotaThrottle
Tests run: 44, Failures: 0, Errors: 0, Skipped: 0, Time elapsed: 88.402 sec - in org.apache.hadoop.hbase.security.visibility.TestVisibilityLabelsWithDeletes
Running org.apache.hadoop.hbase.quotas.TestQuotaAdmin
Tests run: 3, Failures: 0, Errors: 0, Skipped: 0, Time elapsed: 2.704 sec - in org.apache.hadoop.hbase.quotas.TestQuotaAdmin
Tests run: 12, Failures: 0, Errors: 0, Skipped: 0, Time elapsed: 23.895 sec - in org.apache.hadoop.hbase.quotas.TestQuotaThrottle
Running org.apache.hadoop.hbase.quotas.TestQuotaTableUtil
Tests run: 3, Failures: 0, Errors: 0, Skipped: 0, Time elapsed: 1.317 sec - in org.apache.hadoop.hbase.quotas.TestQuotaTableUtil
Tests run: 12, Failures: 0, Errors: 0, Skipped: 0, Time elapsed: 53.229 sec - in org.apache.hadoop.hbase.TestHBaseTestingUtility
Running org.apache.hadoop.hbase.mob.mapreduce.TestMobSweepJob
Running org.apache.hadoop.hbase.mob.mapreduce.TestMobSweepReducer
Tests run: 3, Failures: 0, Errors: 0, Skipped: 0, Time elapsed: 2.463 sec - in org.apache.hadoop.hbase.mob.mapreduce.TestMobSweepJob
Tests run: 1, Failures: 0, Errors: 0, Skipped: 0, Time elapsed: 51.364 sec - in org.apache.hadoop.hbase.filter.TestFilterWithScanLimits
Tests run: 1, Failures: 0, Errors: 0, Skipped: 0, Time elapsed: 6.027 sec - in org.apache.hadoop.hbase.mob.mapreduce.TestMobSweepReducer
Running org.apache.hadoop.hbase.mob.TestMobDataBlockEncoding
Running org.apache.hadoop.hbase.mob.compactions.TestMobCompactor
Tests run: 1, Failures: 0, Errors: 0, Skipped: 0, Time elapsed: 9.945 sec - in org.apache.hadoop.hbase.mob.TestMobDataBlockEncoding
Running org.apache.hadoop.hbase.mob.compactions.TestPartitionedMobCompactor
Running org.apache.hadoop.hbase.mob.TestDefaultMobStoreFlusher
Running org.apache.hadoop.hbase.mob.TestExpiredMobFileCleaner
Tests run: 2, Failures: 0, Errors: 0, Skipped: 0, Time elapsed: 4.647 sec - in org.apache.hadoop.hbase.mob.TestDefaultMobStoreFlusher
Tests run: 6, Failures: 0, Errors: 0, Skipped: 0, Time elapsed: 8.632 sec - in org.apache.hadoop.hbase.mob.compactions.TestPartitionedMobCompactor
Running org.apache.hadoop.hbase.io.encoding.TestDataBlockEncoders
Running org.apache.hadoop.hbase.io.encoding.TestChangingEncoding
Tests run: 1, Failures: 0, Errors: 0, Skipped: 0, Time elapsed: 17.046 sec - in org.apache.hadoop.hbase.mob.TestExpiredMobFileCleaner
Running org.apache.hadoop.hbase.io.encoding.TestEncodedSeekers
Tests run: 5, Failures: 0, Errors: 0, Skipped: 0, Time elapsed: 61.711 sec - in org.apache.hadoop.hbase.mob.compactions.TestMobCompactor
Running org.apache.hadoop.hbase.io.encoding.TestBufferedDataBlockEncoder
Tests run: 2, Failures: 0, Errors: 0, Skipped: 0, Time elapsed: 16.784 sec - in org.apache.hadoop.hbase.io.encoding.TestBufferedDataBlockEncoder
Running org.apache.hadoop.hbase.io.encoding.TestLoadAndSwitchEncodeOnDisk
Tests run: 1, Failures: 0, Errors: 0, Skipped: 0, Time elapsed: 31.629 sec - in org.apache.hadoop.hbase.io.encoding.TestLoadAndSwitchEncodeOnDisk
Tests run: 56, Failures: 0, Errors: 0, Skipped: 0, Time elapsed: 105.534 sec - in org.apache.hadoop.hbase.io.encoding.TestDataBlockEncoders
Running org.apache.hadoop.hbase.io.hfile.TestScannerSelectionUsingTTL
Running org.apache.hadoop.hbase.io.hfile.TestHFileBlock
Tests run: 3, Failures: 0, Errors: 0, Skipped: 0, Time elapsed: 155.003 sec - in org.apache.hadoop.hbase.io.encoding.TestChangingEncoding
Running org.apache.hadoop.hbase.io.hfile.TestCacheOnWrite
Tests run: 20, Failures: 0, Errors: 0, Skipped: 0, Time elapsed: 154.827 sec - in org.apache.hadoop.hbase.io.encoding.TestEncodedSeekers
Tests run: 6, Failures: 0, Errors: 0, Skipped: 0, Time elapsed: 63.76 sec - in org.apache.hadoop.hbase.io.hfile.TestScannerSelectionUsingTTL
Running org.apache.hadoop.hbase.io.hfile.TestHFileBlockIndex
Running org.apache.hadoop.hbase.io.hfile.TestHFileSeek
Tests run: 1, Failures: 0, Errors: 0, Skipped: 0, Time elapsed: 3.003 sec - in org.apache.hadoop.hbase.io.hfile.TestHFileSeek
Running org.apache.hadoop.hbase.io.hfile.TestSeekBeforeWithInlineBlocks
Tests run: 3, Failures: 0, Errors: 0, Skipped: 0, Time elapsed: 267.602 sec - in org.apache.hadoop.hbase.filter.TestFuzzyRowFilterEndToEnd
Tests run: 10, Failures: 0, Errors: 0, Skipped: 0, Time elapsed: 13.639 sec - in org.apache.hadoop.hbase.io.hfile.TestHFileBlockIndex
Running org.apache.hadoop.hbase.io.hfile.TestScannerFromBucketCache
Running org.apache.hadoop.hbase.io.hfile.TestCacheConfig
Tests run: 6, Failures: 0, Errors: 0, Skipped: 0, Time elapsed: 2.658 sec - in org.apache.hadoop.hbase.io.hfile.TestCacheConfig
Tests run: 4, Failures: 0, Errors: 0, Skipped: 0, Time elapsed: 5.829 sec - in org.apache.hadoop.hbase.io.hfile.TestScannerFromBucketCache
Running org.apache.hadoop.hbase.io.hfile.TestForceCacheImportantBlocks
Running org.apache.hadoop.hbase.io.TestFileLink
Tests run: 1, Failures: 0, Errors: 0, Skipped: 0, Time elapsed: 16.688 sec - in org.apache.hadoop.hbase.io.hfile.TestSeekBeforeWithInlineBlocks
Tests run: 28, Failures: 0, Errors: 0, Skipped: 0, Time elapsed: 91.772 sec - in org.apache.hadoop.hbase.io.hfile.TestHFileBlock
Running org.apache.hadoop.hbase.procedure.TestZKProcedure
Tests run: 4, Failures: 0, Errors: 0, Skipped: 0, Time elapsed: 2.332 sec - in org.apache.hadoop.hbase.procedure.TestZKProcedure
Running org.apache.hadoop.hbase.TestHBaseOnOtherDfsCluster
Running org.apache.hadoop.hbase.procedure.TestZKProcedureControllers
Tests run: 4, Failures: 0, Errors: 0, Skipped: 0, Time elapsed: 2.003 sec - in org.apache.hadoop.hbase.procedure.TestZKProcedureControllers
Tests run: 5, Failures: 0, Errors: 0, Skipped: 0, Time elapsed: 15.017 sec - in org.apache.hadoop.hbase.io.TestFileLink
Running org.apache.hadoop.hbase.ipc.TestHBaseClient
Tests run: 1, Failures: 0, Errors: 0, Skipped: 0, Time elapsed: 0.485 sec - in org.apache.hadoop.hbase.ipc.TestHBaseClient
Running org.apache.hadoop.hbase.ipc.TestProtoBufRpc
Tests run: 2, Failures: 0, Errors: 0, Skipped: 0, Time elapsed: 21.821 sec - in org.apache.hadoop.hbase.io.hfile.TestForceCacheImportantBlocks
Tests run: 1, Failures: 0, Errors: 0, Skipped: 0, Time elapsed: 2.537 sec - in org.apache.hadoop.hbase.ipc.TestProtoBufRpc
Running org.apache.hadoop.hbase.TestLocalHBaseCluster
Running org.apache.hadoop.hbase.TestAcidGuarantees
Tests run: 1, Failures: 0, Errors: 0, Skipped: 0, Time elapsed: 15.681 sec - in org.apache.hadoop.hbase.TestHBaseOnOtherDfsCluster
Running org.apache.hadoop.hbase.ipc.TestRpcClientLeaks
Tests run: 1, Failures: 0, Errors: 0, Skipped: 0, Time elapsed: 11.028 sec - in org.apache.hadoop.hbase.TestLocalHBaseCluster
Running org.apache.hadoop.hbase.TestServerSideScanMetricsFromClientSide
Tests run: 2, Failures: 0, Errors: 0, Skipped: 0, Time elapsed: 3.483 sec - in org.apache.hadoop.hbase.TestServerSideScanMetricsFromClientSide
Running org.apache.hadoop.hbase.zookeeper.TestRecoverableZooKeeper
Tests run: 1, Failures: 0, Errors: 0, Skipped: 0, Time elapsed: 1.174 sec - in org.apache.hadoop.hbase.zookeeper.TestRecoverableZooKeeper
Running org.apache.hadoop.hbase.zookeeper.TestZooKeeperACL
Tests run: 7, Failures: 0, Errors: 0, Skipped: 0, Time elapsed: 0.424 sec - in org.apache.hadoop.hbase.zookeeper.TestZooKeeperACL
Running org.apache.hadoop.hbase.zookeeper.TestZooKeeperNodeTracker
Tests run: 3, Failures: 0, Errors: 0, Skipped: 0, Time elapsed: 1.152 sec - in org.apache.hadoop.hbase.zookeeper.TestZooKeeperNodeTracker
Running org.apache.hadoop.hbase.zookeeper.TestHQuorumPeer
Running org.apache.hadoop.hbase.zookeeper.TestZKLeaderManager
Tests run: 3, Failures: 0, Errors: 0, Skipped: 0, Time elapsed: 1.026 sec - in org.apache.hadoop.hbase.zookeeper.TestHQuorumPeer
Tests run: 1, Failures: 0, Errors: 0, Skipped: 0, Time elapsed: 0.116 sec - in org.apache.hadoop.hbase.zookeeper.TestZKLeaderManager
Tests run: 1, Failures: 0, Errors: 0, Skipped: 0, Time elapsed: 26.668 sec - in org.apache.hadoop.hbase.ipc.TestRpcClientLeaks
Running org.apache.hadoop.hbase.zookeeper.TestZKMulti
Running org.apache.hadoop.hbase.zookeeper.lock.TestZKInterProcessReadWriteLock
Tests run: 12, Failures: 0, Errors: 0, Skipped: 0, Time elapsed: 1.744 sec - in org.apache.hadoop.hbase.zookeeper.TestZKMulti
Running org.apache.hadoop.hbase.TestMetaTableAccessorNoCluster
Tests run: 2, Failures: 0, Errors: 0, Skipped: 0, Time elapsed: 3.597 sec - in org.apache.hadoop.hbase.TestMetaTableAccessorNoCluster
Running org.apache.hadoop.hbase.TestZooKeeper
Running org.apache.hadoop.hbase.TestJMXListener
Tests run: 6, Failures: 0, Errors: 0, Skipped: 0, Time elapsed: 24.518 sec - in org.apache.hadoop.hbase.zookeeper.lock.TestZKInterProcessReadWriteLock
Tests run: 2, Failures: 0, Errors: 0, Skipped: 0, Time elapsed: 16.597 sec - in org.apache.hadoop.hbase.TestJMXListener
Running org.apache.hadoop.hbase.replication.regionserver.TestReplicationWALReaderManager
Running org.apache.hadoop.hbase.replication.regionserver.TestRegionReplicaReplicationEndpoint
Tests run: 72, Failures: 0, Errors: 0, Skipped: 0, Time elapsed: 174.596 sec - in org.apache.hadoop.hbase.io.hfile.TestCacheOnWrite
Running org.apache.hadoop.hbase.replication.regionserver.TestRegionReplicaReplicationEndpointNoMaster
Tests run: 4, Failures: 0, Errors: 0, Skipped: 0, Time elapsed: 44.243 sec - in org.apache.hadoop.hbase.replication.regionserver.TestRegionReplicaReplicationEndpointNoMaster
Tests run: 9, Failures: 0, Errors: 0, Skipped: 0, Time elapsed: 110.011 sec - in org.apache.hadoop.hbase.replication.regionserver.TestRegionReplicaReplicationEndpoint
Running org.apache.hadoop.hbase.replication.regionserver.TestReplicationSourceManager
Tests run: 7, Failures: 0, Errors: 0, Skipped: 0, Time elapsed: 3.911 sec - in org.apache.hadoop.hbase.replication.regionserver.TestReplicationSourceManager
Running org.apache.hadoop.hbase.replication.regionserver.TestReplicationSink
Tests run: 6, Failures: 0, Errors: 0, Skipped: 0, Time elapsed: 5.204 sec - in org.apache.hadoop.hbase.replication.regionserver.TestReplicationSink
Tests run: 6, Failures: 0, Errors: 0, Skipped: 0, Time elapsed: 205.832 sec - in org.apache.hadoop.hbase.TestAcidGuarantees
Running org.apache.hadoop.hbase.replication.TestReplicationTrackerZKImpl
Tests run: 5, Failures: 0, Errors: 0, Skipped: 0, Time elapsed: 1.223 sec - in org.apache.hadoop.hbase.replication.TestReplicationTrackerZKImpl
Running org.apache.hadoop.hbase.replication.TestReplicationSyncUpToolWithBulkLoadedData
Running org.apache.hadoop.hbase.replication.TestReplicationKillMasterRSCompressed
Running org.apache.hadoop.hbase.replication.TestReplicationKillMasterRS
Tests run: 1, Failures: 0, Errors: 0, Skipped: 0, Time elapsed: 19.611 sec - in org.apache.hadoop.hbase.replication.TestReplicationKillMasterRSCompressed
Running org.apache.hadoop.hbase.replication.TestMultiSlaveReplication
Tests run: 1, Failures: 0, Errors: 0, Skipped: 0, Time elapsed: 21.313 sec - in org.apache.hadoop.hbase.replication.TestReplicationKillMasterRS
Tests run: 1, Failures: 0, Errors: 0, Skipped: 0, Time elapsed: 38.083 sec - in org.apache.hadoop.hbase.replication.TestReplicationSyncUpToolWithBulkLoadedData
Tests run: 10, Failures: 0, Errors: 0, Skipped: 0, Time elapsed: 225.347 sec - in org.apache.hadoop.hbase.TestZooKeeper
Running org.apache.hadoop.hbase.replication.TestReplicationChangingPeerRegionservers
Running org.apache.hadoop.hbase.replication.TestReplicationKillSlaveRS
Tests run: 1, Failures: 0, Errors: 0, Skipped: 0, Time elapsed: 5.617 sec - in org.apache.hadoop.hbase.replication.TestReplicationChangingPeerRegionservers
Tests run: 1, Failures: 0, Errors: 0, Skipped: 0, Time elapsed: 28.938 sec - in org.apache.hadoop.hbase.replication.TestMultiSlaveReplication
Running org.apache.hadoop.hbase.replication.multiwal.TestReplicationKillMasterRSCompressedWithMultipleWAL
Tests run: 1, Failures: 0, Errors: 0, Skipped: 0, Time elapsed: 17.093 sec - in org.apache.hadoop.hbase.replication.TestReplicationKillSlaveRS
Tests run: 8, Failures: 0, Errors: 0, Skipped: 0, Time elapsed: 238.705 sec - in org.apache.hadoop.hbase.replication.regionserver.TestReplicationWALReaderManager
Running org.apache.hadoop.hbase.replication.multiwal.TestReplicationSyncUpToolWithMultipleWAL
Running org.apache.hadoop.hbase.replication.multiwal.TestReplicationEndpointWithMultipleWAL
Tests run: 1, Failures: 0, Errors: 0, Skipped: 0, Time elapsed: 24.171 sec - in org.apache.hadoop.hbase.replication.multiwal.TestReplicationKillMasterRSCompressedWithMultipleWAL
Running org.apache.hadoop.hbase.replication.TestPerTableCFReplication
Running org.apache.hadoop.hbase.replication.TestMasterReplication
Tests run: 4, Failures: 0, Errors: 0, Skipped: 0, Time elapsed: 10.87 sec - in org.apache.hadoop.hbase.replication.multiwal.TestReplicationEndpointWithMultipleWAL
Running org.apache.hadoop.hbase.replication.TestReplicationDisableInactivePeer
Running org.apache.hadoop.hbase.replication.TestReplicationWithTags
Tests run: 1, Failures: 0, Errors: 0, Skipped: 0, Time elapsed: 2.617 sec - in org.apache.hadoop.hbase.replication.TestReplicationWithTags
Tests run: 1, Failures: 0, Errors: 0, Skipped: 0, Time elapsed: 20.256 sec - in org.apache.hadoop.hbase.replication.TestReplicationDisableInactivePeer
Tests run: 2, Failures: 0, Errors: 0, Skipped: 0, Time elapsed: 37.452 sec - in org.apache.hadoop.hbase.replication.TestPerTableCFReplication
Tests run: 1, Failures: 0, Errors: 0, Skipped: 0, Time elapsed: 57.046 sec - in org.apache.hadoop.hbase.replication.multiwal.TestReplicationSyncUpToolWithMultipleWAL
Running org.apache.hadoop.hbase.replication.TestReplicationSource
Tests run: 1, Failures: 0, Errors: 0, Skipped: 0, Time elapsed: 0.212 sec - in org.apache.hadoop.hbase.replication.TestReplicationSource
Running org.apache.hadoop.hbase.replication.TestReplicationEndpoint
Running org.apache.hadoop.hbase.replication.TestReplicationStateZKImpl
Tests run: 8, Failures: 0, Errors: 0, Skipped: 0, Time elapsed: 1.42 sec - in org.apache.hadoop.hbase.replication.TestReplicationStateZKImpl
Running org.apache.hadoop.hbase.replication.TestReplicationSmallTests
Running org.apache.hadoop.hbase.fs.TestBlockReorder
Tests run: 4, Failures: 0, Errors: 0, Skipped: 0, Time elapsed: 9.3 sec - in org.apache.hadoop.hbase.replication.TestReplicationEndpoint
Running org.apache.hadoop.hbase.replication.TestReplicationSyncUpTool
Running org.apache.hadoop.hbase.trace.TestHTraceHooks
Tests run: 1, Failures: 0, Errors: 0, Skipped: 0, Time elapsed: 2.88 sec - in org.apache.hadoop.hbase.trace.TestHTraceHooks
Running org.apache.hadoop.hbase.TestMovedRegionsCleaner
Tests run: 3, Failures: 0, Errors: 0, Skipped: 0, Time elapsed: 23.645 sec - in org.apache.hadoop.hbase.fs.TestBlockReorder
Tests run: 1, Failures: 0, Errors: 0, Skipped: 0, Time elapsed: 11.104 sec - in org.apache.hadoop.hbase.TestMovedRegionsCleaner
Running org.apache.hadoop.hbase.TestMetaTableLocator
Tests run: 7, Failures: 0, Errors: 0, Skipped: 0, Time elapsed: 3.66 sec - in org.apache.hadoop.hbase.TestMetaTableLocator
Running org.apache.hadoop.hbase.namespace.TestNamespaceAuditor
Running org.apache.hadoop.hbase.mapred.TestTableMapReduceUtil
Tests run: 12, Failures: 0, Errors: 0, Skipped: 0, Time elapsed: 66.504 sec - in org.apache.hadoop.hbase.replication.TestReplicationSmallTests
Tests run: 1, Failures: 0, Errors: 0, Skipped: 0, Time elapsed: 53.26 sec - in org.apache.hadoop.hbase.replication.TestReplicationSyncUpTool
Tests run: 4, Failures: 0, Errors: 0, Skipped: 0, Time elapsed: 14.443 sec - in org.apache.hadoop.hbase.mapred.TestTableMapReduceUtil
Running org.apache.hadoop.hbase.mapred.TestTableSnapshotInputFormat
Running org.apache.hadoop.hbase.mapred.TestTableInputFormat
Running org.apache.hadoop.hbase.mapred.TestMultiTableSnapshotInputFormat
Tests run: 8, Failures: 0, Errors: 0, Skipped: 0, Time elapsed: 17.761 sec - in org.apache.hadoop.hbase.mapred.TestTableInputFormat
Tests run: 7, Failures: 0, Errors: 0, Skipped: 0, Time elapsed: 149.364 sec - in org.apache.hadoop.hbase.replication.TestMasterReplication
Running org.apache.hadoop.hbase.TestMultiVersions
Running org.apache.hadoop.hbase.mapred.TestTableMapReduce
Tests run: 3, Failures: 0, Errors: 0, Skipped: 0, Time elapsed: 8.806 sec - in org.apache.hadoop.hbase.TestMultiVersions
Tests run: 4, Failures: 0, Errors: 0, Skipped: 0, Time elapsed: 41.984 sec - in org.apache.hadoop.hbase.mapred.TestMultiTableSnapshotInputFormat
Tests run: 2, Failures: 0, Errors: 0, Skipped: 0, Time elapsed: 18.955 sec - in org.apache.hadoop.hbase.mapred.TestTableMapReduce
Tests run: 12, Failures: 0, Errors: 0, Skipped: 0, Time elapsed: 120.448 sec - in org.apache.hadoop.hbase.namespace.TestNamespaceAuditor
Tests run: 7, Failures: 0, Errors: 0, Skipped: 0, Time elapsed: 112.393 sec - in org.apache.hadoop.hbase.mapred.TestTableSnapshotInputFormat

Results :

Failed tests: 
  TestRegionMergeTransactionOnCluster.testCleanMergeReference:284 null

Tests run: 2500, Failures: 1, Errors: 0, Skipped: 36

[INFO] ------------------------------------------------------------------------
[INFO] Reactor Summary:
[INFO] 
[INFO] Apache HBase ...................................... SUCCESS [  2.697 s]
[INFO] Apache HBase - Checkstyle ......................... SUCCESS [  0.785 s]
[INFO] Apache HBase - Resource Bundle .................... SUCCESS [  0.250 s]
[INFO] Apache HBase - Annotations ........................ SUCCESS [  0.214 s]
[INFO] Apache HBase - Protocol ........................... SUCCESS [  2.892 s]
[INFO] Apache HBase - Common ............................. SUCCESS [01:31 min]
[INFO] Apache HBase - Procedure .......................... SUCCESS [02:21 min]
[INFO] Apache HBase - Client ............................. SUCCESS [ 36.385 s]
[INFO] Apache HBase - Hadoop Compatibility ............... SUCCESS [  7.467 s]
[INFO] Apache HBase - Hadoop Two Compatibility ........... SUCCESS [  8.099 s]
[INFO] Apache HBase - Prefix Tree ........................ SUCCESS [ 10.565 s]
[INFO] Apache HBase - Server ............................. FAILURE [  01:20 h]
[INFO] Apache HBase - Testing Util ....................... SKIPPED
[INFO] Apache HBase - Thrift ............................. SKIPPED
[INFO] Apache HBase - Shell .............................. SKIPPED
[INFO] Apache HBase - Integration Tests .................. SKIPPED
[INFO] Apache HBase - Examples ........................... SKIPPED
[INFO] Apache HBase - Rest ............................... SKIPPED
[INFO] Apache HBase - External Block Cache ............... SKIPPED
[INFO] Apache HBase - Assembly ........................... SKIPPED
[INFO] Apache HBase - Shaded ............................. SKIPPED
[INFO] Apache HBase - Shaded - Client .................... SKIPPED
[INFO] Apache HBase - Shaded - Server .................... SKIPPED
[INFO] Apache HBase - Spark .............................. SKIPPED
[INFO] ------------------------------------------------------------------------
[INFO] BUILD FAILURE
[INFO] ------------------------------------------------------------------------
[INFO] Total time: 01:25 h
[INFO] Finished at: 2016-02-01T19:13:33+00:00
[INFO] Final Memory: 65M/590M
[INFO] ------------------------------------------------------------------------
[ERROR] Failed to execute goal org.apache.maven.plugins:maven-surefire-plugin:2.18.1:test
(secondPartTestsExecution) on project hbase-server: There are test failures.
[ERROR] 
[ERROR] Please refer to <https://builds.apache.org/job/HBase-Trunk_matrix/jdk=latest1.7,label=yahoo-not-h2/ws/hbase-server/target/surefire-reports>
for the individual test results.
[ERROR] -> [Help 1]
[ERROR] 
[ERROR] To see the full stack trace of the errors, re-run Maven with the -e switch.
[ERROR] Re-run Maven using the -X switch to enable full debug logging.
[ERROR] 
[ERROR] For more information about the errors and possible solutions, please read the following
articles:
[ERROR] [Help 1] http://cwiki.apache.org/confluence/display/MAVEN/MojoFailureException
[ERROR] 
[ERROR] After correcting the problems, you can resume the build with the command
[ERROR]   mvn <goals> -rf :hbase-server
Build step 'Invoke top-level Maven targets' marked build as failure
Performing Post build task...
Match found for :.* : True
Logical operation result is TRUE
Running script  : # Run zombie detector script
./dev-support/zombie-detector.sh --jenkins ${BUILD_ID}
[yahoo-not-h2] $ /bin/bash -xe /tmp/hudson5908577754841334100.sh
+ ./dev-support/zombie-detector.sh --jenkins 673
Mon Feb  1 19:13:34 UTC 2016 We're ok: there is no zombie test


    {color:green}+1 zombies{color}. No zombie tests found running at the end of the build.
POST BUILD TASK : SUCCESS
END OF POST BUILD TASK : 0
Archiving artifacts
Recording test results
[FINDBUGS] Skipping publisher since build result is FAILURE
[CHECKSTYLE] Skipping publisher since build result is FAILURE

Mime
View raw message