hbase-builds mailing list archives

Site index · List index
Message view « Date » · « Thread »
Top « Date » · « Thread »
From Apache Jenkins Server <jenk...@builds.apache.org>
Subject Build failed in Jenkins: HBase-1.3 » latest1.7,yahoo-not-h2 #539
Date Fri, 05 Feb 2016 17:57:10 GMT
See <https://builds.apache.org/job/HBase-1.3/jdk=latest1.7,label=yahoo-not-h2/539/changes>

Changes:

[tedyu] HBASE-11262 Avoid empty columns while doing bulk-load (Ashish Kumar)

------------------------------------------
[...truncated 42900 lines...]
96/281 KB   20/20 KB   192/246 KB   25/25 KB   5/5 KB   
96/281 KB   20/20 KB   196/246 KB   25/25 KB   5/5 KB   
100/281 KB   20/20 KB   196/246 KB   25/25 KB   5/5 KB   
100/281 KB   20/20 KB   200/246 KB   25/25 KB   5/5 KB   
104/281 KB   20/20 KB   200/246 KB   25/25 KB   5/5 KB   
104/281 KB   20/20 KB   204/246 KB   25/25 KB   5/5 KB   
108/281 KB   20/20 KB   204/246 KB   25/25 KB   5/5 KB   
108/281 KB   20/20 KB   208/246 KB   25/25 KB   5/5 KB   
112/281 KB   20/20 KB   208/246 KB   25/25 KB   5/5 KB   
112/281 KB   20/20 KB   212/246 KB   25/25 KB   5/5 KB   
116/281 KB   20/20 KB   212/246 KB   25/25 KB   5/5 KB   
116/281 KB   20/20 KB   216/246 KB   25/25 KB   5/5 KB   
120/281 KB   20/20 KB   216/246 KB   25/25 KB   5/5 KB   
120/281 KB   20/20 KB   220/246 KB   25/25 KB   5/5 KB   
124/281 KB   20/20 KB   220/246 KB   25/25 KB   5/5 KB   
124/281 KB   20/20 KB   224/246 KB   25/25 KB   5/5 KB   
128/281 KB   20/20 KB   224/246 KB   25/25 KB   5/5 KB   
128/281 KB   20/20 KB   228/246 KB   25/25 KB   5/5 KB   
132/281 KB   20/20 KB   228/246 KB   25/25 KB   5/5 KB   
132/281 KB   20/20 KB   232/246 KB   25/25 KB   5/5 KB   
136/281 KB   20/20 KB   232/246 KB   25/25 KB   5/5 KB   
136/281 KB   20/20 KB   236/246 KB   25/25 KB   5/5 KB   
140/281 KB   20/20 KB   236/246 KB   25/25 KB   5/5 KB   
140/281 KB   20/20 KB   240/246 KB   25/25 KB   5/5 KB   
144/281 KB   20/20 KB   240/246 KB   25/25 KB   5/5 KB   
144/281 KB   20/20 KB   244/246 KB   25/25 KB   5/5 KB   
148/281 KB   20/20 KB   244/246 KB   25/25 KB   5/5 KB   
148/281 KB   20/20 KB   246/246 KB   25/25 KB   5/5 KB   
152/281 KB   20/20 KB   246/246 KB   25/25 KB   5/5 KB   
156/281 KB   20/20 KB   246/246 KB   25/25 KB   5/5 KB   
160/281 KB   20/20 KB   246/246 KB   25/25 KB   5/5 KB   
164/281 KB   20/20 KB   246/246 KB   25/25 KB   5/5 KB   
168/281 KB   20/20 KB   246/246 KB   25/25 KB   5/5 KB   
172/281 KB   20/20 KB   246/246 KB   25/25 KB   5/5 KB   
176/281 KB   20/20 KB   246/246 KB   25/25 KB   5/5 KB   
180/281 KB   20/20 KB   246/246 KB   25/25 KB   5/5 KB   
184/281 KB   20/20 KB   246/246 KB   25/25 KB   5/5 KB   
188/281 KB   20/20 KB   246/246 KB   25/25 KB   5/5 KB   
192/281 KB   20/20 KB   246/246 KB   25/25 KB   5/5 KB   
196/281 KB   20/20 KB   246/246 KB   25/25 KB   5/5 KB   
200/281 KB   20/20 KB   246/246 KB   25/25 KB   5/5 KB   
204/281 KB   20/20 KB   246/246 KB   25/25 KB   5/5 KB   
208/281 KB   20/20 KB   246/246 KB   25/25 KB   5/5 KB   
212/281 KB   20/20 KB   246/246 KB   25/25 KB   5/5 KB   
216/281 KB   20/20 KB   246/246 KB   25/25 KB   5/5 KB   
220/281 KB   20/20 KB   246/246 KB   25/25 KB   5/5 KB   
224/281 KB   20/20 KB   246/246 KB   25/25 KB   5/5 KB   
228/281 KB   20/20 KB   246/246 KB   25/25 KB   5/5 KB   
232/281 KB   20/20 KB   246/246 KB   25/25 KB   5/5 KB   
236/281 KB   20/20 KB   246/246 KB   25/25 KB   5/5 KB   
240/281 KB   20/20 KB   246/246 KB   25/25 KB   5/5 KB   
244/281 KB   20/20 KB   246/246 KB   25/25 KB   5/5 KB   
246/281 KB   20/20 KB   246/246 KB   25/25 KB   5/5 KB   
249/281 KB   20/20 KB   246/246 KB   25/25 KB   5/5 KB   
253/281 KB   20/20 KB   246/246 KB   25/25 KB   5/5 KB   
257/281 KB   20/20 KB   246/246 KB   25/25 KB   5/5 KB   
261/281 KB   20/20 KB   246/246 KB   25/25 KB   5/5 KB   
265/281 KB   20/20 KB   246/246 KB   25/25 KB   5/5 KB   
269/281 KB   20/20 KB   246/246 KB   25/25 KB   5/5 KB   
273/281 KB   20/20 KB   246/246 KB   25/25 KB   5/5 KB   
                                                         
277/281 KB   20/20 KB   246/246 KB   25/25 KB            
Downloaded: http://repo.maven.apache.org/maven2/org/jamon/jamon-api/2.3.0/jamon-api-2.3.0.jar
(5 KB at 65.1 KB/sec)
281/281 KB   20/20 KB   246/246 KB   25/25 KB   
281/281 KB   20/20 KB   246/246 KB   25/25 KB   
                                                
Downloaded: http://repo.maven.apache.org/maven2/org/jamon/jamon-runtime/2.4.0/jamon-runtime-2.4.0.jar
(25 KB at 347.3 KB/sec)
                                                
Downloaded: http://repo.maven.apache.org/maven2/org/codehaus/plexus/plexus-compiler-api/1.8.1/plexus-compiler-api-1.8.1.jar
(20 KB at 270.7 KB/sec)
                                                
Downloaded: http://repo.maven.apache.org/maven2/org/codehaus/plexus/plexus-utils/1.5.5/plexus-utils-1.5.5.jar
(246 KB at 3316.0 KB/sec)
                                                
Downloaded: http://repo.maven.apache.org/maven2/org/jamon/jamon-processor/2.4.1/jamon-processor-2.4.1.jar
(281 KB at 2672.1 KB/sec)
[INFO] Translating 10 templates from <https://builds.apache.org/job/HBase-1.3/jdk=latest1.7,label=yahoo-not-h2/ws/hbase-server/src/main/jamon>
to <https://builds.apache.org/job/HBase-1.3/jdk=latest1.7,label=yahoo-not-h2/ws/hbase-server/target/generated-jamon>
[INFO] 
[INFO] --- maven-antrun-plugin:1.6:run (generate) @ hbase-server ---
[INFO] Executing tasks

main:
    [mkdir] Created dir: <https://builds.apache.org/job/HBase-1.3/jdk=latest1.7,label=yahoo-not-h2/ws/hbase-server/target/hbase-webapps>
     [copy] Copying 20 files to <https://builds.apache.org/job/HBase-1.3/jdk=latest1.7,label=yahoo-not-h2/ws/hbase-server/target/hbase-webapps>
log4j:WARN No appenders could be found for logger (org.mortbay.log).
log4j:WARN Please initialize the log4j system properly.
log4j:WARN See http://logging.apache.org/log4j/1.2/faq.html#noconfig for more info.
    [mkdir] Created dir: <https://builds.apache.org/job/HBase-1.3/jdk=latest1.7,label=yahoo-not-h2/ws/hbase-server/target/hbase-webapps/master/WEB-INF>
    [mkdir] Created dir: <https://builds.apache.org/job/HBase-1.3/jdk=latest1.7,label=yahoo-not-h2/ws/hbase-server/target/hbase-webapps/regionserver/WEB-INF>
[INFO] Executed tasks
[INFO] 
[INFO] --- maven-remote-resources-plugin:1.5:process (default) @ hbase-server ---
[INFO] 
[INFO] --- maven-resources-plugin:2.6:resources (default-resources) @ hbase-server ---
[INFO] Using 'UTF-8' encoding to copy filtered resources.
[INFO] Copying 22 resources
[INFO] Copying 2 resources
[INFO] 
[INFO] --- maven-compiler-plugin:2.5.1:compile (default-compile) @ hbase-server ---
[INFO] Compiling 808 source files to <https://builds.apache.org/job/HBase-1.3/jdk=latest1.7,label=yahoo-not-h2/ws/hbase-server/target/classes>
[WARNING] <https://builds.apache.org/job/HBase-1.3/jdk=latest1.7,label=yahoo-not-h2/ws/hbase-server/src/main/java/org/apache/hadoop/hbase/regionserver/snapshot/RegionServerSnapshotManager.java>:[231,20]
Signal is internal proprietary API and may be removed in a future release
[WARNING] <https://builds.apache.org/job/HBase-1.3/jdk=latest1.7,label=yahoo-not-h2/ws/hbase-server/src/main/java/org/apache/hadoop/hbase/regionserver/snapshot/RegionServerSnapshotManager.java>:[231,44]
SignalHandler is internal proprietary API and may be removed in a future release
[WARNING] <https://builds.apache.org/job/HBase-1.3/jdk=latest1.7,label=yahoo-not-h2/ws/hbase-server/src/main/java/org/apache/hadoop/hbase/regionserver/HRegionServer.java>:[617,24]
Signal is internal proprietary API and may be removed in a future release
[WARNING] <https://builds.apache.org/job/HBase-1.3/jdk=latest1.7,label=yahoo-not-h2/ws/hbase-server/src/main/java/org/apache/hadoop/hbase/regionserver/HRegionServer.java>:[617,43]
SignalHandler is internal proprietary API and may be removed in a future release
[WARNING] <https://builds.apache.org/job/HBase-1.3/jdk=latest1.7,label=yahoo-not-h2/ws/hbase-server/src/main/java/org/apache/hadoop/hbase/regionserver/HRegionServer.java>:[618,27]
Signal is internal proprietary API and may be removed in a future release
[WARNING] <https://builds.apache.org/job/HBase-1.3/jdk=latest1.7,label=yahoo-not-h2/ws/hbase-server/src/main/java/org/apache/hadoop/hbase/regionserver/HRegionServer.java>:[617,6]
Signal is internal proprietary API and may be removed in a future release
[INFO] 
[INFO] --- maven-dependency-plugin:2.1:build-classpath (create-mrapp-generated-classpath)
@ hbase-server ---
[INFO] Wrote classpath file '<https://builds.apache.org/job/HBase-1.3/jdk=latest1.7,label=yahoo-not-h2/ws/hbase-server/target/test-classes/mrapp-generated-classpath'.>
[INFO] 
[INFO] --- maven-resources-plugin:2.6:testResources (default-testResources) @ hbase-server
---
[INFO] Using 'UTF-8' encoding to copy filtered resources.
[INFO] Copying 1 resource to META-INF/
[INFO] Copying 16 resources
[INFO] 
[INFO] --- maven-compiler-plugin:2.5.1:testCompile (default-testCompile) @ hbase-server ---
[INFO] Compiling 748 source files to <https://builds.apache.org/job/HBase-1.3/jdk=latest1.7,label=yahoo-not-h2/ws/hbase-server/target/test-classes>
[INFO] -------------------------------------------------------------
[ERROR] COMPILATION ERROR : 
[INFO] -------------------------------------------------------------
[ERROR] <https://builds.apache.org/job/HBase-1.3/jdk=latest1.7,label=yahoo-not-h2/ws/hbase-server/src/test/java/org/apache/hadoop/hbase/mapreduce/TestImportTsv.java>:[371,63]
error: cannot find symbol
[ERROR]   symbol:   variable tn
  location: class TestImportTsv
<https://builds.apache.org/job/HBase-1.3/jdk=latest1.7,label=yahoo-not-h2/ws/hbase-server/src/test/java/org/apache/hadoop/hbase/mapreduce/TestImportTsv.java>:[378,26]
error: cannot find symbol
[ERROR]   symbol:   variable tn
  location: class TestImportTsv
<https://builds.apache.org/job/HBase-1.3/jdk=latest1.7,label=yahoo-not-h2/ws/hbase-server/src/test/java/org/apache/hadoop/hbase/mapreduce/TestImportTsv.java>:[379,21]
error: cannot find symbol
[INFO] 3 errors 
[INFO] -------------------------------------------------------------
[INFO] ------------------------------------------------------------------------
[INFO] Reactor Summary:
[INFO] 
[INFO] Apache HBase ...................................... SUCCESS [1:03.634s]
[INFO] Apache HBase - Checkstyle ......................... SUCCESS [6.412s]
[INFO] Apache HBase - Resource Bundle .................... SUCCESS [0.192s]
[INFO] Apache HBase - Annotations ........................ SUCCESS [1.040s]
[INFO] Apache HBase - Protocol ........................... SUCCESS [16.983s]
[INFO] Apache HBase - Common ............................. SUCCESS [2:17.859s]
[INFO] Apache HBase - Procedure .......................... SUCCESS [3:23.355s]
[INFO] Apache HBase - Client ............................. SUCCESS [1:22.004s]
[INFO] Apache HBase - Hadoop Compatibility ............... SUCCESS [8.012s]
[INFO] Apache HBase - Hadoop Two Compatibility ........... SUCCESS [8.772s]
[INFO] Apache HBase - Prefix Tree ........................ SUCCESS [9.720s]
[INFO] Apache HBase - Server ............................. FAILURE [1:06.601s]
[INFO] Apache HBase - Testing Util ....................... SKIPPED
[INFO] Apache HBase - Thrift ............................. SKIPPED
[INFO] Apache HBase - Rest ............................... SKIPPED
[INFO] Apache HBase - Shell .............................. SKIPPED
[INFO] Apache HBase - Integration Tests .................. SKIPPED
[INFO] Apache HBase - Examples ........................... SKIPPED
[INFO] Apache HBase - External Block Cache ............... SKIPPED
[INFO] Apache HBase - Assembly ........................... SKIPPED
[INFO] Apache HBase - Shaded ............................. SKIPPED
[INFO] Apache HBase - Shaded - Client .................... SKIPPED
[INFO] Apache HBase - Shaded - Server .................... SKIPPED
[INFO] ------------------------------------------------------------------------
[INFO] BUILD FAILURE
[INFO] ------------------------------------------------------------------------
[INFO] Total time: 10:23.843s
[INFO] Finished at: Fri Feb 05 17:56:04 UTC 2016
[INFO] Final Memory: 97M/869M
[INFO] ------------------------------------------------------------------------
[ERROR] Failed to execute goal org.apache.maven.plugins:maven-compiler-plugin:2.5.1:testCompile
(default-testCompile) on project hbase-server: Compilation failure: Compilation failure:
[ERROR] <https://builds.apache.org/job/HBase-1.3/jdk=latest1.7,label=yahoo-not-h2/ws/hbase-server/src/test/java/org/apache/hadoop/hbase/mapreduce/TestImportTsv.java>:[371,63]
error: cannot find symbol
[ERROR] symbol:   variable tn
[ERROR] location: class TestImportTsv
[ERROR] <https://builds.apache.org/job/HBase-1.3/jdk=latest1.7,label=yahoo-not-h2/ws/hbase-server/src/test/java/org/apache/hadoop/hbase/mapreduce/TestImportTsv.java>:[378,26]
error: cannot find symbol
[ERROR] symbol:   variable tn
[ERROR] location: class TestImportTsv
[ERROR] <https://builds.apache.org/job/HBase-1.3/jdk=latest1.7,label=yahoo-not-h2/ws/hbase-server/src/test/java/org/apache/hadoop/hbase/mapreduce/TestImportTsv.java>:[379,21]
error: cannot find symbol
[ERROR] -> [Help 1]
[ERROR] 
[ERROR] To see the full stack trace of the errors, re-run Maven with the -e switch.
[ERROR] Re-run Maven using the -X switch to enable full debug logging.
[ERROR] 
[ERROR] For more information about the errors and possible solutions, please read the following
articles:
[ERROR] [Help 1] http://cwiki.apache.org/confluence/display/MAVEN/MojoFailureException
[ERROR] 
[ERROR] After correcting the problems, you can resume the build with the command
[ERROR]   mvn <goals> -rf :hbase-server
Build step 'Invoke top-level Maven targets' marked build as failure
Performing Post build task...
Match found for :.* : True
Logical operation result is TRUE
Running script  : # Post-build task script. TODO: Check this in and have all builds reference
check-in.
pwd && ls
# NOTE!!!! The below code has been copied and pasted from ./dev-tools/run-test.sh
# Do not change here without syncing there and vice-versa.
ZOMBIE_TESTS_COUNT=`jps -v | grep surefirebooter | grep -e '-Dhbase.test' | wc -l`
if [[ $ZOMBIE_TESTS_COUNT != 0 ]] ; then
 echo "Suspicious java process found - waiting 30s to see if there are just slow to stop"
 sleep 30
 ZOMBIE_TESTS_COUNT=`jps -v | grep surefirebooter | grep -e '-Dhbase.test' | wc -l`
 if [[ $ZOMBIE_TESTS_COUNT != 0 ]] ; then
   echo " {color:red}There appear to be $ZOMBIE_TESTS_COUNT zombie tests{color}, they should
have been killed by surefire but survived"
   jps -v | grep surefirebooter | grep -e '-Dhbase.test'
   jps -v | grep surefirebooter | grep -e '-Dhbase.test' | cut -d ' ' -f 1 | xargs -n 1 jstack
   # Exit with error
   exit 1
 else
   echo "We're ok: there is no zombie test, but some tests took some time to stop"
 fi
else
  echo "We're ok: there is no zombie test"
fi
[yahoo-not-h2] $ /bin/bash -xe /tmp/hudson5066239200100234761.sh
+ pwd
<https://builds.apache.org/job/HBase-1.3/jdk=latest1.7,label=yahoo-not-h2/ws/>
+ ls
bin
CHANGES.txt
conf
dev-support
hbase-annotations
hbase-assembly
hbase-checkstyle
hbase-client
hbase-common
hbase-examples
hbase-external-blockcache
hbase-hadoop2-compat
hbase-hadoop-compat
hbase-it
hbase-native-client
hbase-prefix-tree
hbase-procedure
hbase-protocol
hbase-resource-bundle
hbase-rest
hbase-server
hbase-shaded
hbase-shell
hbase-testing-util
hbase-thrift
LICENSE.txt
NOTICE.txt
pom.xml
README.txt
src
target
++ jps -v
++ grep surefirebooter
++ wc -l
++ grep -e -Dhbase.test
+ ZOMBIE_TESTS_COUNT=0
+ [[ 0 != 0 ]]
+ echo 'We'\''re ok: there is no zombie test'
We're ok: there is no zombie test
POST BUILD TASK : SUCCESS
END OF POST BUILD TASK : 0
Archiving artifacts
Recording test results

Mime
View raw message