hbase-builds mailing list archives

Site index · List index
Message view « Date » · « Thread »
Top « Date » · « Thread »
From Apache Jenkins Server <jenk...@builds.apache.org>
Subject Build failed in Jenkins: HBase-Trunk_matrix » latest1.7,yahoo-not-h2 #712
Date Tue, 16 Feb 2016 21:08:04 GMT
See <https://builds.apache.org/job/HBase-Trunk_matrix/jdk=latest1.7,label=yahoo-not-h2/712/>

------------------------------------------
[...truncated 4887 lines...]
Tue Feb 16 20:40:14 UTC 2016, RpcRetryingCaller{globalStartTime=1455654763576, pause=100,
maxAttempts=36}, org.apache.hadoop.hbase.MasterNotRunningException: java.io.IOException: Can't
get master address from ZooKeeper; znode data == null
Tue Feb 16 20:40:34 UTC 2016, RpcRetryingCaller{globalStartTime=1455654763576, pause=100,
maxAttempts=36}, org.apache.hadoop.hbase.MasterNotRunningException: java.io.IOException: Can't
get master address from ZooKeeper; znode data == null
Tue Feb 16 20:40:54 UTC 2016, RpcRetryingCaller{globalStartTime=1455654763576, pause=100,
maxAttempts=36}, org.apache.hadoop.hbase.MasterNotRunningException: java.io.IOException: Can't
get master address from ZooKeeper; znode data == null
Tue Feb 16 20:41:14 UTC 2016, RpcRetryingCaller{globalStartTime=1455654763576, pause=100,
maxAttempts=36}, org.apache.hadoop.hbase.MasterNotRunningException: java.io.IOException: Can't
get master address from ZooKeeper; znode data == null
Tue Feb 16 20:41:34 UTC 2016, RpcRetryingCaller{globalStartTime=1455654763576, pause=100,
maxAttempts=36}, org.apache.hadoop.hbase.MasterNotRunningException: java.io.IOException: Can't
get master address from ZooKeeper; znode data == null
Tue Feb 16 20:41:54 UTC 2016, RpcRetryingCaller{globalStartTime=1455654763576, pause=100,
maxAttempts=36}, org.apache.hadoop.hbase.MasterNotRunningException: java.io.IOException: Can't
get master address from ZooKeeper; znode data == null

	at org.apache.hadoop.hbase.zookeeper.MasterAddressTracker.getMasterAddress(MasterAddressTracker.java:155)
	at org.apache.hadoop.hbase.client.ConnectionImplementation$StubMaker.makeStubNoRetries(ConnectionImplementation.java:1155)
	at org.apache.hadoop.hbase.client.ConnectionImplementation$StubMaker.makeStub(ConnectionImplementation.java:1196)
	at org.apache.hadoop.hbase.client.ConnectionImplementation$MasterServiceStubMaker.makeStub(ConnectionImplementation.java:1225)
	at org.apache.hadoop.hbase.client.ConnectionImplementation.getKeepAliveMasterService(ConnectionImplementation.java:1374)
	at org.apache.hadoop.hbase.client.MasterCallable.prepare(MasterCallable.java:38)
	at org.apache.hadoop.hbase.client.RpcRetryingCallerImpl.callWithRetries(RpcRetryingCallerImpl.java:116)
	at org.apache.hadoop.hbase.client.HBaseAdmin.executeCallable(HBaseAdmin.java:2673)
	at org.apache.hadoop.hbase.client.HBaseAdmin.executeCallable(HBaseAdmin.java:2666)
	at org.apache.hadoop.hbase.client.HBaseAdmin.createTableAsync(HBaseAdmin.java:484)
	at org.apache.hadoop.hbase.client.HBaseAdmin.createTable(HBaseAdmin.java:457)
	at org.apache.hadoop.hbase.HBaseTestingUtility.createTable(HBaseTestingUtility.java:1619)
	at org.apache.hadoop.hbase.regionserver.TestRegionMergeTransactionOnCluster.createTableAndLoadData(TestRegionMergeTransactionOnCluster.java:456)
	at org.apache.hadoop.hbase.regionserver.TestRegionMergeTransactionOnCluster.testMergeWithReplicas(TestRegionMergeTransactionOnCluster.java:362)

Running org.apache.hadoop.hbase.client.TestHCM
Running org.apache.hadoop.hbase.client.TestSizeFailures
Tests run: 27, Failures: 0, Errors: 0, Skipped: 0, Time elapsed: 158.473 sec - in org.apache.hadoop.hbase.client.TestAdmin1
Tests run: 5, Failures: 0, Errors: 0, Skipped: 0, Time elapsed: 133.442 sec - in org.apache.hadoop.hbase.client.TestCloneSnapshotFromClientWithRegionReplicas
Running org.apache.hadoop.hbase.client.TestShortCircuitConnection
Tests run: 1, Failures: 0, Errors: 0, Skipped: 0, Time elapsed: 2.634 sec - in org.apache.hadoop.hbase.client.TestShortCircuitConnection
Running org.apache.hadoop.hbase.client.TestFastFail
Tests run: 1, Failures: 0, Errors: 0, Skipped: 1, Time elapsed: 0.001 sec - in org.apache.hadoop.hbase.client.TestFastFail
Running org.apache.hadoop.hbase.client.TestFromClientSide3
Running org.apache.hadoop.hbase.client.TestReplicasClient
Tests run: 75, Failures: 0, Errors: 0, Skipped: 4, Time elapsed: 205.704 sec - in org.apache.hadoop.hbase.client.TestFromClientSideWithCoprocessor
Running org.apache.hadoop.hbase.client.TestRestoreSnapshotFromClientWithRegionReplicas
Tests run: 2, Failures: 0, Errors: 0, Skipped: 0, Time elapsed: 63.039 sec - in org.apache.hadoop.hbase.client.TestSizeFailures
Running org.apache.hadoop.hbase.client.TestAdmin2
Tests run: 9, Failures: 0, Errors: 0, Skipped: 0, Time elapsed: 73.126 sec - in org.apache.hadoop.hbase.client.TestFromClientSide3
Running org.apache.hadoop.hbase.client.TestMobCloneSnapshotFromClient
Tests run: 17, Failures: 0, Errors: 0, Skipped: 2, Time elapsed: 158.417 sec - in org.apache.hadoop.hbase.client.TestHCM
Running org.apache.hadoop.hbase.client.TestFromClientSideNoCodec
Tests run: 2, Failures: 0, Errors: 0, Skipped: 0, Time elapsed: 2.756 sec - in org.apache.hadoop.hbase.client.TestFromClientSideNoCodec
Running org.apache.hadoop.hbase.TestZooKeeper
Tests run: 26, Failures: 0, Errors: 0, Skipped: 0, Time elapsed: 98.321 sec - in org.apache.hadoop.hbase.client.TestAdmin2
Running org.apache.hadoop.hbase.TestStochasticBalancerJmxMetrics
Tests run: 2, Failures: 0, Errors: 0, Skipped: 0, Time elapsed: 1.437 sec - in org.apache.hadoop.hbase.TestStochasticBalancerJmxMetrics
Running org.apache.hadoop.hbase.TestAcidGuarantees
Tests run: 5, Failures: 0, Errors: 0, Skipped: 0, Time elapsed: 142.529 sec - in org.apache.hadoop.hbase.client.TestRestoreSnapshotFromClientWithRegionReplicas
Running org.apache.hadoop.hbase.namespace.TestNamespaceAuditor
Tests run: 5, Failures: 0, Errors: 0, Skipped: 0, Time elapsed: 175.697 sec - in org.apache.hadoop.hbase.client.TestMobCloneSnapshotFromClient
Running org.apache.hadoop.hbase.trace.TestHTraceHooks
Tests run: 1, Failures: 0, Errors: 0, Skipped: 0, Time elapsed: 2.999 sec - in org.apache.hadoop.hbase.trace.TestHTraceHooks
Running org.apache.hadoop.hbase.TestHBaseTestingUtility
Tests run: 14, Failures: 0, Errors: 0, Skipped: 0, Time elapsed: 278.07 sec - in org.apache.hadoop.hbase.client.TestReplicasClient
Running org.apache.hadoop.hbase.zookeeper.TestHQuorumPeer
Tests run: 3, Failures: 0, Errors: 0, Skipped: 0, Time elapsed: 1.124 sec - in org.apache.hadoop.hbase.zookeeper.TestHQuorumPeer
Running org.apache.hadoop.hbase.zookeeper.TestRecoverableZooKeeper
Tests run: 1, Failures: 0, Errors: 0, Skipped: 0, Time elapsed: 1.238 sec - in org.apache.hadoop.hbase.zookeeper.TestRecoverableZooKeeper
Running org.apache.hadoop.hbase.zookeeper.TestZooKeeperNodeTracker
Tests run: 3, Failures: 0, Errors: 0, Skipped: 0, Time elapsed: 1.283 sec - in org.apache.hadoop.hbase.zookeeper.TestZooKeeperNodeTracker
Running org.apache.hadoop.hbase.zookeeper.TestZKMulti
Tests run: 12, Failures: 0, Errors: 0, Skipped: 0, Time elapsed: 1.781 sec - in org.apache.hadoop.hbase.zookeeper.TestZKMulti
Running org.apache.hadoop.hbase.zookeeper.TestZKLeaderManager
Tests run: 1, Failures: 0, Errors: 0, Skipped: 0, Time elapsed: 0.103 sec - in org.apache.hadoop.hbase.zookeeper.TestZKLeaderManager
Running org.apache.hadoop.hbase.zookeeper.lock.TestZKInterProcessReadWriteLock
Tests run: 12, Failures: 0, Errors: 0, Skipped: 0, Time elapsed: 127.482 sec - in org.apache.hadoop.hbase.namespace.TestNamespaceAuditor
Running org.apache.hadoop.hbase.zookeeper.TestZooKeeperACL
Tests run: 7, Failures: 0, Errors: 0, Skipped: 0, Time elapsed: 0.53 sec - in org.apache.hadoop.hbase.zookeeper.TestZooKeeperACL
Tests run: 6, Failures: 0, Errors: 0, Skipped: 0, Time elapsed: 24.578 sec - in org.apache.hadoop.hbase.zookeeper.lock.TestZKInterProcessReadWriteLock
Tests run: 12, Failures: 0, Errors: 0, Skipped: 0, Time elapsed: 54.443 sec - in org.apache.hadoop.hbase.TestHBaseTestingUtility
Running org.apache.hadoop.hbase.mapreduce.TestLoadIncrementalHFiles
Running org.apache.hadoop.hbase.mapreduce.TestCellCounter
Running org.apache.hadoop.hbase.mapreduce.TestImportTSVWithOperationAttributes
Tests run: 10, Failures: 0, Errors: 0, Skipped: 0, Time elapsed: 227.524 sec - in org.apache.hadoop.hbase.TestZooKeeper
Tests run: 2, Failures: 0, Errors: 0, Skipped: 0, Time elapsed: 25.205 sec - in org.apache.hadoop.hbase.mapreduce.TestImportTSVWithOperationAttributes
Running org.apache.hadoop.hbase.mapreduce.TestSecureLoadIncrementalHFilesSplitRecovery
Tests run: 7, Failures: 0, Errors: 0, Skipped: 0, Time elapsed: 33.515 sec - in org.apache.hadoop.hbase.mapreduce.TestCellCounter
Tests run: 6, Failures: 0, Errors: 0, Skipped: 0, Time elapsed: 214.612 sec - in org.apache.hadoop.hbase.TestAcidGuarantees
Running org.apache.hadoop.hbase.mapreduce.TestTableInputFormat
Running org.apache.hadoop.hbase.mapreduce.TestLoadIncrementalHFilesSplitRecovery
Running org.apache.hadoop.hbase.mapreduce.TestLoadIncrementalHFilesUseSecurityEndPoint
Tests run: 5, Failures: 0, Errors: 0, Skipped: 0, Time elapsed: 28.032 sec - in org.apache.hadoop.hbase.mapreduce.TestSecureLoadIncrementalHFilesSplitRecovery
Tests run: 8, Failures: 0, Errors: 0, Skipped: 0, Time elapsed: 22.27 sec - in org.apache.hadoop.hbase.mapreduce.TestTableInputFormat
Running org.apache.hadoop.hbase.mapreduce.TestHLogRecordReader
Tests run: 2, Failures: 0, Errors: 0, Skipped: 0, Time elapsed: 1.793 sec - in org.apache.hadoop.hbase.mapreduce.TestHLogRecordReader
Running org.apache.hadoop.hbase.mapreduce.TestHRegionPartitioner
Tests run: 1, Failures: 0, Errors: 0, Skipped: 0, Time elapsed: 3.281 sec - in org.apache.hadoop.hbase.mapreduce.TestHRegionPartitioner
Running org.apache.hadoop.hbase.mapreduce.TestTableInputFormatScan2
Running org.apache.hadoop.hbase.mapreduce.TestImportTsv
Tests run: 5, Failures: 0, Errors: 0, Skipped: 0, Time elapsed: 49.483 sec - in org.apache.hadoop.hbase.mapreduce.TestLoadIncrementalHFilesSplitRecovery
Running org.apache.hadoop.hbase.mapreduce.TestSecureLoadIncrementalHFiles
Tests run: 7, Failures: 0, Errors: 0, Skipped: 0, Time elapsed: 39.348 sec - in org.apache.hadoop.hbase.mapreduce.TestTableInputFormatScan2
Tests run: 22, Failures: 0, Errors: 0, Skipped: 0, Time elapsed: 146.698 sec - in org.apache.hadoop.hbase.mapreduce.TestLoadIncrementalHFiles
Running org.apache.hadoop.hbase.mapreduce.TestTableMapReduce
Running org.apache.hadoop.hbase.mapreduce.TestWALPlayer
Tests run: 4, Failures: 0, Errors: 0, Skipped: 0, Time elapsed: 9.803 sec - in org.apache.hadoop.hbase.mapreduce.TestWALPlayer
Tests run: 2, Failures: 0, Errors: 0, Skipped: 0, Time elapsed: 31.2 sec - in org.apache.hadoop.hbase.mapreduce.TestTableMapReduce
Running org.apache.hadoop.hbase.mapreduce.TestImportExport
Running org.apache.hadoop.hbase.mapreduce.TestRowCounter
Tests run: 22, Failures: 0, Errors: 0, Skipped: 0, Time elapsed: 144.463 sec - in org.apache.hadoop.hbase.mapreduce.TestLoadIncrementalHFilesUseSecurityEndPoint
Running org.apache.hadoop.hbase.mapreduce.TestImportTSVWithVisibilityLabels
Tests run: 7, Failures: 0, Errors: 0, Skipped: 0, Time elapsed: 42.19 sec - in org.apache.hadoop.hbase.mapreduce.TestRowCounter
Tests run: 18, Failures: 0, Errors: 0, Skipped: 0, Time elapsed: 137.98 sec - in org.apache.hadoop.hbase.mapreduce.TestImportTsv
Running org.apache.hadoop.hbase.mapreduce.TestHashTable
Running org.apache.hadoop.hbase.mapreduce.TestImportTSVWithTTLs
Tests run: 1, Failures: 0, Errors: 0, Skipped: 0, Time elapsed: 13.62 sec - in org.apache.hadoop.hbase.mapreduce.TestImportTSVWithTTLs
Tests run: 1, Failures: 0, Errors: 0, Skipped: 0, Time elapsed: 14.511 sec - in org.apache.hadoop.hbase.mapreduce.TestHashTable
Running org.apache.hadoop.hbase.mapreduce.TestHFileOutputFormat2
Tests run: 14, Failures: 0, Errors: 0, Skipped: 14, Time elapsed: 0.004 sec - in org.apache.hadoop.hbase.mapreduce.TestHFileOutputFormat2
Tests run: 22, Failures: 0, Errors: 0, Skipped: 0, Time elapsed: 150.661 sec - in org.apache.hadoop.hbase.mapreduce.TestSecureLoadIncrementalHFiles
Tests run: 12, Failures: 0, Errors: 0, Skipped: 0, Time elapsed: 85.294 sec - in org.apache.hadoop.hbase.mapreduce.TestImportExport
Running org.apache.hadoop.hbase.mapreduce.TestWALRecordReader
Tests run: 2, Failures: 0, Errors: 0, Skipped: 0, Time elapsed: 1.978 sec - in org.apache.hadoop.hbase.mapreduce.TestWALRecordReader
Running org.apache.hadoop.hbase.mapreduce.TestTableSnapshotInputFormat
Running org.apache.hadoop.hbase.mapreduce.TestTableInputFormatScan1
Running org.apache.hadoop.hbase.mapreduce.TestMultithreadedTableMapper
Running org.apache.hadoop.hbase.mapreduce.TestMultiTableSnapshotInputFormat
Tests run: 7, Failures: 0, Errors: 0, Skipped: 0, Time elapsed: 78.841 sec - in org.apache.hadoop.hbase.mapreduce.TestImportTSVWithVisibilityLabels
Running org.apache.hadoop.hbase.mapreduce.TestTimeRangeMapRed
Tests run: 1, Failures: 0, Errors: 0, Skipped: 0, Time elapsed: 8.535 sec - in org.apache.hadoop.hbase.mapreduce.TestTimeRangeMapRed
Tests run: 4, Failures: 0, Errors: 0, Skipped: 0, Time elapsed: 38.361 sec - in org.apache.hadoop.hbase.mapreduce.TestMultiTableSnapshotInputFormat
Running org.apache.hadoop.hbase.mapreduce.TestSyncTable
Tests run: 7, Failures: 0, Errors: 0, Skipped: 0, Time elapsed: 43.183 sec - in org.apache.hadoop.hbase.mapreduce.TestTableInputFormatScan1
Tests run: 1, Failures: 0, Errors: 0, Skipped: 0, Time elapsed: 50.313 sec - in org.apache.hadoop.hbase.mapreduce.TestMultithreadedTableMapper
Running org.apache.hadoop.hbase.mapreduce.TestCopyTable
Running org.apache.hadoop.hbase.mapreduce.TestMultiTableInputFormat
Running org.apache.hadoop.hbase.TestMetaTableAccessor
Tests run: 1, Failures: 0, Errors: 0, Skipped: 0, Time elapsed: 31.439 sec - in org.apache.hadoop.hbase.mapreduce.TestSyncTable
Running org.apache.hadoop.hbase.io.TestFileLink
Tests run: 14, Failures: 0, Errors: 0, Skipped: 0, Time elapsed: 17.306 sec - in org.apache.hadoop.hbase.TestMetaTableAccessor
Running org.apache.hadoop.hbase.io.hfile.TestHFileBlockIndex
Tests run: 5, Failures: 0, Errors: 0, Skipped: 0, Time elapsed: 16.665 sec - in org.apache.hadoop.hbase.io.TestFileLink
Running org.apache.hadoop.hbase.io.hfile.TestSeekBeforeWithInlineBlocks
Tests run: 4, Failures: 0, Errors: 0, Skipped: 0, Time elapsed: 36.138 sec - in org.apache.hadoop.hbase.mapreduce.TestMultiTableInputFormat
Tests run: 10, Failures: 0, Errors: 0, Skipped: 0, Time elapsed: 14.579 sec - in org.apache.hadoop.hbase.io.hfile.TestHFileBlockIndex
Running org.apache.hadoop.hbase.io.hfile.TestHFileSeek
Running org.apache.hadoop.hbase.io.hfile.TestScannerSelectionUsingTTL
Tests run: 1, Failures: 0, Errors: 0, Skipped: 0, Time elapsed: 15.829 sec - in org.apache.hadoop.hbase.io.hfile.TestSeekBeforeWithInlineBlocks
Tests run: 1, Failures: 0, Errors: 0, Skipped: 0, Time elapsed: 2.697 sec - in org.apache.hadoop.hbase.io.hfile.TestHFileSeek
Tests run: 5, Failures: 0, Errors: 0, Skipped: 0, Time elapsed: 57.7 sec - in org.apache.hadoop.hbase.mapreduce.TestCopyTable
Running org.apache.hadoop.hbase.io.hfile.TestHFileBlock
Running org.apache.hadoop.hbase.io.hfile.TestCacheConfig
Tests run: 8, Failures: 0, Errors: 0, Skipped: 0, Time elapsed: 130.967 sec - in org.apache.hadoop.hbase.mapreduce.TestTableSnapshotInputFormat
Tests run: 6, Failures: 0, Errors: 0, Skipped: 0, Time elapsed: 2.584 sec - in org.apache.hadoop.hbase.io.hfile.TestCacheConfig
Running org.apache.hadoop.hbase.io.hfile.TestScannerFromBucketCache
Running org.apache.hadoop.hbase.io.hfile.TestForceCacheImportantBlocks
Running org.apache.hadoop.hbase.io.hfile.TestCacheOnWrite
Tests run: 4, Failures: 0, Errors: 0, Skipped: 0, Time elapsed: 6.205 sec - in org.apache.hadoop.hbase.io.hfile.TestScannerFromBucketCache
Running org.apache.hadoop.hbase.io.encoding.TestLoadAndSwitchEncodeOnDisk
Tests run: 2, Failures: 0, Errors: 0, Skipped: 0, Time elapsed: 31.203 sec - in org.apache.hadoop.hbase.io.hfile.TestForceCacheImportantBlocks
Tests run: 1, Failures: 0, Errors: 0, Skipped: 0, Time elapsed: 34.261 sec - in org.apache.hadoop.hbase.io.encoding.TestLoadAndSwitchEncodeOnDisk
Running org.apache.hadoop.hbase.io.encoding.TestChangingEncoding
Running org.apache.hadoop.hbase.io.encoding.TestEncodedSeekers
Tests run: 6, Failures: 0, Errors: 0, Skipped: 0, Time elapsed: 64.052 sec - in org.apache.hadoop.hbase.io.hfile.TestScannerSelectionUsingTTL
Running org.apache.hadoop.hbase.io.encoding.TestDataBlockEncoders
Tests run: 28, Failures: 0, Errors: 0, Skipped: 0, Time elapsed: 92.663 sec - in org.apache.hadoop.hbase.io.hfile.TestHFileBlock
Running org.apache.hadoop.hbase.io.encoding.TestBufferedDataBlockEncoder
Tests run: 2, Failures: 0, Errors: 0, Skipped: 0, Time elapsed: 15.801 sec - in org.apache.hadoop.hbase.io.encoding.TestBufferedDataBlockEncoder
Running org.apache.hadoop.hbase.filter.TestScanRowPrefix
Tests run: 1, Failures: 0, Errors: 0, Skipped: 0, Time elapsed: 5.587 sec - in org.apache.hadoop.hbase.filter.TestScanRowPrefix
Running org.apache.hadoop.hbase.filter.TestFilterWithScanLimits
Tests run: 56, Failures: 0, Errors: 0, Skipped: 0, Time elapsed: 101.766 sec - in org.apache.hadoop.hbase.io.encoding.TestDataBlockEncoders
Running org.apache.hadoop.hbase.filter.TestFilterWrapper
Tests run: 1, Failures: 0, Errors: 0, Skipped: 0, Time elapsed: 3.382 sec - in org.apache.hadoop.hbase.filter.TestFilterWrapper
Tests run: 72, Failures: 0, Errors: 0, Skipped: 0, Time elapsed: 180.291 sec - in org.apache.hadoop.hbase.io.hfile.TestCacheOnWrite
Running org.apache.hadoop.hbase.filter.TestFuzzyRowFilterEndToEnd
Tests run: 1, Failures: 0, Errors: 0, Skipped: 0, Time elapsed: 52.079 sec - in org.apache.hadoop.hbase.filter.TestFilterWithScanLimits
Tests run: 20, Failures: 0, Errors: 0, Skipped: 0, Time elapsed: 145.701 sec - in org.apache.hadoop.hbase.io.encoding.TestEncodedSeekers
Tests run: 3, Failures: 0, Errors: 0, Skipped: 0, Time elapsed: 152.169 sec - in org.apache.hadoop.hbase.io.encoding.TestChangingEncoding
Running org.apache.hadoop.hbase.filter.TestColumnRangeFilter
Running org.apache.hadoop.hbase.filter.TestFuzzyRowAndColumnRangeFilter
Running org.apache.hadoop.hbase.filter.TestMultiRowRangeFilter
Tests run: 1, Failures: 0, Errors: 0, Skipped: 0, Time elapsed: 2.858 sec - in org.apache.hadoop.hbase.filter.TestFuzzyRowAndColumnRangeFilter
Tests run: 1, Failures: 0, Errors: 0, Skipped: 0, Time elapsed: 8.567 sec - in org.apache.hadoop.hbase.filter.TestColumnRangeFilter
Tests run: 20, Failures: 0, Errors: 0, Skipped: 0, Time elapsed: 20.772 sec - in org.apache.hadoop.hbase.filter.TestMultiRowRangeFilter
Tests run: 3, Failures: 0, Errors: 0, Skipped: 0, Time elapsed: 351.8 sec - in org.apache.hadoop.hbase.filter.TestFuzzyRowFilterEndToEnd

Results :

Tests in error: 
  TestRegionMergeTransactionOnCluster.testMergeWithReplicas:362->createTableAndLoadData:456
» RetriesExhausted
  TestRegionMergeTransactionOnCluster.testWholesomeMerge:139->mergeRegionsAndVerifyRegionNum:402->waitAndVerifyRegionNum:426
» IO

Tests run: 2502, Failures: 0, Errors: 2, Skipped: 36

[INFO] ------------------------------------------------------------------------
[INFO] Reactor Summary:
[INFO] 
[INFO] Apache HBase ...................................... SUCCESS [  2.960 s]
[INFO] Apache HBase - Checkstyle ......................... SUCCESS [  0.784 s]
[INFO] Apache HBase - Resource Bundle .................... SUCCESS [  0.250 s]
[INFO] Apache HBase - Annotations ........................ SUCCESS [  0.289 s]
[INFO] Apache HBase - Protocol ........................... SUCCESS [  2.918 s]
[INFO] Apache HBase - Common ............................. SUCCESS [01:35 min]
[INFO] Apache HBase - Procedure .......................... SUCCESS [02:23 min]
[INFO] Apache HBase - Client ............................. SUCCESS [ 40.476 s]
[INFO] Apache HBase - Hadoop Compatibility ............... SUCCESS [  7.669 s]
[INFO] Apache HBase - Hadoop Two Compatibility ........... SUCCESS [  8.538 s]
[INFO] Apache HBase - Prefix Tree ........................ SUCCESS [ 11.640 s]
[INFO] Apache HBase - Server ............................. FAILURE [  01:33 h]
[INFO] Apache HBase - Testing Util ....................... SKIPPED
[INFO] Apache HBase - Thrift ............................. SKIPPED
[INFO] Apache HBase - Shell .............................. SKIPPED
[INFO] Apache HBase - Integration Tests .................. SKIPPED
[INFO] Apache HBase - Examples ........................... SKIPPED
[INFO] Apache HBase - Rest ............................... SKIPPED
[INFO] Apache HBase - External Block Cache ............... SKIPPED
[INFO] Apache HBase - Spark .............................. SKIPPED
[INFO] Apache HBase - Assembly ........................... SKIPPED
[INFO] Apache HBase - Shaded ............................. SKIPPED
[INFO] Apache HBase - Shaded - Client .................... SKIPPED
[INFO] Apache HBase - Shaded - Server .................... SKIPPED
[INFO] ------------------------------------------------------------------------
[INFO] BUILD FAILURE
[INFO] ------------------------------------------------------------------------
[INFO] Total time: 01:39 h
[INFO] Finished at: 2016-02-16T21:04:44+00:00
[INFO] Final Memory: 432M/615M
[INFO] ------------------------------------------------------------------------
[ERROR] Failed to execute goal org.apache.maven.plugins:maven-surefire-plugin:2.18.1:test
(secondPartTestsExecution) on project hbase-server: There was a timeout or other error in
the fork -> [Help 1]
[ERROR] 
[ERROR] To see the full stack trace of the errors, re-run Maven with the -e switch.
[ERROR] Re-run Maven using the -X switch to enable full debug logging.
[ERROR] 
[ERROR] For more information about the errors and possible solutions, please read the following
articles:
[ERROR] [Help 1] http://cwiki.apache.org/confluence/display/MAVEN/MojoFailureException
[ERROR] 
[ERROR] After correcting the problems, you can resume the build with the command
[ERROR]   mvn <goals> -rf :hbase-server
Build step 'Invoke top-level Maven targets' marked build as failure
Performing Post build task...
Match found for :.* : True
Logical operation result is TRUE
Running script  : # Run zombie detector script
./dev-support/zombie-detector.sh --jenkins ${BUILD_ID}
[yahoo-not-h2] $ /bin/bash -xe /tmp/hudson3154791672077321805.sh
+ ./dev-support/zombie-detector.sh --jenkins 712
Tue Feb 16 21:04:46 UTC 2016 Found 1 suspicious java process(es) listed below; waiting 30s
to see if just slow to stop
25389 surefirebooter4031216223487948650.jar -enableassertions -Dhbase.build.id=712 -Xmx2800m
-XX:MaxPermSize=256m -Djava.security.egd=file:/dev/./urandom -Djava.net.preferIPv4Stack=true
-Djava.awt.headless=true
tail: cannot open ‘+2’ for reading: No such file or directory
Tue Feb 16 21:05:16 UTC 2016 We're ok: there was a zombie candidate but it went away


    {color:green}+1 zombies{color}. No zombie tests found running at the end of the build
(There were candidates but they seem to have gone away).
POST BUILD TASK : SUCCESS
END OF POST BUILD TASK : 0
Archiving artifacts
Recording test results
[FINDBUGS] Skipping publisher since build result is FAILURE
[CHECKSTYLE] Skipping publisher since build result is FAILURE

Mime
View raw message