hbase-builds mailing list archives

Site index · List index
Message view « Date » · « Thread »
Top « Date » · « Thread »
From Apache Jenkins Server <jenk...@builds.apache.org>
Subject Build failed in Jenkins: HBase-Trunk_matrix » latest1.7,yahoo-not-h2 #716
Date Thu, 18 Feb 2016 04:54:52 GMT
See <https://builds.apache.org/job/HBase-Trunk_matrix/jdk=latest1.7,label=yahoo-not-h2/716/changes>

Changes:

[matteo.bertozzi] HBASE-15100 ProcedureInfo constructor should be

------------------------------------------
[...truncated 4809 lines...]
Tests run: 1, Failures: 0, Errors: 0, Skipped: 0, Time elapsed: 1.415 sec - in org.apache.hadoop.hbase.regionserver.TestFlushRegionEntry
Running org.apache.hadoop.hbase.regionserver.TestRegionIncrement
Running org.apache.hadoop.hbase.regionserver.TestEncryptionKeyRotation
Tests run: 3, Failures: 0, Errors: 0, Skipped: 0, Time elapsed: 18.898 sec - in org.apache.hadoop.hbase.regionserver.TestRegionIncrement
Running org.apache.hadoop.hbase.regionserver.TestHRegionReplayEvents
Tests run: 2, Failures: 0, Errors: 0, Skipped: 0, Time elapsed: 22.372 sec - in org.apache.hadoop.hbase.regionserver.TestEncryptionKeyRotation
Tests run: 5, Failures: 0, Errors: 0, Skipped: 0, Time elapsed: 297.02 sec - in org.apache.hadoop.hbase.regionserver.wal.TestLogRolling
Tests run: 26, Failures: 0, Errors: 0, Skipped: 0, Time elapsed: 40.541 sec - in org.apache.hadoop.hbase.regionserver.TestHRegionReplayEvents
Running org.apache.hadoop.hbase.regionserver.TestDeleteMobTable
Running org.apache.hadoop.hbase.regionserver.TestWALLockup
Running org.apache.hadoop.hbase.regionserver.TestMobStoreScanner
Tests run: 1, Failures: 0, Errors: 0, Skipped: 0, Time elapsed: 12.942 sec - in org.apache.hadoop.hbase.regionserver.TestWALLockup
Running org.apache.hadoop.hbase.regionserver.throttle.TestFlushWithThroughputController
Tests run: 3, Failures: 0, Errors: 0, Skipped: 0, Time elapsed: 18.492 sec - in org.apache.hadoop.hbase.regionserver.TestDeleteMobTable
Running org.apache.hadoop.hbase.regionserver.throttle.TestCompactionWithThroughputController
Tests run: 6, Failures: 0, Errors: 0, Skipped: 0, Time elapsed: 40.933 sec - in org.apache.hadoop.hbase.regionserver.TestMobStoreScanner
Running org.apache.hadoop.hbase.regionserver.TestCompactionState
Tests run: 3, Failures: 0, Errors: 0, Skipped: 0, Time elapsed: 87.956 sec - in org.apache.hadoop.hbase.regionserver.throttle.TestCompactionWithThroughputController
Running org.apache.hadoop.hbase.regionserver.TestFSErrorsExposed
Tests run: 7, Failures: 0, Errors: 0, Skipped: 0, Time elapsed: 226.004 sec - in org.apache.hadoop.hbase.regionserver.TestRegionReplicas
Tests run: 5, Failures: 0, Errors: 0, Skipped: 0, Time elapsed: 67.547 sec - in org.apache.hadoop.hbase.regionserver.TestCompactionState
Running org.apache.hadoop.hbase.regionserver.TestCorruptedRegionStoreFile
Running org.apache.hadoop.hbase.regionserver.TestDefaultMemStore
Tests run: 3, Failures: 0, Errors: 0, Skipped: 0, Time elapsed: 133.068 sec - in org.apache.hadoop.hbase.regionserver.throttle.TestFlushWithThroughputController
Running org.apache.hadoop.hbase.regionserver.TestRegionServerMetrics
Tests run: 3, Failures: 0, Errors: 0, Skipped: 0, Time elapsed: 63.872 sec - in org.apache.hadoop.hbase.regionserver.TestFSErrorsExposed
Running org.apache.hadoop.hbase.regionserver.TestGetClosestAtOrBefore
Tests run: 23, Failures: 0, Errors: 0, Skipped: 0, Time elapsed: 55.782 sec - in org.apache.hadoop.hbase.regionserver.TestDefaultMemStore
Tests run: 3, Failures: 0, Errors: 0, Skipped: 0, Time elapsed: 6.727 sec - in org.apache.hadoop.hbase.regionserver.TestGetClosestAtOrBefore
Running org.apache.hadoop.hbase.regionserver.TestRSKilledWhenInitializing
Running org.apache.hadoop.hbase.regionserver.TestReversibleScanners
Tests run: 12, Failures: 0, Errors: 0, Skipped: 0, Time elapsed: 32.91 sec - in org.apache.hadoop.hbase.regionserver.TestRegionServerMetrics
Running org.apache.hadoop.hbase.regionserver.TestRecoveredEdits
Tests run: 5, Failures: 0, Errors: 0, Skipped: 0, Time elapsed: 12.608 sec - in org.apache.hadoop.hbase.regionserver.TestReversibleScanners
Running org.apache.hadoop.hbase.regionserver.TestMobStoreCompaction
Tests run: 1, Failures: 0, Errors: 0, Skipped: 0, Time elapsed: 27.136 sec - in org.apache.hadoop.hbase.regionserver.TestRecoveredEdits
Tests run: 4, Failures: 0, Errors: 0, Skipped: 0, Time elapsed: 11.611 sec - in org.apache.hadoop.hbase.regionserver.TestMobStoreCompaction
Tests run: 1, Failures: 0, Errors: 0, Skipped: 0, Time elapsed: 42.236 sec - in org.apache.hadoop.hbase.regionserver.TestRSKilledWhenInitializing
Running org.apache.hadoop.hbase.regionserver.TestRegionServerNoMaster
Running org.apache.hadoop.hbase.regionserver.TestScannerRetriableFailure
Tests run: 4, Failures: 0, Errors: 0, Skipped: 0, Time elapsed: 17.924 sec - in org.apache.hadoop.hbase.regionserver.TestRegionServerNoMaster
Running org.apache.hadoop.hbase.regionserver.TestScannerWithBulkload
Running org.apache.hadoop.hbase.regionserver.TestClusterId
Running org.apache.hadoop.hbase.regionserver.TestRegionServerHostname
Tests run: 3, Failures: 0, Errors: 0, Skipped: 0, Time elapsed: 14.176 sec - in org.apache.hadoop.hbase.regionserver.TestScannerWithBulkload
Running org.apache.hadoop.hbase.regionserver.TestCompaction
Tests run: 1, Failures: 0, Errors: 0, Skipped: 0, Time elapsed: 37.404 sec - in org.apache.hadoop.hbase.regionserver.TestScannerRetriableFailure
Tests run: 2, Failures: 0, Errors: 0, Skipped: 0, Time elapsed: 158.588 sec - in org.apache.hadoop.hbase.regionserver.TestCorruptedRegionStoreFile
Running org.apache.hadoop.hbase.regionserver.TestPerColumnFamilyFlush
Running org.apache.hadoop.hbase.regionserver.TestSplitWalDataLoss
Tests run: 2, Failures: 0, Errors: 0, Skipped: 0, Time elapsed: 33.479 sec - in org.apache.hadoop.hbase.regionserver.TestRegionServerHostname
Tests run: 2, Failures: 0, Errors: 0, Skipped: 0, Time elapsed: 45.184 sec - in org.apache.hadoop.hbase.regionserver.TestClusterId
Tests run: 5, Failures: 0, Errors: 0, Skipped: 0, Time elapsed: 29.095 sec - in org.apache.hadoop.hbase.regionserver.TestCompaction
Running org.apache.hadoop.hbase.regionserver.compactions.TestFIFOCompactionPolicy
Tests run: 1, Failures: 0, Errors: 0, Skipped: 0, Time elapsed: 30.805 sec - in org.apache.hadoop.hbase.regionserver.TestSplitWalDataLoss
Running org.apache.hadoop.hbase.regionserver.TestServerCustomProtocol
Running org.apache.hadoop.hbase.regionserver.compactions.TestCompactedHFilesDischarger
Running org.apache.hadoop.hbase.regionserver.TestRegionFavoredNodes
Tests run: 3, Failures: 0, Errors: 0, Skipped: 0, Time elapsed: 7.983 sec - in org.apache.hadoop.hbase.regionserver.compactions.TestCompactedHFilesDischarger
Running org.apache.hadoop.hbase.regionserver.TestSeekOptimizations
Tests run: 1, Failures: 0, Errors: 0, Skipped: 0, Time elapsed: 24.654 sec - in org.apache.hadoop.hbase.regionserver.TestRegionFavoredNodes
Running org.apache.hadoop.hbase.regionserver.TestHRegion
Tests run: 6, Failures: 0, Errors: 0, Skipped: 0, Time elapsed: 16.774 sec - in org.apache.hadoop.hbase.regionserver.TestSeekOptimizations
Running org.apache.hadoop.hbase.regionserver.TestAtomicOperation
Tests run: 4, Failures: 0, Errors: 0, Skipped: 0, Time elapsed: 57.83 sec - in org.apache.hadoop.hbase.regionserver.compactions.TestFIFOCompactionPolicy
Tests run: 7, Failures: 0, Errors: 0, Skipped: 0, Time elapsed: 40.74 sec - in org.apache.hadoop.hbase.regionserver.TestServerCustomProtocol
Running org.apache.hadoop.hbase.regionserver.TestCompactionWithCoprocessor
Running org.apache.hadoop.hbase.regionserver.TestSplitTransactionOnCluster
Tests run: 5, Failures: 0, Errors: 0, Skipped: 0, Time elapsed: 32.105 sec - in org.apache.hadoop.hbase.regionserver.TestCompactionWithCoprocessor
Running org.apache.hadoop.hbase.regionserver.TestHRegionServerBulkLoad
Tests run: 8, Failures: 0, Errors: 0, Skipped: 0, Time elapsed: 70.13 sec - in org.apache.hadoop.hbase.regionserver.TestAtomicOperation
Tests run: 6, Failures: 0, Errors: 0, Skipped: 1, Time elapsed: 147.751 sec - in org.apache.hadoop.hbase.regionserver.TestPerColumnFamilyFlush
Running org.apache.hadoop.hbase.regionserver.TestRemoveRegionMetrics
Running org.apache.hadoop.hbase.regionserver.TestScannerHeartbeatMessages
Tests run: 1, Failures: 0, Errors: 0, Skipped: 0, Time elapsed: 27.483 sec - in org.apache.hadoop.hbase.regionserver.TestScannerHeartbeatMessages
Tests run: 15, Failures: 0, Errors: 0, Skipped: 0, Time elapsed: 114.627 sec - in org.apache.hadoop.hbase.regionserver.TestSplitTransactionOnCluster
Tests run: 2, Failures: 0, Errors: 0, Skipped: 0, Time elapsed: 110.17 sec - in org.apache.hadoop.hbase.regionserver.TestHRegionServerBulkLoad
Tests run: 102, Failures: 0, Errors: 0, Skipped: 0, Time elapsed: 174.354 sec - in org.apache.hadoop.hbase.regionserver.TestHRegion
Running org.apache.hadoop.hbase.TestRegionRebalancing
Running org.apache.hadoop.hbase.regionserver.TestRegionServerOnlineConfigChange
Tests run: 2, Failures: 0, Errors: 0, Skipped: 0, Time elapsed: 1.273 sec - in org.apache.hadoop.hbase.regionserver.TestRegionServerOnlineConfigChange
Running org.apache.hadoop.hbase.regionserver.TestEndToEndSplitTransaction
Running org.apache.hadoop.hbase.regionserver.TestEncryptionRandomKeying
Tests run: 1, Failures: 0, Errors: 0, Skipped: 0, Time elapsed: 2.408 sec - in org.apache.hadoop.hbase.regionserver.TestEncryptionRandomKeying
Tests run: 2, Failures: 0, Errors: 0, Skipped: 0, Time elapsed: 25.471 sec - in org.apache.hadoop.hbase.regionserver.TestEndToEndSplitTransaction
Running org.apache.hadoop.hbase.quotas.TestQuotaThrottle
Running org.apache.hadoop.hbase.quotas.TestQuotaAdmin
Tests run: 3, Failures: 0, Errors: 0, Skipped: 0, Time elapsed: 6.247 sec - in org.apache.hadoop.hbase.quotas.TestQuotaAdmin
Running org.apache.hadoop.hbase.io.encoding.TestEncodedSeekers
Running org.apache.hadoop.hbase.quotas.TestQuotaTableUtil
Tests run: 3, Failures: 0, Errors: 0, Skipped: 0, Time elapsed: 3.033 sec - in org.apache.hadoop.hbase.quotas.TestQuotaTableUtil
Running org.apache.hadoop.hbase.io.encoding.TestDataBlockEncoders
Tests run: 2, Failures: 0, Errors: 0, Skipped: 0, Time elapsed: 67.942 sec - in org.apache.hadoop.hbase.TestRegionRebalancing
Tests run: 12, Failures: 0, Errors: 0, Skipped: 0, Time elapsed: 39.652 sec - in org.apache.hadoop.hbase.quotas.TestQuotaThrottle
Running org.apache.hadoop.hbase.io.encoding.TestLoadAndSwitchEncodeOnDisk
Tests run: 1, Failures: 0, Errors: 0, Skipped: 0, Time elapsed: 162.039 sec - in org.apache.hadoop.hbase.regionserver.TestRemoveRegionMetrics
Running org.apache.hadoop.hbase.io.encoding.TestChangingEncoding
Running org.apache.hadoop.hbase.io.encoding.TestBufferedDataBlockEncoder
Tests run: 2, Failures: 0, Errors: 0, Skipped: 0, Time elapsed: 31.349 sec - in org.apache.hadoop.hbase.io.encoding.TestBufferedDataBlockEncoder
Tests run: 1, Failures: 0, Errors: 0, Skipped: 0, Time elapsed: 55.045 sec - in org.apache.hadoop.hbase.io.encoding.TestLoadAndSwitchEncodeOnDisk
Running org.apache.hadoop.hbase.io.hfile.TestCacheOnWrite
Running org.apache.hadoop.hbase.io.hfile.TestSeekBeforeWithInlineBlocks
Tests run: 1, Failures: 0, Errors: 0, Skipped: 0, Time elapsed: 24.25 sec - in org.apache.hadoop.hbase.io.hfile.TestSeekBeforeWithInlineBlocks
Running org.apache.hadoop.hbase.io.hfile.TestCacheConfig
Tests run: 6, Failures: 0, Errors: 0, Skipped: 0, Time elapsed: 4.521 sec - in org.apache.hadoop.hbase.io.hfile.TestCacheConfig
Running org.apache.hadoop.hbase.io.hfile.TestHFileSeek
Tests run: 1, Failures: 0, Errors: 0, Skipped: 0, Time elapsed: 5.482 sec - in org.apache.hadoop.hbase.io.hfile.TestHFileSeek
Running org.apache.hadoop.hbase.io.hfile.TestHFileBlock
Tests run: 3, Failures: 0, Errors: 0, Skipped: 0, Time elapsed: 163.607 sec - in org.apache.hadoop.hbase.io.encoding.TestChangingEncoding
Tests run: 56, Failures: 0, Errors: 0, Skipped: 0, Time elapsed: 190.339 sec - in org.apache.hadoop.hbase.io.encoding.TestDataBlockEncoders
Running org.apache.hadoop.hbase.io.hfile.TestForceCacheImportantBlocks
Running org.apache.hadoop.hbase.io.hfile.TestScannerFromBucketCache
Tests run: 4, Failures: 0, Errors: 0, Skipped: 0, Time elapsed: 12.757 sec - in org.apache.hadoop.hbase.io.hfile.TestScannerFromBucketCache
Running org.apache.hadoop.hbase.io.hfile.TestScannerSelectionUsingTTL
Tests run: 28, Failures: 0, Errors: 0, Skipped: 0, Time elapsed: 106.719 sec - in org.apache.hadoop.hbase.io.hfile.TestHFileBlock
Tests run: 2, Failures: 0, Errors: 0, Skipped: 0, Time elapsed: 52.765 sec - in org.apache.hadoop.hbase.io.hfile.TestForceCacheImportantBlocks
Running org.apache.hadoop.hbase.io.hfile.TestHFileBlockIndex
Running org.apache.hadoop.hbase.io.TestFileLink
Tests run: 20, Failures: 0, Errors: 0, Skipped: 0, Time elapsed: 281.254 sec - in org.apache.hadoop.hbase.io.encoding.TestEncodedSeekers
Tests run: 10, Failures: 0, Errors: 0, Skipped: 0, Time elapsed: 26.865 sec - in org.apache.hadoop.hbase.io.hfile.TestHFileBlockIndex
Tests run: 5, Failures: 0, Errors: 0, Skipped: 0, Time elapsed: 35.421 sec - in org.apache.hadoop.hbase.io.TestFileLink
Tests run: 6, Failures: 0, Errors: 0, Skipped: 0, Time elapsed: 69.552 sec - in org.apache.hadoop.hbase.io.hfile.TestScannerSelectionUsingTTL
Running org.apache.hadoop.hbase.security.access.TestAccessController
Running org.apache.hadoop.hbase.security.access.TestTablePermissions
Running org.apache.hadoop.hbase.security.access.TestAccessController3
Running org.apache.hadoop.hbase.security.access.TestCellACLs
Tests run: 1, Failures: 0, Errors: 0, Skipped: 0, Time elapsed: 7.489 sec - in org.apache.hadoop.hbase.security.access.TestAccessController3
Tests run: 7, Failures: 0, Errors: 0, Skipped: 0, Time elapsed: 23.181 sec - in org.apache.hadoop.hbase.security.access.TestTablePermissions
Tests run: 2, Failures: 0, Errors: 0, Skipped: 0, Time elapsed: 16.463 sec - in org.apache.hadoop.hbase.security.access.TestCellACLs
Running org.apache.hadoop.hbase.security.access.TestAccessControlFilter
Tests run: 1, Failures: 0, Errors: 0, Skipped: 0, Time elapsed: 5.37 sec - in org.apache.hadoop.hbase.security.access.TestAccessControlFilter
Running org.apache.hadoop.hbase.security.access.TestNamespaceCommands
Running org.apache.hadoop.hbase.security.access.TestCellACLWithMultipleVersions
Tests run: 7, Failures: 0, Errors: 0, Skipped: 0, Time elapsed: 11.202 sec - in org.apache.hadoop.hbase.security.access.TestNamespaceCommands
Running org.apache.hadoop.hbase.security.access.TestAccessController2
Tests run: 58, Failures: 0, Errors: 0, Skipped: 0, Time elapsed: 90.083 sec - in org.apache.hadoop.hbase.security.access.TestAccessController
Running org.apache.hadoop.hbase.security.access.TestZKPermissionsWatcher
Tests run: 1, Failures: 0, Errors: 0, Skipped: 0, Time elapsed: 4.182 sec - in org.apache.hadoop.hbase.security.access.TestZKPermissionsWatcher
Running org.apache.hadoop.hbase.security.access.TestWithDisabledAuthorization
Tests run: 8, Failures: 0, Errors: 0, Skipped: 0, Time elapsed: 52.86 sec - in org.apache.hadoop.hbase.security.access.TestCellACLWithMultipleVersions
Running org.apache.hadoop.hbase.security.access.TestScanEarlyTermination
Tests run: 72, Failures: 0, Errors: 0, Skipped: 0, Time elapsed: 340.468 sec - in org.apache.hadoop.hbase.io.hfile.TestCacheOnWrite
Tests run: 1, Failures: 0, Errors: 0, Skipped: 0, Time elapsed: 8.906 sec - in org.apache.hadoop.hbase.security.access.TestScanEarlyTermination
Tests run: 6, Failures: 0, Errors: 0, Skipped: 0, Time elapsed: 53.12 sec - in org.apache.hadoop.hbase.security.access.TestAccessController2
Running org.apache.hadoop.hbase.security.visibility.TestVisibilityLablesWithGroups
Tests run: 1, Failures: 0, Errors: 0, Skipped: 0, Time elapsed: 4.206 sec - in org.apache.hadoop.hbase.security.visibility.TestVisibilityLablesWithGroups
Running org.apache.hadoop.hbase.security.visibility.TestVisibilityLabelsWithDeletes
Running org.apache.hadoop.hbase.security.visibility.TestVisibilityLabelsWithDefaultVisLabelService
Tests run: 6, Failures: 0, Errors: 0, Skipped: 0, Time elapsed: 43.13 sec - in org.apache.hadoop.hbase.security.access.TestWithDisabledAuthorization
Running org.apache.hadoop.hbase.security.visibility.TestVisibilityLabelsWithCustomVisLabService
Running org.apache.hadoop.hbase.security.visibility.TestDefaultScanLabelGeneratorStack
Tests run: 1, Failures: 0, Errors: 0, Skipped: 0, Time elapsed: 4.215 sec - in org.apache.hadoop.hbase.security.visibility.TestDefaultScanLabelGeneratorStack
Running org.apache.hadoop.hbase.security.visibility.TestVisibilityWithCheckAuths
Tests run: 2, Failures: 0, Errors: 0, Skipped: 0, Time elapsed: 6.266 sec - in org.apache.hadoop.hbase.security.visibility.TestVisibilityWithCheckAuths
Tests run: 21, Failures: 0, Errors: 0, Skipped: 0, Time elapsed: 36.132 sec - in org.apache.hadoop.hbase.security.visibility.TestVisibilityLabelsWithCustomVisLabService
Tests run: 26, Failures: 0, Errors: 0, Skipped: 0, Time elapsed: 41.884 sec - in org.apache.hadoop.hbase.security.visibility.TestVisibilityLabelsWithDefaultVisLabelService
Running org.apache.hadoop.hbase.security.visibility.TestVisibilityLabelsReplication
Running org.apache.hadoop.hbase.security.visibility.TestVisibilityLabelsOpWithDifferentUsersNoACL
Tests run: 1, Failures: 0, Errors: 0, Skipped: 0, Time elapsed: 3.383 sec - in org.apache.hadoop.hbase.security.visibility.TestVisibilityLabelsOpWithDifferentUsersNoACL
Running org.apache.hadoop.hbase.security.visibility.TestVisibilityLabelReplicationWithExpAsString
Running org.apache.hadoop.hbase.security.visibility.TestVisibilityLabelsWithSLGStack
Tests run: 1, Failures: 0, Errors: 0, Skipped: 0, Time elapsed: 3.585 sec - in org.apache.hadoop.hbase.security.visibility.TestVisibilityLabelsWithSLGStack
Running org.apache.hadoop.hbase.security.visibility.TestEnforcingScanLabelGenerator
Tests run: 1, Failures: 0, Errors: 0, Skipped: 0, Time elapsed: 3.667 sec - in org.apache.hadoop.hbase.security.visibility.TestEnforcingScanLabelGenerator
Tests run: 1, Failures: 0, Errors: 0, Skipped: 0, Time elapsed: 37.307 sec - in org.apache.hadoop.hbase.security.visibility.TestVisibilityLabelsReplication
Running org.apache.hadoop.hbase.security.visibility.TestVisibilityLabelsWithACL
Tests run: 1, Failures: 0, Errors: 0, Skipped: 0, Time elapsed: 36.441 sec - in org.apache.hadoop.hbase.security.visibility.TestVisibilityLabelReplicationWithExpAsString
Running org.apache.hadoop.hbase.security.token.TestZKSecretWatcher
Running org.apache.hadoop.hbase.security.visibility.TestWithDisabledAuthorization
Tests run: 2, Failures: 0, Errors: 0, Skipped: 0, Time elapsed: 4.655 sec - in org.apache.hadoop.hbase.security.visibility.TestWithDisabledAuthorization
Tests run: 5, Failures: 0, Errors: 0, Skipped: 0, Time elapsed: 13.312 sec - in org.apache.hadoop.hbase.security.visibility.TestVisibilityLabelsWithACL
Running org.apache.hadoop.hbase.security.token.TestTokenAuthentication
Tests run: 3, Failures: 0, Errors: 0, Skipped: 0, Time elapsed: 1.421 sec - in org.apache.hadoop.hbase.security.token.TestTokenAuthentication
Running org.apache.hadoop.hbase.TestHBaseOnOtherDfsCluster
Tests run: 44, Failures: 0, Errors: 0, Skipped: 0, Time elapsed: 110.69 sec - in org.apache.hadoop.hbase.security.visibility.TestVisibilityLabelsWithDeletes
Tests run: 1, Failures: 0, Errors: 0, Skipped: 0, Time elapsed: 13.483 sec - in org.apache.hadoop.hbase.security.token.TestZKSecretWatcher
Tests run: 1, Failures: 0, Errors: 0, Skipped: 0, Time elapsed: 22.722 sec - in org.apache.hadoop.hbase.TestHBaseOnOtherDfsCluster
Running org.apache.hadoop.hbase.security.token.TestGenerateDelegationToken
Tests run: 1, Failures: 0, Errors: 0, Skipped: 0, Time elapsed: 2.521 sec - in org.apache.hadoop.hbase.security.token.TestGenerateDelegationToken

Results :

Failed tests: 
  TestBlockEvictionFromClient.testReverseScanWithCompaction:857->testScanWithCompactionInternals:922
expected:<3> but was:<2>

Tests run: 2497, Failures: 1, Errors: 0, Skipped: 36

[INFO] ------------------------------------------------------------------------
[INFO] Reactor Summary:
[INFO] 
[INFO] Apache HBase ...................................... SUCCESS [  7.647 s]
[INFO] Apache HBase - Checkstyle ......................... SUCCESS [  1.475 s]
[INFO] Apache HBase - Resource Bundle .................... SUCCESS [  0.704 s]
[INFO] Apache HBase - Annotations ........................ SUCCESS [  0.881 s]
[INFO] Apache HBase - Protocol ........................... SUCCESS [  6.160 s]
[INFO] Apache HBase - Common ............................. SUCCESS [03:07 min]
[INFO] Apache HBase - Procedure .......................... SUCCESS [04:19 min]
[INFO] Apache HBase - Client ............................. SUCCESS [01:32 min]
[INFO] Apache HBase - Hadoop Compatibility ............... SUCCESS [ 11.797 s]
[INFO] Apache HBase - Hadoop Two Compatibility ........... SUCCESS [ 21.726 s]
[INFO] Apache HBase - Prefix Tree ........................ SUCCESS [ 28.391 s]
[INFO] Apache HBase - Server ............................. FAILURE [  02:20 h]
[INFO] Apache HBase - Testing Util ....................... SKIPPED
[INFO] Apache HBase - Thrift ............................. SKIPPED
[INFO] Apache HBase - Shell .............................. SKIPPED
[INFO] Apache HBase - Integration Tests .................. SKIPPED
[INFO] Apache HBase - Examples ........................... SKIPPED
[INFO] Apache HBase - Rest ............................... SKIPPED
[INFO] Apache HBase - External Block Cache ............... SKIPPED
[INFO] Apache HBase - Spark .............................. SKIPPED
[INFO] Apache HBase - Assembly ........................... SKIPPED
[INFO] Apache HBase - Shaded ............................. SKIPPED
[INFO] Apache HBase - Shaded - Client .................... SKIPPED
[INFO] Apache HBase - Shaded - Server .................... SKIPPED
[INFO] ------------------------------------------------------------------------
[INFO] BUILD FAILURE
[INFO] ------------------------------------------------------------------------
[INFO] Total time: 02:31 h
[INFO] Finished at: 2016-02-18T04:43:33+00:00
[INFO] Final Memory: 66M/763M
[INFO] ------------------------------------------------------------------------
[ERROR] Failed to execute goal org.apache.maven.plugins:maven-surefire-plugin:2.18.1:test
(secondPartTestsExecution) on project hbase-server: There was a timeout or other error in
the fork -> [Help 1]
[ERROR] 
[ERROR] To see the full stack trace of the errors, re-run Maven with the -e switch.
[ERROR] Re-run Maven using the -X switch to enable full debug logging.
[ERROR] 
[ERROR] For more information about the errors and possible solutions, please read the following
articles:
[ERROR] [Help 1] http://cwiki.apache.org/confluence/display/MAVEN/MojoFailureException
[ERROR] 
[ERROR] After correcting the problems, you can resume the build with the command
[ERROR]   mvn <goals> -rf :hbase-server
Build step 'Invoke top-level Maven targets' marked build as failure
Performing Post build task...
Match found for :.* : True
Logical operation result is TRUE
Running script  : # Run zombie detector script
./dev-support/zombie-detector.sh --jenkins ${BUILD_ID}
[yahoo-not-h2] $ /bin/bash -xe /tmp/hudson7124488991477914443.sh
+ ./dev-support/zombie-detector.sh --jenkins 716
Thu Feb 18 04:43:35 UTC 2016 We're ok: there is no zombie test


    {color:green}+1 zombies{color}. No zombie tests found running at the end of the build.
POST BUILD TASK : SUCCESS
END OF POST BUILD TASK : 0
Archiving artifacts
Recording test results
[FINDBUGS] Skipping publisher since build result is FAILURE
[CHECKSTYLE] Skipping publisher since build result is FAILURE

Mime
View raw message