hbase-builds mailing list archives

Site index · List index
Message view « Date » · « Thread »
Top « Date » · « Thread »
From gmcdon...@apache.org
Subject Build failed in Jenkins: hbase #1074
Date Sat, 20 Feb 2016 20:08:14 GMT
See <https://analysis.apache.org/jenkins/job/hbase/1074/changes>

Changes:

[mstanleyjones] HBASE-15250 Fix old URLs that currently get redirected

[mstanleyjones] HBASE-13883 Clarify the MemStore Flush section in the RefGuide

[mstanleyjones] HBASE-15289 Add details about how to get usage instructions for Import

[chenheng] HBASE-15259 WALEdits under replay will also be replicated

------------------------------------------
[...truncated 838 lines...]
[INFO] --- maven-remote-resources-plugin:1.5:process (default) @ hbase-archetypes ---
[INFO] 
[INFO] --- findbugs-maven-plugin:3.0.0:findbugs (default) @ hbase-archetypes ---
[INFO] 
[INFO] --- maven-install-plugin:2.3.1:install (default-install) @ hbase-archetypes ---
[INFO] Installing <https://analysis.apache.org/jenkins/job/hbase/ws/hbase-archetypes/pom.xml>
to /x1/jenkins/jenkins-master/jenkins-home/maven-repositories/0/org/apache/hbase/hbase-archetypes/2.0.0-SNAPSHOT/hbase-archetypes-2.0.0-SNAPSHOT.pom
[JENKINS] Archiving disabled
[INFO]                                                                         
[INFO] ------------------------------------------------------------------------
[INFO] Skipping Apache HBase - Exemplar for hbase-client archetype
[INFO] This project has been banned from the build due to previous failures.
[INFO] ------------------------------------------------------------------------
[INFO]                                                                         
[INFO] ------------------------------------------------------------------------
[INFO] Building Apache HBase - Archetype builder 2.0.0-SNAPSHOT
[INFO] ------------------------------------------------------------------------
[INFO] 
[INFO] --- maven-clean-plugin:2.5:clean (default-clean) @ hbase-archetype-builder ---
[INFO] Deleting <https://analysis.apache.org/jenkins/job/hbase/ws/hbase-archetypes/hbase-archetype-builder/target>
[INFO] 
[INFO] --- maven-enforcer-plugin:1.0.1:enforce (enforce) @ hbase-archetype-builder ---
[INFO] 
[INFO] --- buildnumber-maven-plugin:1.3:create-timestamp (default) @ hbase-archetype-builder
---
[INFO] 
[INFO] --- maven-remote-resources-plugin:1.5:process (default) @ hbase-archetype-builder ---
[INFO] 
[INFO] --- maven-resources-plugin:2.7:copy-resources (hbase-client__copy-src-to-build-archetype-subdir)
@ hbase-archetype-builder ---
[INFO] Using 'UTF-8' encoding to copy filtered resources.
[INFO] Copying 4 resources
[INFO] 
[INFO] --- maven-resources-plugin:2.7:copy-resources (hbase-client__copy-pom-to-temp-for-xslt-processing)
@ hbase-archetype-builder ---
[INFO] Using 'UTF-8' encoding to copy filtered resources.
[INFO] Copying 1 resource
[INFO] 
[INFO] --- xml-maven-plugin:1.0.1:transform (modify-exemplar-pom-files-via-xslt) @ hbase-archetype-builder
---
Warning:  org.apache.xerces.parsers.SAXParser: Feature 'http://javax.xml.XMLConstants/feature/secure-processing'
is not recognized.
Warning:  org.apache.xerces.parsers.SAXParser: Property 'http://javax.xml.XMLConstants/property/accessExternalDTD'
is not recognized.
Warning:  org.apache.xerces.parsers.SAXParser: Property 'http://www.oracle.com/xml/jaxp/properties/entityExpansionLimit'
is not recognized.
[INFO] Transforming file: <https://analysis.apache.org/jenkins/job/hbase/ws/hbase-archetypes/hbase-archetype-builder/../hbase-client-project/target/temp/pom.xml>
[INFO] Transformed 1 file(s).
[INFO] 
[INFO] --- exec-maven-plugin:1.4.0:exec (make-scripts-executable) @ hbase-archetype-builder
---
[INFO] 
[INFO] --- exec-maven-plugin:1.4.0:exec (run-createArchetypes-script) @ hbase-archetype-builder
---
[INFO] Scanning for projects...
[INFO] 
[INFO] Using the builder org.apache.maven.lifecycle.internal.builder.singlethreaded.SingleThreadedBuilder
with a thread count of 1
[INFO]                                                                         
[INFO] ------------------------------------------------------------------------
[INFO] Building Apache HBase - Exemplar for hbase-client archetype 2.0.0-SNAPSHOT
[INFO] ------------------------------------------------------------------------
[INFO] 
[INFO] >>> maven-archetype-plugin:2.4:create-from-project (default-cli) @ hbase-client-project
>>>
[INFO] 
[INFO] <<< maven-archetype-plugin:2.4:create-from-project (default-cli) @ hbase-client-project
<<<
[INFO] 
[INFO] --- maven-archetype-plugin:2.4:create-from-project (default-cli) @ hbase-client-project
---
[INFO] Setting default groupId: org.apache.hbase
[INFO] Setting default artifactId: hbase-client-project
[INFO] Setting default version: 2.0.0-SNAPSHOT
[INFO] Setting default package: org.apache.hbase
[INFO] Scanning for projects...
[INFO] 
[INFO] Using the builder org.apache.maven.lifecycle.internal.builder.singlethreaded.SingleThreadedBuilder
with a thread count of 1
[INFO]                                                                         
[INFO] ------------------------------------------------------------------------
[INFO] Building hbase-client-project-archetype 2.0.0-SNAPSHOT
[INFO] ------------------------------------------------------------------------
[INFO] 
[INFO] --- maven-resources-plugin:2.7:resources (default-resources) @ hbase-client-project-archetype
---
[WARNING] Using platform encoding (UTF-8 actually) to copy filtered resources, i.e. build
is platform dependent!
[INFO] Copying 9 resources
[INFO] 
[INFO] --- maven-resources-plugin:2.7:testResources (default-testResources) @ hbase-client-project-archetype
---
[WARNING] Using platform encoding (UTF-8 actually) to copy filtered resources, i.e. build
is platform dependent!
[INFO] Copying 2 resources
[INFO] 
[INFO] --- maven-archetype-plugin:2.4:jar (default-jar) @ hbase-client-project-archetype ---
[INFO] Building archetype jar: <https://analysis.apache.org/jenkins/job/hbase/ws/hbase-archetypes/hbase-client-project/target/build-archetype/target/generated-sources/archetype/target/hbase-client-project-archetype-2.0.0-SNAPSHOT>
[INFO] ------------------------------------------------------------------------
[INFO] BUILD SUCCESS
[INFO] ------------------------------------------------------------------------
[INFO] Total time: 12.090 s
[INFO] Finished at: 2016-02-20T20:07:59+00:00
[INFO] Final Memory: 16M/620M
[INFO] ------------------------------------------------------------------------
[INFO] Archetype project created in <https://analysis.apache.org/jenkins/job/hbase/ws/hbase-archetypes/hbase-client-project/target/build-archetype/target/generated-sources/archetype>
[INFO] ------------------------------------------------------------------------
[INFO] BUILD SUCCESS
[INFO] ------------------------------------------------------------------------
[INFO] Total time: 32.940 s
[INFO] Finished at: 2016-02-20T20:07:59+00:00
[INFO] Final Memory: 15M/491M
[INFO] ------------------------------------------------------------------------
[INFO] 
[INFO] --- maven-resources-plugin:2.7:copy-resources (hbase-client-ARCHETYPE__copy-pom-to-temp-for-xslt-processing)
@ hbase-archetype-builder ---
[INFO] Using 'UTF-8' encoding to copy filtered resources.
[INFO] Copying 1 resource
[INFO] 
[INFO] --- xml-maven-plugin:1.0.1:transform (modify-archetype-pom-files-via-xslt) @ hbase-archetype-builder
---
Warning:  org.apache.xerces.parsers.SAXParser: Feature 'http://javax.xml.XMLConstants/feature/secure-processing'
is not recognized.
Warning:  org.apache.xerces.parsers.SAXParser: Property 'http://javax.xml.XMLConstants/property/accessExternalDTD'
is not recognized.
Warning:  org.apache.xerces.parsers.SAXParser: Property 'http://www.oracle.com/xml/jaxp/properties/entityExpansionLimit'
is not recognized.
[INFO] Transforming file: <https://analysis.apache.org/jenkins/job/hbase/ws/hbase-archetypes/hbase-archetype-builder/../hbase-client-project/target/temp-arch/pom.xml>
[INFO] Transformed 1 file(s).
[INFO] 
[INFO] --- maven-install-plugin:2.3.1:install (default-install) @ hbase-archetype-builder
---
[INFO] Installing <https://analysis.apache.org/jenkins/job/hbase/ws/hbase-archetypes/hbase-archetype-builder/pom.xml>
to /x1/jenkins/jenkins-master/jenkins-home/maven-repositories/0/org/apache/hbase/hbase-archetype-builder/2.0.0-SNAPSHOT/hbase-archetype-builder-2.0.0-SNAPSHOT.pom
[INFO] 
[INFO] --- exec-maven-plugin:1.4.0:exec (run-installArchetypes-script) @ hbase-archetype-builder
---
[INFO] Scanning for projects...
[INFO] 
[INFO] Using the builder org.apache.maven.lifecycle.internal.builder.singlethreaded.SingleThreadedBuilder
with a thread count of 1
[INFO]                                                                         
[INFO] ------------------------------------------------------------------------
[INFO] Building hbase-client-project-archetype 2.0.0-SNAPSHOT
[INFO] ------------------------------------------------------------------------
[INFO] 
[INFO] --- maven-resources-plugin:2.7:resources (default-resources) @ hbase-client-project-archetype
---
[INFO] Using 'UTF-8' encoding to copy filtered resources.
[INFO] Copying 9 resources
[INFO] 
[INFO] --- maven-resources-plugin:2.7:testResources (default-testResources) @ hbase-client-project-archetype
---
[INFO] Using 'UTF-8' encoding to copy filtered resources.
[INFO] Copying 2 resources
[INFO] 
[INFO] --- maven-archetype-plugin:2.4:jar (default-jar) @ hbase-client-project-archetype ---
[INFO] Building archetype jar: <https://analysis.apache.org/jenkins/job/hbase/ws/hbase-archetypes/hbase-client-project/target/build-archetype/target/generated-sources/archetype/target/hbase-client-project-archetype-2.0.0-SNAPSHOT>
[INFO] 
[INFO] --- maven-archetype-plugin:2.4:integration-test (default-integration-test) @ hbase-client-project-archetype
---
[INFO] Processing Archetype IT project: basic
[INFO] ----------------------------------------------------------------------------
[INFO] Using following parameters for creating project from Archetype: hbase-client-project-archetype:2.0.0-SNAPSHOT
[INFO] ----------------------------------------------------------------------------
[INFO] Parameter: groupId, Value: archetype.it
[INFO] Parameter: artifactId, Value: basic
[INFO] Parameter: version, Value: 0.1-SNAPSHOT
[INFO] Parameter: package, Value: it.pkg
[INFO] Parameter: packageInPathFormat, Value: it/pkg
[INFO] Parameter: version, Value: 0.1-SNAPSHOT
[INFO] Parameter: package, Value: it.pkg
[INFO] Parameter: groupId, Value: archetype.it
[INFO] Parameter: artifactId, Value: basic
[INFO] project created from Archetype in dir: <https://analysis.apache.org/jenkins/job/hbase/ws/hbase-archetypes/hbase-client-project/target/build-archetype/target/generated-sources/archetype/target/test-classes/projects/basic/project/basic>
[INFO] 
[INFO] --- maven-install-plugin:2.5.2:install (default-install) @ hbase-client-project-archetype
---
[INFO] Installing <https://analysis.apache.org/jenkins/job/hbase/ws/hbase-archetypes/hbase-client-project/target/build-archetype/target/generated-sources/archetype/target/hbase-client-project-archetype-2.0.0-SNAPSHOT.jar>
to /x1/jenkins/mvn-repo/org/apache/hbase/hbase-client-project-archetype/2.0.0-SNAPSHOT/hbase-client-project-archetype-2.0.0-SNAPSHOT.jar
[INFO] Installing <https://analysis.apache.org/jenkins/job/hbase/ws/hbase-archetypes/hbase-client-project/target/build-archetype/target/generated-sources/archetype/pom.xml>
to /x1/jenkins/mvn-repo/org/apache/hbase/hbase-client-project-archetype/2.0.0-SNAPSHOT/hbase-client-project-archetype-2.0.0-SNAPSHOT.pom
[INFO] 
[INFO] --- maven-archetype-plugin:2.4:update-local-catalog (default-update-local-catalog)
@ hbase-client-project-archetype ---
[INFO] ------------------------------------------------------------------------
[INFO] BUILD SUCCESS
[INFO] ------------------------------------------------------------------------
[INFO] Total time: 4.648 s
[INFO] Finished at: 2016-02-20T20:08:07+00:00
[INFO] Final Memory: 17M/620M
[INFO] ------------------------------------------------------------------------
[JENKINS] Archiving disabled
[JENKINS] Archiving disabled
[JENKINS] Archiving disabled
[JENKINS] Archiving disabled
[JENKINS] Archiving disabled
[JENKINS] Archiving disabled
[JENKINS] Archiving disabled
[JENKINS] Archiving disabled
[JENKINS] Archiving disabled
[JENKINS] Archiving disabled
[JENKINS] Archiving disabled
[JENKINS] Archiving disabled
[JENKINS] Archiving disabled
[JENKINS] Archiving disabled
[JENKINS] Archiving disabled
[JENKINS] Archiving disabled
[JENKINS] Archiving disabled
[JENKINS] Archiving disabled
[JENKINS] Archiving disabled
[JENKINS] Archiving disabled
[JENKINS] Archiving disabled
[JENKINS] Archiving disabled
[JENKINS] Archiving disabled
[JENKINS] Archiving disabled
[JENKINS] Archiving disabled
[JENKINS] Archiving disabled
[JENKINS] Archiving disabled
[JENKINS] Archiving disabled
[INFO] ------------------------------------------------------------------------
[INFO] Reactor Summary:
[INFO] 
[INFO] Apache HBase ...................................... SUCCESS [ 41.004 s]
[INFO] Apache HBase - Checkstyle ......................... SUCCESS [  7.745 s]
[INFO] Apache HBase - Resource Bundle .................... SUCCESS [  2.038 s]
[INFO] Apache HBase - Annotations ........................ SUCCESS [  3.846 s]
[INFO] Apache HBase - Protocol ........................... SUCCESS [ 29.218 s]
[INFO] Apache HBase - Common ............................. SUCCESS [ 56.520 s]
[INFO] Apache HBase - Procedure .......................... SUCCESS [  6.695 s]
[INFO] Apache HBase - Client ............................. SUCCESS [ 19.967 s]
[INFO] Apache HBase - Hadoop Compatibility ............... SUCCESS [  4.858 s]
[INFO] Apache HBase - Hadoop Two Compatibility ........... SUCCESS [ 10.812 s]
[INFO] Apache HBase - Prefix Tree ........................ SUCCESS [ 16.726 s]
[INFO] Apache HBase - Server ............................. FAILURE [ 37.872 s]
[INFO] Apache HBase - Testing Util ....................... SKIPPED
[INFO] Apache HBase - Thrift ............................. SKIPPED
[INFO] Apache HBase - Shell .............................. SKIPPED
[INFO] Apache HBase - Integration Tests .................. SKIPPED
[INFO] Apache HBase - Examples ........................... SKIPPED
[INFO] Apache HBase - Rest ............................... SKIPPED
[INFO] Apache HBase - External Block Cache ............... SKIPPED
[INFO] Apache HBase - Spark .............................. SKIPPED
[INFO] Apache HBase - Assembly ........................... SKIPPED
[INFO] Apache HBase - Shaded ............................. SUCCESS [  1.355 s]
[INFO] Apache HBase - Shaded - Client .................... SUCCESS [  7.110 s]
[INFO] Apache HBase - Shaded - Server .................... SKIPPED
[INFO] Apache HBase - Archetypes ......................... SUCCESS [  0.557 s]
[INFO] Apache HBase - Exemplar for hbase-client archetype  SKIPPED
[INFO] Apache HBase - Archetype builder .................. SUCCESS [ 51.305 s]
[INFO] ------------------------------------------------------------------------
[INFO] BUILD FAILURE
[INFO] ------------------------------------------------------------------------
[INFO] Total time: 05:13 min
[INFO] Finished at: 2016-02-20T20:08:10+00:00
[INFO] Final Memory: 101M/578M
[INFO] ------------------------------------------------------------------------
Waiting for Jenkins to finish collecting data
[ERROR] Failed to execute goal org.apache.maven.plugins:maven-compiler-plugin:3.2:compile
(default-compile) on project hbase-server: Compilation failure: Compilation failure:
[ERROR] <https://analysis.apache.org/jenkins/job/hbase/ws/hbase-server/src/main/java/org/apache/hadoop/hbase/util/CompoundBloomFilter.java>:[49,26]
org.apache.hadoop.hbase.io.hfile.HFileBlockIndex.BlockIndexReader is not public in org.apache.hadoop.hbase.io.hfile.HFileBlockIndex;
cannot be accessed from outside package
[ERROR] <https://analysis.apache.org/jenkins/job/hbase/ws/hbase-server/src/main/java/org/apache/hadoop/hbase/util/CompoundBloomFilter.java>:[43,8]
org.apache.hadoop.hbase.util.CompoundBloomFilter is not abstract and does not override abstract
method contains(byte[],int,int,org.apache.hadoop.hbase.nio.ByteBuff) in org.apache.hadoop.hbase.util.BloomFilter
[ERROR] <https://analysis.apache.org/jenkins/job/hbase/ws/hbase-server/src/main/java/org/apache/hadoop/hbase/util/CompoundBloomFilter.java>:[87,32]
org.apache.hadoop.hbase.io.hfile.HFileBlockIndex.BlockIndexReader is not public in org.apache.hadoop.hbase.io.hfile.HFileBlockIndex;
cannot be accessed from outside package
[ERROR] <https://analysis.apache.org/jenkins/job/hbase/ws/hbase-server/src/main/java/org/apache/hadoop/hbase/util/CompoundBloomFilter.java>:[91,3]
method does not override or implement a method from a supertype
[ERROR] <https://analysis.apache.org/jenkins/job/hbase/ws/hbase-server/src/main/java/org/apache/hadoop/hbase/util/CompoundBloomFilter.java>:[119,57]
incompatible types
[ERROR] required: java.nio.ByteBuffer
[ERROR] found:    org.apache.hadoop.hbase.nio.ByteBuff
[ERROR] <https://analysis.apache.org/jenkins/job/hbase/ws/hbase-server/src/main/java/org/apache/hadoop/hbase/util/CompoundBloomFilter.java>:[120,31]
method contains in class org.apache.hadoop.hbase.util.BloomFilterUtil cannot be applied to
given types;
[ERROR] required: byte[],int,int,org.apache.hadoop.hbase.nio.ByteBuff,int,int,org.apache.hadoop.hbase.util.Hash,int
[ERROR] found: byte[],int,int,java.nio.ByteBuffer,int,int,org.apache.hadoop.hbase.util.Hash,int
[ERROR] reason: actual argument java.nio.ByteBuffer cannot be converted to org.apache.hadoop.hbase.nio.ByteBuff
by method invocation conversion
[ERROR] <https://analysis.apache.org/jenkins/job/hbase/ws/hbase-server/src/main/java/org/apache/hadoop/hbase/util/CompoundBloomFilter.java>:[135,3]
method does not override or implement a method from a supertype
[ERROR] -> [Help 1]
[ERROR] 
[ERROR] To see the full stack trace of the errors, re-run Maven with the -e switch.
[ERROR] Re-run Maven using the -X switch to enable full debug logging.
[ERROR] 
[ERROR] For more information about the errors and possible solutions, please read the following
articles:
[ERROR] [Help 1] http://cwiki.apache.org/confluence/display/MAVEN/MojoFailureException
[ERROR] 
[ERROR] After correcting the problems, you can resume the build with the command
[ERROR]   mvn <goals> -rf :hbase-server
Sending e-mails to: builds@hbase.apache.org
channel stopped
Skipping sonar analysis due to bad build status FAILURE

Mime
View raw message