hbase-builds mailing list archives

Site index · List index
Message view « Date » · « Thread »
Top « Date » · « Thread »
From Apache Jenkins Server <jenk...@builds.apache.org>
Subject Build failed in Jenkins: HBase-Trunk_matrix » latest1.7,yahoo-not-h2 #723
Date Sat, 20 Feb 2016 03:49:23 GMT
See <https://builds.apache.org/job/HBase-Trunk_matrix/jdk=latest1.7,label=yahoo-not-h2/723/changes>

Changes:

[mstanleyjones] HBASE-15250 Fix old URLs that currently get redirected

[mstanleyjones] HBASE-13883 Clarify the MemStore Flush section in the RefGuide

[mstanleyjones] HBASE-15289 Add details about how to get usage instructions for Import

------------------------------------------
[...truncated 5231 lines...]
Running org.apache.hadoop.hbase.mob.compactions.TestMobCompactor
Tests run: 8, Failures: 0, Errors: 0, Skipped: 0, Time elapsed: 310.836 sec - in org.apache.hadoop.hbase.replication.regionserver.TestReplicationWALReaderManager
Running org.apache.hadoop.hbase.security.visibility.TestVisibilityLabelsWithSLGStack
Tests run: 1, Failures: 0, Errors: 0, Skipped: 0, Time elapsed: 4.281 sec - in org.apache.hadoop.hbase.security.visibility.TestVisibilityLabelsWithSLGStack
Running org.apache.hadoop.hbase.security.visibility.TestVisibilityLabelsReplication
Running org.apache.hadoop.hbase.security.visibility.TestVisibilityLabelsWithDeletes
Tests run: 1, Failures: 0, Errors: 0, Skipped: 0, Time elapsed: 32.556 sec - in org.apache.hadoop.hbase.security.visibility.TestVisibilityLabelReplicationWithExpAsString
Running org.apache.hadoop.hbase.security.visibility.TestEnforcingScanLabelGenerator
Tests run: 1, Failures: 0, Errors: 0, Skipped: 0, Time elapsed: 31.632 sec - in org.apache.hadoop.hbase.security.visibility.TestVisibilityLabelsReplication
Tests run: 1, Failures: 0, Errors: 0, Skipped: 0, Time elapsed: 4.223 sec - in org.apache.hadoop.hbase.security.visibility.TestEnforcingScanLabelGenerator
Running org.apache.hadoop.hbase.security.visibility.TestDefaultScanLabelGeneratorStack
Running org.apache.hadoop.hbase.security.visibility.TestVisibilityWithCheckAuths
Tests run: 1, Failures: 0, Errors: 0, Skipped: 0, Time elapsed: 4.141 sec - in org.apache.hadoop.hbase.security.visibility.TestDefaultScanLabelGeneratorStack
Tests run: 5, Failures: 0, Errors: 0, Skipped: 0, Time elapsed: 77.034 sec - in org.apache.hadoop.hbase.mob.compactions.TestMobCompactor
Tests run: 2, Failures: 0, Errors: 0, Skipped: 0, Time elapsed: 6.905 sec - in org.apache.hadoop.hbase.security.visibility.TestVisibilityWithCheckAuths
Tests run: 7, Failures: 0, Errors: 0, Skipped: 0, Time elapsed: 212.728 sec - in org.apache.hadoop.hbase.replication.TestMasterReplication
Running org.apache.hadoop.hbase.security.visibility.TestVisibilityLabelsOpWithDifferentUsersNoACL
Tests run: 1, Failures: 0, Errors: 0, Skipped: 0, Time elapsed: 1.991 sec - in org.apache.hadoop.hbase.security.visibility.TestVisibilityLabelsOpWithDifferentUsersNoACL
Running org.apache.hadoop.hbase.security.visibility.TestWithDisabledAuthorization
Running org.apache.hadoop.hbase.security.visibility.TestVisibilityLabelsWithDefaultVisLabelService
Tests run: 2, Failures: 0, Errors: 0, Skipped: 0, Time elapsed: 4.549 sec - in org.apache.hadoop.hbase.security.visibility.TestWithDisabledAuthorization
Running org.apache.hadoop.hbase.security.visibility.TestVisibilityLabelsWithACL
Running org.apache.hadoop.hbase.security.visibility.TestVisibilityLablesWithGroups
Tests run: 5, Failures: 0, Errors: 0, Skipped: 0, Time elapsed: 13.5 sec - in org.apache.hadoop.hbase.security.visibility.TestVisibilityLabelsWithACL
Tests run: 1, Failures: 0, Errors: 0, Skipped: 0, Time elapsed: 4.674 sec - in org.apache.hadoop.hbase.security.visibility.TestVisibilityLablesWithGroups
Running org.apache.hadoop.hbase.security.visibility.TestVisibilityLabelsWithCustomVisLabService
Running org.apache.hadoop.hbase.security.access.TestAccessController2
Running org.apache.hadoop.hbase.security.access.TestAccessController
Tests run: 26, Failures: 0, Errors: 0, Skipped: 0, Time elapsed: 55.68 sec - in org.apache.hadoop.hbase.security.visibility.TestVisibilityLabelsWithDefaultVisLabelService
Tests run: 21, Failures: 0, Errors: 0, Skipped: 0, Time elapsed: 48.519 sec - in org.apache.hadoop.hbase.security.visibility.TestVisibilityLabelsWithCustomVisLabService
Tests run: 44, Failures: 0, Errors: 0, Skipped: 0, Time elapsed: 150.64 sec - in org.apache.hadoop.hbase.security.visibility.TestVisibilityLabelsWithDeletes
Running org.apache.hadoop.hbase.security.access.TestTablePermissions
Running org.apache.hadoop.hbase.security.access.TestAccessControlFilter
Running org.apache.hadoop.hbase.security.access.TestCellACLs
Tests run: 1, Failures: 0, Errors: 0, Skipped: 0, Time elapsed: 4.701 sec - in org.apache.hadoop.hbase.security.access.TestAccessControlFilter
Tests run: 7, Failures: 0, Errors: 0, Skipped: 0, Time elapsed: 23.789 sec - in org.apache.hadoop.hbase.security.access.TestTablePermissions
Tests run: 2, Failures: 0, Errors: 0, Skipped: 0, Time elapsed: 18.738 sec - in org.apache.hadoop.hbase.security.access.TestCellACLs
Tests run: 6, Failures: 0, Errors: 0, Skipped: 0, Time elapsed: 77.002 sec - in org.apache.hadoop.hbase.security.access.TestAccessController2
Running org.apache.hadoop.hbase.security.access.TestNamespaceCommands
Running org.apache.hadoop.hbase.security.access.TestWithDisabledAuthorization
Running org.apache.hadoop.hbase.security.access.TestZKPermissionsWatcher
Tests run: 7, Failures: 0, Errors: 0, Skipped: 0, Time elapsed: 13.597 sec - in org.apache.hadoop.hbase.security.access.TestNamespaceCommands
Tests run: 1, Failures: 0, Errors: 0, Skipped: 0, Time elapsed: 3.815 sec - in org.apache.hadoop.hbase.security.access.TestZKPermissionsWatcher
Running org.apache.hadoop.hbase.security.access.TestScanEarlyTermination
Tests run: 1, Failures: 0, Errors: 0, Skipped: 0, Time elapsed: 8.421 sec - in org.apache.hadoop.hbase.security.access.TestScanEarlyTermination
Running org.apache.hadoop.hbase.security.token.TestZKSecretWatcher
Running org.apache.hadoop.hbase.security.access.TestCellACLWithMultipleVersions
Running org.apache.hadoop.hbase.security.access.TestAccessController3
Tests run: 58, Failures: 0, Errors: 0, Skipped: 0, Time elapsed: 106.199 sec - in org.apache.hadoop.hbase.security.access.TestAccessController
Tests run: 1, Failures: 0, Errors: 0, Skipped: 0, Time elapsed: 13.441 sec - in org.apache.hadoop.hbase.security.token.TestZKSecretWatcher
Tests run: 1, Failures: 0, Errors: 0, Skipped: 0, Time elapsed: 8.191 sec - in org.apache.hadoop.hbase.security.access.TestAccessController3
Running org.apache.hadoop.hbase.TestMetaTableAccessorNoCluster
Running org.apache.hadoop.hbase.security.token.TestTokenAuthentication
Tests run: 3, Failures: 0, Errors: 0, Skipped: 0, Time elapsed: 0.759 sec - in org.apache.hadoop.hbase.security.token.TestTokenAuthentication
Tests run: 2, Failures: 0, Errors: 0, Skipped: 0, Time elapsed: 3.792 sec - in org.apache.hadoop.hbase.TestMetaTableAccessorNoCluster
Running org.apache.hadoop.hbase.TestMetaTableLocator
Tests run: 6, Failures: 0, Errors: 0, Skipped: 0, Time elapsed: 51.06 sec - in org.apache.hadoop.hbase.security.access.TestWithDisabledAuthorization
Tests run: 7, Failures: 0, Errors: 0, Skipped: 0, Time elapsed: 4.484 sec - in org.apache.hadoop.hbase.TestMetaTableLocator
Running org.apache.hadoop.hbase.TestHBaseTestingUtility
Running org.apache.hadoop.hbase.TestZooKeeper
Running org.apache.hadoop.hbase.snapshot.TestSnapshotDescriptionUtils
Tests run: 2, Failures: 0, Errors: 0, Skipped: 0, Time elapsed: 0.123 sec - in org.apache.hadoop.hbase.snapshot.TestSnapshotDescriptionUtils
Running org.apache.hadoop.hbase.security.token.TestGenerateDelegationToken
Tests run: 1, Failures: 0, Errors: 0, Skipped: 0, Time elapsed: 8.268 sec - in org.apache.hadoop.hbase.security.token.TestGenerateDelegationToken
Running org.apache.hadoop.hbase.snapshot.TestMobSecureExportSnapshot
Tests run: 8, Failures: 0, Errors: 0, Skipped: 0, Time elapsed: 76.742 sec - in org.apache.hadoop.hbase.security.access.TestCellACLWithMultipleVersions
Running org.apache.hadoop.hbase.snapshot.TestSecureExportSnapshot
Running org.apache.hadoop.hbase.snapshot.TestMobExportSnapshot
Tests run: 12, Failures: 0, Errors: 0, Skipped: 0, Time elapsed: 86.111 sec - in org.apache.hadoop.hbase.TestHBaseTestingUtility
Running org.apache.hadoop.hbase.snapshot.TestMobRestoreFlushSnapshotFromClient
Tests run: 5, Failures: 0, Errors: 0, Skipped: 0, Time elapsed: 117.317 sec - in org.apache.hadoop.hbase.snapshot.TestMobRestoreFlushSnapshotFromClient
Running org.apache.hadoop.hbase.snapshot.TestFlushSnapshotFromClient
Tests run: 10, Failures: 0, Errors: 0, Skipped: 0, Time elapsed: 255.489 sec - in org.apache.hadoop.hbase.TestZooKeeper
Running org.apache.hadoop.hbase.snapshot.TestExportSnapshot
Tests run: 9, Failures: 0, Errors: 0, Skipped: 0, Time elapsed: 108.648 sec - in org.apache.hadoop.hbase.snapshot.TestFlushSnapshotFromClient
Running org.apache.hadoop.hbase.snapshot.TestSnapshotClientRetries
Tests run: 2, Failures: 0, Errors: 0, Skipped: 0, Time elapsed: 26.955 sec - in org.apache.hadoop.hbase.snapshot.TestSnapshotClientRetries
Running org.apache.hadoop.hbase.snapshot.TestRestoreFlushSnapshotFromClient
Tests run: 9, Failures: 0, Errors: 0, Skipped: 0, Time elapsed: 368.097 sec - in org.apache.hadoop.hbase.snapshot.TestSecureExportSnapshot
Tests run: 9, Failures: 0, Errors: 0, Skipped: 0, Time elapsed: 398.253 sec - in org.apache.hadoop.hbase.snapshot.TestMobSecureExportSnapshot
Running org.apache.hadoop.hbase.TestInfoServers
Tests run: 3, Failures: 0, Errors: 0, Skipped: 0, Time elapsed: 4.955 sec - in org.apache.hadoop.hbase.TestInfoServers
Running org.apache.hadoop.hbase.quotas.TestQuotaAdmin
Tests run: 3, Failures: 0, Errors: 0, Skipped: 0, Time elapsed: 5.026 sec - in org.apache.hadoop.hbase.quotas.TestQuotaAdmin
Tests run: 9, Failures: 0, Errors: 0, Skipped: 0, Time elapsed: 382.137 sec - in org.apache.hadoop.hbase.snapshot.TestMobExportSnapshot
Tests run: 5, Failures: 0, Errors: 0, Skipped: 0, Time elapsed: 76.502 sec - in org.apache.hadoop.hbase.snapshot.TestRestoreFlushSnapshotFromClient
Running org.apache.hadoop.hbase.procedure.TestZKProcedureControllers
Running org.apache.hadoop.hbase.procedure.TestZKProcedure
Running org.apache.hadoop.hbase.quotas.TestQuotaTableUtil
Running org.apache.hadoop.hbase.quotas.TestQuotaThrottle
Tests run: 4, Failures: 0, Errors: 0, Skipped: 0, Time elapsed: 3.053 sec - in org.apache.hadoop.hbase.procedure.TestZKProcedureControllers
Tests run: 3, Failures: 0, Errors: 0, Skipped: 0, Time elapsed: 2.161 sec - in org.apache.hadoop.hbase.quotas.TestQuotaTableUtil
Tests run: 4, Failures: 0, Errors: 0, Skipped: 0, Time elapsed: 3.048 sec - in org.apache.hadoop.hbase.procedure.TestZKProcedure
Running org.apache.hadoop.hbase.io.hfile.TestScannerFromBucketCache
Running org.apache.hadoop.hbase.io.hfile.TestForceCacheImportantBlocks
Running org.apache.hadoop.hbase.io.hfile.TestCacheOnWrite
Tests run: 4, Failures: 0, Errors: 0, Skipped: 0, Time elapsed: 5.702 sec - in org.apache.hadoop.hbase.io.hfile.TestScannerFromBucketCache
Running org.apache.hadoop.hbase.io.hfile.TestHFileBlock
Tests run: 12, Failures: 0, Errors: 0, Skipped: 0, Time elapsed: 31.485 sec - in org.apache.hadoop.hbase.quotas.TestQuotaThrottle
Running org.apache.hadoop.hbase.io.hfile.TestHFileBlockIndex
Tests run: 2, Failures: 0, Errors: 0, Skipped: 0, Time elapsed: 32.302 sec - in org.apache.hadoop.hbase.io.hfile.TestForceCacheImportantBlocks
Running org.apache.hadoop.hbase.io.hfile.TestSeekBeforeWithInlineBlocks
Tests run: 10, Failures: 0, Errors: 0, Skipped: 0, Time elapsed: 15.03 sec - in org.apache.hadoop.hbase.io.hfile.TestHFileBlockIndex
Running org.apache.hadoop.hbase.io.hfile.TestHFileSeek
Tests run: 1, Failures: 0, Errors: 0, Skipped: 0, Time elapsed: 16.609 sec - in org.apache.hadoop.hbase.io.hfile.TestSeekBeforeWithInlineBlocks
Tests run: 1, Failures: 0, Errors: 0, Skipped: 0, Time elapsed: 3.788 sec - in org.apache.hadoop.hbase.io.hfile.TestHFileSeek
Running org.apache.hadoop.hbase.io.hfile.TestScannerSelectionUsingTTL
Running org.apache.hadoop.hbase.io.hfile.TestCacheConfig
Tests run: 6, Failures: 0, Errors: 0, Skipped: 0, Time elapsed: 2.633 sec - in org.apache.hadoop.hbase.io.hfile.TestCacheConfig
Running org.apache.hadoop.hbase.io.encoding.TestDataBlockEncoders
Tests run: 28, Failures: 0, Errors: 0, Skipped: 0, Time elapsed: 93.932 sec - in org.apache.hadoop.hbase.io.hfile.TestHFileBlock
Running org.apache.hadoop.hbase.io.encoding.TestEncodedSeekers
Tests run: 6, Failures: 0, Errors: 0, Skipped: 0, Time elapsed: 64.511 sec - in org.apache.hadoop.hbase.io.hfile.TestScannerSelectionUsingTTL
Running org.apache.hadoop.hbase.io.encoding.TestBufferedDataBlockEncoder
Tests run: 2, Failures: 0, Errors: 0, Skipped: 0, Time elapsed: 16.266 sec - in org.apache.hadoop.hbase.io.encoding.TestBufferedDataBlockEncoder
Running org.apache.hadoop.hbase.io.encoding.TestChangingEncoding
Tests run: 56, Failures: 0, Errors: 0, Skipped: 0, Time elapsed: 104.131 sec - in org.apache.hadoop.hbase.io.encoding.TestDataBlockEncoders
Running org.apache.hadoop.hbase.io.encoding.TestLoadAndSwitchEncodeOnDisk
Tests run: 9, Failures: 0, Errors: 0, Skipped: 0, Time elapsed: 368.877 sec - in org.apache.hadoop.hbase.snapshot.TestExportSnapshot
Running org.apache.hadoop.hbase.io.TestFileLink
Tests run: 72, Failures: 0, Errors: 0, Skipped: 0, Time elapsed: 186.003 sec - in org.apache.hadoop.hbase.io.hfile.TestCacheOnWrite
Running org.apache.hadoop.hbase.wal.TestWALFactory
Tests run: 5, Failures: 0, Errors: 0, Skipped: 0, Time elapsed: 20.238 sec - in org.apache.hadoop.hbase.io.TestFileLink
Running org.apache.hadoop.hbase.wal.TestWALFiltering
Tests run: 1, Failures: 0, Errors: 0, Skipped: 0, Time elapsed: 36.846 sec - in org.apache.hadoop.hbase.io.encoding.TestLoadAndSwitchEncodeOnDisk
Running org.apache.hadoop.hbase.wal.TestWALReaderOnSecureWAL
Tests run: 2, Failures: 0, Errors: 0, Skipped: 0, Time elapsed: 2.014 sec - in org.apache.hadoop.hbase.wal.TestWALReaderOnSecureWAL
Tests run: 9, Failures: 0, Errors: 0, Skipped: 0, Time elapsed: 17.503 sec - in org.apache.hadoop.hbase.wal.TestWALFactory
Running org.apache.hadoop.hbase.wal.TestDefaultWALProvider
Running org.apache.hadoop.hbase.wal.TestBoundedRegionGroupingStrategy
Tests run: 5, Failures: 0, Errors: 0, Skipped: 0, Time elapsed: 8.459 sec - in org.apache.hadoop.hbase.wal.TestDefaultWALProvider
Running org.apache.hadoop.hbase.wal.TestSecureWAL
Tests run: 1, Failures: 0, Errors: 0, Skipped: 0, Time elapsed: 1.838 sec - in org.apache.hadoop.hbase.wal.TestSecureWAL
Tests run: 1, Failures: 0, Errors: 0, Skipped: 0, Time elapsed: 33.782 sec - in org.apache.hadoop.hbase.wal.TestWALFiltering
Running org.apache.hadoop.hbase.wal.TestDefaultWALProviderWithHLogKey
Tests run: 5, Failures: 0, Errors: 0, Skipped: 0, Time elapsed: 29.574 sec - in org.apache.hadoop.hbase.wal.TestBoundedRegionGroupingStrategy
Tests run: 20, Failures: 0, Errors: 0, Skipped: 0, Time elapsed: 152.402 sec - in org.apache.hadoop.hbase.io.encoding.TestEncodedSeekers
Running org.apache.hadoop.hbase.zookeeper.TestZKLeaderManager
Running org.apache.hadoop.hbase.zookeeper.TestZooKeeperACL
Running org.apache.hadoop.hbase.zookeeper.TestZooKeeperNodeTracker
Tests run: 1, Failures: 0, Errors: 0, Skipped: 0, Time elapsed: 0.193 sec - in org.apache.hadoop.hbase.zookeeper.TestZKLeaderManager
Tests run: 7, Failures: 0, Errors: 0, Skipped: 0, Time elapsed: 0.451 sec - in org.apache.hadoop.hbase.zookeeper.TestZooKeeperACL
Tests run: 3, Failures: 0, Errors: 0, Skipped: 0, Time elapsed: 1.243 sec - in org.apache.hadoop.hbase.zookeeper.TestZooKeeperNodeTracker
Running org.apache.hadoop.hbase.zookeeper.TestRecoverableZooKeeper
Tests run: 5, Failures: 0, Errors: 0, Skipped: 0, Time elapsed: 11.159 sec - in org.apache.hadoop.hbase.wal.TestDefaultWALProviderWithHLogKey
Tests run: 1, Failures: 0, Errors: 0, Skipped: 0, Time elapsed: 1.408 sec - in org.apache.hadoop.hbase.zookeeper.TestRecoverableZooKeeper
Running org.apache.hadoop.hbase.zookeeper.TestZKMulti
Running org.apache.hadoop.hbase.zookeeper.TestHQuorumPeer
Running org.apache.hadoop.hbase.zookeeper.lock.TestZKInterProcessReadWriteLock
Tests run: 3, Failures: 0, Errors: 0, Skipped: 0, Time elapsed: 0.92 sec - in org.apache.hadoop.hbase.zookeeper.TestHQuorumPeer
Running org.apache.hadoop.hbase.TestIOFencing
Tests run: 12, Failures: 0, Errors: 0, Skipped: 0, Time elapsed: 3.336 sec - in org.apache.hadoop.hbase.zookeeper.TestZKMulti
Running org.apache.hadoop.hbase.TestMovedRegionsCleaner
Running org.apache.hadoop.hbase.constraint.TestConstraint
Tests run: 1, Failures: 0, Errors: 0, Skipped: 0, Time elapsed: 14.438 sec - in org.apache.hadoop.hbase.TestMovedRegionsCleaner
Tests run: 6, Failures: 0, Errors: 0, Skipped: 0, Time elapsed: 25.308 sec - in org.apache.hadoop.hbase.zookeeper.lock.TestZKInterProcessReadWriteLock
Running org.apache.hadoop.hbase.backup.example.TestZooKeeperTableArchiveClient
Tests run: 3, Failures: 0, Errors: 0, Skipped: 0, Time elapsed: 4.512 sec - in org.apache.hadoop.hbase.backup.example.TestZooKeeperTableArchiveClient
Running org.apache.hadoop.hbase.backup.TestHFileArchiving
Tests run: 5, Failures: 0, Errors: 0, Skipped: 0, Time elapsed: 30.854 sec - in org.apache.hadoop.hbase.constraint.TestConstraint
Running org.apache.hadoop.hbase.TestHColumnDescriptorDefaultVersions
Running org.apache.hadoop.hbase.ipc.TestProtoBufRpc
Tests run: 1, Failures: 0, Errors: 0, Skipped: 0, Time elapsed: 2.804 sec - in org.apache.hadoop.hbase.ipc.TestProtoBufRpc
Running org.apache.hadoop.hbase.ipc.TestRpcClientLeaks
Tests run: 4, Failures: 0, Errors: 0, Skipped: 0, Time elapsed: 31.577 sec - in org.apache.hadoop.hbase.TestHColumnDescriptorDefaultVersions
Running org.apache.hadoop.hbase.ipc.TestHBaseClient
Tests run: 3, Failures: 0, Errors: 0, Skipped: 0, Time elapsed: 192.568 sec - in org.apache.hadoop.hbase.io.encoding.TestChangingEncoding
Tests run: 1, Failures: 0, Errors: 0, Skipped: 0, Time elapsed: 0.533 sec - in org.apache.hadoop.hbase.ipc.TestHBaseClient
Tests run: 1, Failures: 0, Errors: 0, Skipped: 0, Time elapsed: 27.723 sec - in org.apache.hadoop.hbase.ipc.TestRpcClientLeaks
Running org.apache.hadoop.hbase.TestNamespace
Tests run: 2, Failures: 0, Errors: 0, Skipped: 0, Time elapsed: 120.322 sec - in org.apache.hadoop.hbase.TestIOFencing
Tests run: 5, Failures: 0, Errors: 0, Skipped: 0, Time elapsed: 96.685 sec - in org.apache.hadoop.hbase.backup.TestHFileArchiving
Tests run: 8, Failures: 0, Errors: 0, Skipped: 0, Time elapsed: 63.041 sec - in org.apache.hadoop.hbase.TestNamespace

Results :

Tests in error: 
  TestFailedAppendAndSync.testLockupAroundBadAssignSync:242 » TestTimedOut test ...

Tests run: 2517, Failures: 0, Errors: 1, Skipped: 36

[INFO] ------------------------------------------------------------------------
[INFO] Reactor Summary:
[INFO] 
[INFO] Apache HBase ...................................... SUCCESS [  2.926 s]
[INFO] Apache HBase - Checkstyle ......................... SUCCESS [  0.833 s]
[INFO] Apache HBase - Resource Bundle .................... SUCCESS [  0.345 s]
[INFO] Apache HBase - Annotations ........................ SUCCESS [  0.228 s]
[INFO] Apache HBase - Protocol ........................... SUCCESS [  3.012 s]
[INFO] Apache HBase - Common ............................. SUCCESS [01:37 min]
[INFO] Apache HBase - Procedure .......................... SUCCESS [02:26 min]
[INFO] Apache HBase - Client ............................. SUCCESS [ 41.485 s]
[INFO] Apache HBase - Hadoop Compatibility ............... SUCCESS [  7.910 s]
[INFO] Apache HBase - Hadoop Two Compatibility ........... SUCCESS [  9.016 s]
[INFO] Apache HBase - Prefix Tree ........................ SUCCESS [ 11.781 s]
[INFO] Apache HBase - Server ............................. FAILURE [  01:46 h]
[INFO] Apache HBase - Testing Util ....................... SKIPPED
[INFO] Apache HBase - Thrift ............................. SKIPPED
[INFO] Apache HBase - Shell .............................. SKIPPED
[INFO] Apache HBase - Integration Tests .................. SKIPPED
[INFO] Apache HBase - Examples ........................... SKIPPED
[INFO] Apache HBase - Rest ............................... SKIPPED
[INFO] Apache HBase - External Block Cache ............... SKIPPED
[INFO] Apache HBase - Spark .............................. SKIPPED
[INFO] Apache HBase - Assembly ........................... SKIPPED
[INFO] Apache HBase - Shaded ............................. SKIPPED
[INFO] Apache HBase - Shaded - Client .................... SKIPPED
[INFO] Apache HBase - Shaded - Server .................... SKIPPED
[INFO] Apache HBase - Archetypes ......................... SKIPPED
[INFO] Apache HBase - Exemplar for hbase-client archetype  SKIPPED
[INFO] Apache HBase - Archetype builder .................. SKIPPED
[INFO] ------------------------------------------------------------------------
[INFO] BUILD FAILURE
[INFO] ------------------------------------------------------------------------
[INFO] Total time: 01:52 h
[INFO] Finished at: 2016-02-20T03:46:12+00:00
[INFO] Final Memory: 68M/733M
[INFO] ------------------------------------------------------------------------
[ERROR] Failed to execute goal org.apache.maven.plugins:maven-surefire-plugin:2.18.1:test
(secondPartTestsExecution) on project hbase-server: There are test failures.
[ERROR] 
[ERROR] Please refer to <https://builds.apache.org/job/HBase-Trunk_matrix/jdk=latest1.7,label=yahoo-not-h2/ws/hbase-server/target/surefire-reports>
for the individual test results.
[ERROR] -> [Help 1]
[ERROR] 
[ERROR] To see the full stack trace of the errors, re-run Maven with the -e switch.
[ERROR] Re-run Maven using the -X switch to enable full debug logging.
[ERROR] 
[ERROR] For more information about the errors and possible solutions, please read the following
articles:
[ERROR] [Help 1] http://cwiki.apache.org/confluence/display/MAVEN/MojoFailureException
[ERROR] 
[ERROR] After correcting the problems, you can resume the build with the command
[ERROR]   mvn <goals> -rf :hbase-server
Build step 'Invoke top-level Maven targets' marked build as failure
Performing Post build task...
Match found for :.* : True
Logical operation result is TRUE
Running script  : # Run zombie detector script
./dev-support/zombie-detector.sh --jenkins ${BUILD_ID}
[yahoo-not-h2] $ /bin/bash -xe /tmp/hudson2818367664436470059.sh
+ ./dev-support/zombie-detector.sh --jenkins 723
Sat Feb 20 03:46:13 UTC 2016 We're ok: there is no zombie test


    {color:green}+1 zombies{color}. No zombie tests found running at the end of the build.
POST BUILD TASK : SUCCESS
END OF POST BUILD TASK : 0
Archiving artifacts
Recording test results
[FINDBUGS] Skipping publisher since build result is FAILURE
[CHECKSTYLE] Skipping publisher since build result is FAILURE

Mime
View raw message