hbase-builds mailing list archives

Site index · List index
Message view « Date » · « Thread »
Top « Date » · « Thread »
From Apache Jenkins Server <jenk...@builds.apache.org>
Subject Build failed in Jenkins: HBase-Trunk_matrix » latest1.7,yahoo-not-h2 #720
Date Fri, 19 Feb 2016 09:15:22 GMT
See <https://builds.apache.org/job/HBase-Trunk_matrix/jdk=latest1.7,label=yahoo-not-h2/720/changes>

Changes:

[jmhsieh] HBASE-15282 Bump hbase-spark to use Spark 1.6.0

------------------------------------------
[...truncated 8298 lines...]
Running org.apache.hadoop.hbase.coprocessor.TestHTableWrapper
Tests run: 14, Failures: 0, Errors: 0, Skipped: 2, Time elapsed: 103.084 sec - in org.apache.hadoop.hbase.coprocessor.TestRegionObserverInterface
Tests run: 1, Failures: 0, Errors: 0, Skipped: 0, Time elapsed: 6.662 sec - in org.apache.hadoop.hbase.regionserver.TestFailedAppendAndSync
Running org.apache.hadoop.hbase.regionserver.TestHRegionServerBulkLoad
Tests run: 1, Failures: 0, Errors: 0, Skipped: 0, Time elapsed: 9.807 sec - in org.apache.hadoop.hbase.coprocessor.TestHTableWrapper
Running org.apache.hadoop.hbase.backup.TestHFileArchiving
Tests run: 9, Failures: 0, Errors: 0, Skipped: 0, Time elapsed: 682.075 sec - in org.apache.hadoop.hbase.snapshot.TestExportSnapshot
Running org.apache.hadoop.hbase.regionserver.TestReversibleScanners
Running org.apache.hadoop.hbase.regionserver.TestScannerRetriableFailure
Tests run: 5, Failures: 0, Errors: 0, Skipped: 0, Time elapsed: 14.469 sec - in org.apache.hadoop.hbase.regionserver.TestReversibleScanners
Running org.apache.hadoop.hbase.regionserver.TestSplitWalDataLoss
Running org.apache.hadoop.hbase.regionserver.TestRegionFavoredNodes
Tests run: 1, Failures: 0, Errors: 0, Skipped: 0, Time elapsed: 39.411 sec - in org.apache.hadoop.hbase.regionserver.TestScannerRetriableFailure
Tests run: 1, Failures: 0, Errors: 0, Skipped: 0, Time elapsed: 42.078 sec - in org.apache.hadoop.hbase.regionserver.TestSplitWalDataLoss
Tests run: 1, Failures: 0, Errors: 0, Skipped: 0, Time elapsed: 26.458 sec - in org.apache.hadoop.hbase.regionserver.TestRegionFavoredNodes
Running org.apache.hadoop.hbase.regionserver.TestClusterId
Tests run: 5, Failures: 0, Errors: 0, Skipped: 0, Time elapsed: 90.04 sec - in org.apache.hadoop.hbase.backup.TestHFileArchiving
Running org.apache.hadoop.hbase.regionserver.TestEndToEndSplitTransaction
Running org.apache.hadoop.hbase.regionserver.TestMajorCompaction
Running org.apache.hadoop.hbase.regionserver.TestRegionServerNoMaster
Tests run: 2, Failures: 0, Errors: 0, Skipped: 0, Time elapsed: 120.91 sec - in org.apache.hadoop.hbase.regionserver.TestHRegionServerBulkLoad
Running org.apache.hadoop.hbase.regionserver.TestCompactSplitThread
Tests run: 2, Failures: 0, Errors: 0, Skipped: 0, Time elapsed: 28.766 sec - in org.apache.hadoop.hbase.regionserver.TestEndToEndSplitTransaction
Running org.apache.hadoop.hbase.regionserver.TestRegionReplicaFailover
Tests run: 4, Failures: 0, Errors: 0, Skipped: 0, Time elapsed: 18.576 sec - in org.apache.hadoop.hbase.regionserver.TestRegionServerNoMaster
Running org.apache.hadoop.hbase.regionserver.TestWALLockup
Tests run: 2, Failures: 0, Errors: 0, Skipped: 0, Time elapsed: 53.774 sec - in org.apache.hadoop.hbase.regionserver.TestClusterId
Tests run: 1, Failures: 0, Errors: 0, Skipped: 0, Time elapsed: 12.749 sec - in org.apache.hadoop.hbase.regionserver.TestWALLockup
Tests run: 1, Failures: 0, Errors: 0, Skipped: 0, Time elapsed: 25.764 sec - in org.apache.hadoop.hbase.regionserver.TestCompactSplitThread
Running org.apache.hadoop.hbase.regionserver.TestHMobStore
Tests run: 7, Failures: 0, Errors: 0, Skipped: 0, Time elapsed: 59.601 sec - in org.apache.hadoop.hbase.regionserver.TestMajorCompaction
Running org.apache.hadoop.hbase.regionserver.TestPriorityRpc
Tests run: 8, Failures: 0, Errors: 0, Skipped: 0, Time elapsed: 11.804 sec - in org.apache.hadoop.hbase.regionserver.TestHMobStore
Tests run: 4, Failures: 0, Errors: 0, Skipped: 0, Time elapsed: 8.247 sec - in org.apache.hadoop.hbase.regionserver.TestPriorityRpc
Running org.apache.hadoop.hbase.regionserver.TestServerCustomProtocol
Running org.apache.hadoop.hbase.regionserver.TestBlocksRead
Running org.apache.hadoop.hbase.regionserver.TestSplitLogWorker
Tests run: 4, Failures: 0, Errors: 0, Skipped: 0, Time elapsed: 9.136 sec - in org.apache.hadoop.hbase.regionserver.TestBlocksRead
Running org.apache.hadoop.hbase.regionserver.TestEncryptionKeyRotation
Running org.apache.hadoop.hbase.regionserver.TestRegionServerHostname
Tests run: 7, Failures: 0, Errors: 0, Skipped: 0, Time elapsed: 27.782 sec - in org.apache.hadoop.hbase.regionserver.TestSplitLogWorker
Running org.apache.hadoop.hbase.regionserver.TestJoinedScanners
Tests run: 2, Failures: 0, Errors: 0, Skipped: 0, Time elapsed: 25.047 sec - in org.apache.hadoop.hbase.regionserver.TestEncryptionKeyRotation
Tests run: 7, Failures: 0, Errors: 0, Skipped: 0, Time elapsed: 52.528 sec - in org.apache.hadoop.hbase.regionserver.TestServerCustomProtocol
Running org.apache.hadoop.hbase.regionserver.TestMinorCompaction
Tests run: 2, Failures: 0, Errors: 0, Skipped: 0, Time elapsed: 41.651 sec - in org.apache.hadoop.hbase.regionserver.TestRegionServerHostname
Running org.apache.hadoop.hbase.regionserver.TestRegionServerMetrics
Tests run: 6, Failures: 0, Errors: 0, Skipped: 0, Time elapsed: 12.572 sec - in org.apache.hadoop.hbase.regionserver.TestMinorCompaction
Running org.apache.hadoop.hbase.regionserver.TestTags
Tests run: 1, Failures: 0, Errors: 0, Skipped: 0, Time elapsed: 60.664 sec - in org.apache.hadoop.hbase.regionserver.TestJoinedScanners
Running org.apache.hadoop.hbase.regionserver.TestMobStoreCompaction
Tests run: 4, Failures: 0, Errors: 0, Skipped: 0, Time elapsed: 10.862 sec - in org.apache.hadoop.hbase.regionserver.TestMobStoreCompaction
Tests run: 12, Failures: 0, Errors: 0, Skipped: 0, Time elapsed: 49.078 sec - in org.apache.hadoop.hbase.regionserver.TestRegionServerMetrics
Running org.apache.hadoop.hbase.regionserver.TestHRegionOnCluster
Running org.apache.hadoop.hbase.regionserver.TestScannerHeartbeatMessages
Running org.apache.hadoop.hbase.regionserver.TestRowTooBig
Tests run: 1, Failures: 0, Errors: 0, Skipped: 0, Time elapsed: 37.774 sec - in org.apache.hadoop.hbase.regionserver.TestHRegionOnCluster
Tests run: 1, Failures: 0, Errors: 0, Skipped: 0, Time elapsed: 28.651 sec - in org.apache.hadoop.hbase.regionserver.TestScannerHeartbeatMessages
Running org.apache.hadoop.hbase.regionserver.TestPerColumnFamilyFlush
Tests run: 4, Failures: 0, Errors: 0, Skipped: 0, Time elapsed: 81.994 sec - in org.apache.hadoop.hbase.regionserver.TestTags
Tests run: 2, Failures: 0, Errors: 0, Skipped: 0, Time elapsed: 32.065 sec - in org.apache.hadoop.hbase.regionserver.TestRowTooBig
Running org.apache.hadoop.hbase.regionserver.TestSeekOptimizations
Running org.apache.hadoop.hbase.regionserver.TestSCVFWithMiniCluster
Tests run: 5, Failures: 0, Errors: 0, Skipped: 0, Time elapsed: 1.13 sec - in org.apache.hadoop.hbase.regionserver.TestSCVFWithMiniCluster
Tests run: 6, Failures: 0, Errors: 0, Skipped: 0, Time elapsed: 16.421 sec - in org.apache.hadoop.hbase.regionserver.TestSeekOptimizations
Running org.apache.hadoop.hbase.regionserver.TestCompactionState
Running org.apache.hadoop.hbase.regionserver.TestCompactionWithCoprocessor
Running org.apache.hadoop.hbase.regionserver.TestRegionReplicas
Tests run: 5, Failures: 0, Errors: 0, Skipped: 0, Time elapsed: 36.468 sec - in org.apache.hadoop.hbase.regionserver.TestCompactionWithCoprocessor
Running org.apache.hadoop.hbase.regionserver.TestStoreScanner
Tests run: 16, Failures: 0, Errors: 0, Skipped: 0, Time elapsed: 2.052 sec - in org.apache.hadoop.hbase.regionserver.TestStoreScanner
Running org.apache.hadoop.hbase.regionserver.TestHRegionReplayEvents
Tests run: 6, Failures: 0, Errors: 0, Skipped: 0, Time elapsed: 327.713 sec - in org.apache.hadoop.hbase.regionserver.TestRegionReplicaFailover
Tests run: 5, Failures: 0, Errors: 0, Skipped: 0, Time elapsed: 87.25 sec - in org.apache.hadoop.hbase.regionserver.TestCompactionState
Running org.apache.hadoop.hbase.regionserver.TestCacheOnWriteInSchema
Tests run: 26, Failures: 0, Errors: 0, Skipped: 0, Time elapsed: 47.308 sec - in org.apache.hadoop.hbase.regionserver.TestHRegionReplayEvents
Tests run: 3, Failures: 0, Errors: 0, Skipped: 0, Time elapsed: 6.894 sec - in org.apache.hadoop.hbase.regionserver.TestCacheOnWriteInSchema
Running org.apache.hadoop.hbase.regionserver.wal.TestReadOldRootAndMetaEdits
Tests run: 1, Failures: 0, Errors: 0, Skipped: 0, Time elapsed: 0.623 sec - in org.apache.hadoop.hbase.regionserver.wal.TestReadOldRootAndMetaEdits
Running org.apache.hadoop.hbase.regionserver.wal.TestFSHLog
Running org.apache.hadoop.hbase.regionserver.wal.TestWALReplayCompressed
Tests run: 6, Failures: 0, Errors: 0, Skipped: 0, Time elapsed: 10.852 sec - in org.apache.hadoop.hbase.regionserver.wal.TestFSHLog
Running org.apache.hadoop.hbase.regionserver.wal.TestLogRollingNoCluster
Running org.apache.hadoop.hbase.regionserver.wal.TestSecureWALReplay
Tests run: 1, Failures: 0, Errors: 0, Skipped: 0, Time elapsed: 11.78 sec - in org.apache.hadoop.hbase.regionserver.wal.TestLogRollingNoCluster
Tests run: 6, Failures: 0, Errors: 0, Skipped: 1, Time elapsed: 184.23 sec - in org.apache.hadoop.hbase.regionserver.TestPerColumnFamilyFlush
Running org.apache.hadoop.hbase.regionserver.wal.TestLogRollAbort
Running org.apache.hadoop.hbase.regionserver.wal.TestWALReplay
Tests run: 12, Failures: 0, Errors: 0, Skipped: 0, Time elapsed: 66.567 sec - in org.apache.hadoop.hbase.regionserver.wal.TestWALReplayCompressed
Running org.apache.hadoop.hbase.regionserver.wal.TestLogRolling
Tests run: 2, Failures: 0, Errors: 0, Skipped: 0, Time elapsed: 47.915 sec - in org.apache.hadoop.hbase.regionserver.wal.TestLogRollAbort
Tests run: 12, Failures: 0, Errors: 0, Skipped: 0, Time elapsed: 74.398 sec - in org.apache.hadoop.hbase.regionserver.wal.TestSecureWALReplay
Running org.apache.hadoop.hbase.regionserver.wal.TestProtobufLog
Tests run: 1, Failures: 0, Errors: 0, Skipped: 0, Time elapsed: 2.802 sec - in org.apache.hadoop.hbase.regionserver.wal.TestProtobufLog
Running org.apache.hadoop.hbase.regionserver.wal.TestDurability
Tests run: 3, Failures: 0, Errors: 0, Skipped: 0, Time elapsed: 4.071 sec - in org.apache.hadoop.hbase.regionserver.wal.TestDurability
Tests run: 12, Failures: 0, Errors: 0, Skipped: 0, Time elapsed: 63.773 sec - in org.apache.hadoop.hbase.regionserver.wal.TestWALReplay
Running org.apache.hadoop.hbase.regionserver.wal.TestLogRollPeriod
Running org.apache.hadoop.hbase.regionserver.TestScannerWithBulkload
Running org.apache.hadoop.hbase.regionserver.TestEncryptionRandomKeying
Tests run: 1, Failures: 0, Errors: 0, Skipped: 0, Time elapsed: 2.1 sec - in org.apache.hadoop.hbase.regionserver.TestEncryptionRandomKeying
Tests run: 3, Failures: 0, Errors: 0, Skipped: 0, Time elapsed: 19.302 sec - in org.apache.hadoop.hbase.regionserver.TestScannerWithBulkload
Running org.apache.hadoop.hbase.regionserver.throttle.TestFlushWithThroughputController
Running org.apache.hadoop.hbase.regionserver.throttle.TestCompactionWithThroughputController
Tests run: 7, Failures: 0, Errors: 0, Skipped: 0, Time elapsed: 268.633 sec - in org.apache.hadoop.hbase.regionserver.TestRegionReplicas
Running org.apache.hadoop.hbase.regionserver.TestDefaultMemStore
Tests run: 2, Failures: 0, Errors: 0, Skipped: 0, Time elapsed: 64.497 sec - in org.apache.hadoop.hbase.regionserver.wal.TestLogRollPeriod
Running org.apache.hadoop.hbase.regionserver.TestMasterAddressTracker
Tests run: 5, Failures: 0, Errors: 0, Skipped: 0, Time elapsed: 2.949 sec - in org.apache.hadoop.hbase.regionserver.TestMasterAddressTracker
Running org.apache.hadoop.hbase.regionserver.TestSplitTransactionOnCluster
Tests run: 23, Failures: 0, Errors: 0, Skipped: 0, Time elapsed: 55.065 sec - in org.apache.hadoop.hbase.regionserver.TestDefaultMemStore
Running org.apache.hadoop.hbase.regionserver.TestParallelPut
Tests run: 2, Failures: 0, Errors: 0, Skipped: 0, Time elapsed: 16.822 sec - in org.apache.hadoop.hbase.regionserver.TestParallelPut
Running org.apache.hadoop.hbase.regionserver.TestColumnSeeking
Tests run: 3, Failures: 0, Errors: 0, Skipped: 0, Time elapsed: 110.953 sec - in org.apache.hadoop.hbase.regionserver.throttle.TestCompactionWithThroughputController
Tests run: 2, Failures: 0, Errors: 0, Skipped: 0, Time elapsed: 33.168 sec - in org.apache.hadoop.hbase.regionserver.TestColumnSeeking
Running org.apache.hadoop.hbase.regionserver.TestCorruptedRegionStoreFile
Running org.apache.hadoop.hbase.regionserver.TestRegionServerOnlineConfigChange
Tests run: 2, Failures: 0, Errors: 0, Skipped: 0, Time elapsed: 3.069 sec - in org.apache.hadoop.hbase.regionserver.TestRegionServerOnlineConfigChange
Running org.apache.hadoop.hbase.regionserver.TestRegionIncrement
Tests run: 3, Failures: 0, Errors: 0, Skipped: 0, Time elapsed: 166.202 sec - in org.apache.hadoop.hbase.regionserver.throttle.TestFlushWithThroughputController
Tests run: 3, Failures: 0, Errors: 0, Skipped: 0, Time elapsed: 21.33 sec - in org.apache.hadoop.hbase.regionserver.TestRegionIncrement
Running org.apache.hadoop.hbase.regionserver.TestCompaction
Running org.apache.hadoop.hbase.regionserver.TestRegionMergeTransactionOnCluster
Tests run: 5, Failures: 0, Errors: 0, Skipped: 0, Time elapsed: 300.35 sec - in org.apache.hadoop.hbase.regionserver.wal.TestLogRolling
Tests run: 5, Failures: 0, Errors: 0, Skipped: 0, Time elapsed: 33.312 sec - in org.apache.hadoop.hbase.regionserver.TestCompaction
Running org.apache.hadoop.hbase.regionserver.TestRecoveredEdits
Tests run: 15, Failures: 0, Errors: 0, Skipped: 0, Time elapsed: 150.385 sec - in org.apache.hadoop.hbase.regionserver.TestSplitTransactionOnCluster
Running org.apache.hadoop.hbase.regionserver.TestGetClosestAtOrBefore
Tests run: 3, Failures: 0, Errors: 0, Skipped: 0, Time elapsed: 7.205 sec - in org.apache.hadoop.hbase.regionserver.TestGetClosestAtOrBefore
Running org.apache.hadoop.hbase.regionserver.TestCompoundBloomFilter
Running org.apache.hadoop.hbase.regionserver.TestRemoveRegionMetrics
Tests run: 1, Failures: 0, Errors: 0, Skipped: 0, Time elapsed: 27.914 sec - in org.apache.hadoop.hbase.regionserver.TestRecoveredEdits
Running org.apache.hadoop.hbase.regionserver.TestRegionServerReportForDuty
Tests run: 1, Failures: 0, Errors: 0, Skipped: 0, Time elapsed: 32.835 sec - in org.apache.hadoop.hbase.regionserver.TestRegionServerReportForDuty
Tests run: 2, Failures: 0, Errors: 0, Skipped: 0, Time elapsed: 177.054 sec - in org.apache.hadoop.hbase.regionserver.TestCorruptedRegionStoreFile
Running org.apache.hadoop.hbase.regionserver.TestMobStoreScanner
Running org.apache.hadoop.hbase.regionserver.TestHRegion
Tests run: 5, Failures: 0, Errors: 0, Skipped: 0, Time elapsed: 137.474 sec - in org.apache.hadoop.hbase.regionserver.TestRegionMergeTransactionOnCluster
Running org.apache.hadoop.hbase.regionserver.compactions.TestCompactedHFilesDischarger
Tests run: 3, Failures: 0, Errors: 0, Skipped: 0, Time elapsed: 9.55 sec - in org.apache.hadoop.hbase.regionserver.compactions.TestCompactedHFilesDischarger
Running org.apache.hadoop.hbase.regionserver.compactions.TestFIFOCompactionPolicy
Tests run: 6, Failures: 0, Errors: 0, Skipped: 0, Time elapsed: 58.968 sec - in org.apache.hadoop.hbase.regionserver.TestMobStoreScanner
Running org.apache.hadoop.hbase.regionserver.TestAtomicOperation
Tests run: 1, Failures: 0, Errors: 0, Skipped: 0, Time elapsed: 164.664 sec - in org.apache.hadoop.hbase.regionserver.TestRemoveRegionMetrics
Running org.apache.hadoop.hbase.regionserver.TestDeleteMobTable
Tests run: 4, Failures: 0, Errors: 0, Skipped: 0, Time elapsed: 70.306 sec - in org.apache.hadoop.hbase.regionserver.compactions.TestFIFOCompactionPolicy
Running org.apache.hadoop.hbase.regionserver.TestFSErrorsExposed
Tests run: 8, Failures: 0, Errors: 0, Skipped: 0, Time elapsed: 75.449 sec - in org.apache.hadoop.hbase.regionserver.TestAtomicOperation
Running org.apache.hadoop.hbase.regionserver.TestRSKilledWhenInitializing
Tests run: 3, Failures: 0, Errors: 0, Skipped: 0, Time elapsed: 27.858 sec - in org.apache.hadoop.hbase.regionserver.TestDeleteMobTable
Running org.apache.hadoop.hbase.regionserver.TestMultiColumnScanner
Tests run: 102, Failures: 0, Errors: 0, Skipped: 0, Time elapsed: 170.039 sec - in org.apache.hadoop.hbase.regionserver.TestHRegion
Running org.apache.hadoop.hbase.regionserver.TestFlushRegionEntry
Tests run: 1, Failures: 0, Errors: 0, Skipped: 0, Time elapsed: 1.047 sec - in org.apache.hadoop.hbase.regionserver.TestFlushRegionEntry
Running org.apache.hadoop.hbase.regionserver.TestStore
Tests run: 1, Failures: 0, Errors: 0, Skipped: 0, Time elapsed: 44.166 sec - in org.apache.hadoop.hbase.regionserver.TestRSKilledWhenInitializing
Tests run: 18, Failures: 0, Errors: 0, Skipped: 0, Time elapsed: 22.613 sec - in org.apache.hadoop.hbase.regionserver.TestStore
Running org.apache.hadoop.hbase.TestMetaTableLocator
Tests run: 3, Failures: 0, Errors: 0, Skipped: 0, Time elapsed: 81.714 sec - in org.apache.hadoop.hbase.regionserver.TestFSErrorsExposed
Tests run: 7, Failures: 0, Errors: 0, Skipped: 0, Time elapsed: 6.577 sec - in org.apache.hadoop.hbase.TestMetaTableLocator
Running org.apache.hadoop.hbase.namespace.TestNamespaceAuditor
Running org.apache.hadoop.hbase.TestStochasticBalancerJmxMetrics
Tests run: 2, Failures: 0, Errors: 0, Skipped: 0, Time elapsed: 2.976 sec - in org.apache.hadoop.hbase.TestStochasticBalancerJmxMetrics
Tests run: 3, Failures: 0, Errors: 0, Skipped: 0, Time elapsed: 346.562 sec - in org.apache.hadoop.hbase.regionserver.TestCompoundBloomFilter
Tests run: 12, Failures: 0, Errors: 0, Skipped: 0, Time elapsed: 115.768 sec - in org.apache.hadoop.hbase.regionserver.TestMultiColumnScanner
Tests run: 12, Failures: 0, Errors: 0, Skipped: 0, Time elapsed: 181.994 sec - in org.apache.hadoop.hbase.namespace.TestNamespaceAuditor

Results :

Failed tests: 
  TestBlockEvictionFromClient.testBlockEvictionWithParallelScans:203->checkForBlockEviction:1329
expected:<2> but was:<3>
  TestBlockEvictionFromClient.testBlockRefCountAfterSplits:601->iterateBlockCache:1224
expected:<0> but was:<2>
  TestBlockEvictionFromClient.testGetWithCellsInDifferentFiles:363->checkForBlockEviction:1315
expected:<2> but was:<3>
  TestBlockEvictionFromClient.testGetWithMultipleColumnFamilies:533 expected:<3> but
was:<2>
  TestBlockEvictionFromClient.testMultiGets:666 expected:<3> but was:<2>
  TestBlockEvictionFromClient.testParallelGetsAndScanWithWrappedRegionScanner:833->checkForBlockEviction:1329
expected:<2> but was:<3>
  TestBlockEvictionFromClient.testParallelGetsAndScans:287->checkForBlockEviction:1317
expected:<2> but was:<6>
  TestBlockEvictionFromClient.testReverseScanWithCompaction:857->testScanWithCompactionInternals:904->iterateBlockCache:1224
expected:<0> but was:<2>
  TestBlockEvictionFromClient.testScanWithCompaction:852->testScanWithCompactionInternals:904->iterateBlockCache:1224
expected:<0> but was:<2>
  TestBlockEvictionFromClient.testScanWithException:1158 expected:<3> but was:<1>

Tests run: 2517, Failures: 10, Errors: 0, Skipped: 36

[INFO] ------------------------------------------------------------------------
[INFO] Reactor Summary:
[INFO] 
[INFO] Apache HBase ...................................... SUCCESS [  6.056 s]
[INFO] Apache HBase - Checkstyle ......................... SUCCESS [  1.645 s]
[INFO] Apache HBase - Resource Bundle .................... SUCCESS [  0.394 s]
[INFO] Apache HBase - Annotations ........................ SUCCESS [  0.466 s]
[INFO] Apache HBase - Protocol ........................... SUCCESS [  4.928 s]
[INFO] Apache HBase - Common ............................. SUCCESS [02:51 min]
[INFO] Apache HBase - Procedure .......................... SUCCESS [03:40 min]
[INFO] Apache HBase - Client ............................. SUCCESS [01:23 min]
[INFO] Apache HBase - Hadoop Compatibility ............... SUCCESS [ 11.779 s]
[INFO] Apache HBase - Hadoop Two Compatibility ........... SUCCESS [ 20.372 s]
[INFO] Apache HBase - Prefix Tree ........................ SUCCESS [ 24.011 s]
[INFO] Apache HBase - Server ............................. FAILURE [  02:42 h]
[INFO] Apache HBase - Testing Util ....................... SKIPPED
[INFO] Apache HBase - Thrift ............................. SKIPPED
[INFO] Apache HBase - Shell .............................. SKIPPED
[INFO] Apache HBase - Integration Tests .................. SKIPPED
[INFO] Apache HBase - Examples ........................... SKIPPED
[INFO] Apache HBase - Rest ............................... SKIPPED
[INFO] Apache HBase - External Block Cache ............... SKIPPED
[INFO] Apache HBase - Spark .............................. SKIPPED
[INFO] Apache HBase - Assembly ........................... SKIPPED
[INFO] Apache HBase - Shaded ............................. SKIPPED
[INFO] Apache HBase - Shaded - Client .................... SKIPPED
[INFO] Apache HBase - Shaded - Server .................... SKIPPED
[INFO] ------------------------------------------------------------------------
[INFO] BUILD FAILURE
[INFO] ------------------------------------------------------------------------
[INFO] Total time: 02:51 h
[INFO] Finished at: 2016-02-19T09:03:43+00:00
[INFO] Final Memory: 66M/615M
[INFO] ------------------------------------------------------------------------
[ERROR] Failed to execute goal org.apache.maven.plugins:maven-surefire-plugin:2.18.1:test
(secondPartTestsExecution) on project hbase-server: There are test failures.
[ERROR] 
[ERROR] Please refer to <https://builds.apache.org/job/HBase-Trunk_matrix/jdk=latest1.7,label=yahoo-not-h2/ws/hbase-server/target/surefire-reports>
for the individual test results.
[ERROR] -> [Help 1]
[ERROR] 
[ERROR] To see the full stack trace of the errors, re-run Maven with the -e switch.
[ERROR] Re-run Maven using the -X switch to enable full debug logging.
[ERROR] 
[ERROR] For more information about the errors and possible solutions, please read the following
articles:
[ERROR] [Help 1] http://cwiki.apache.org/confluence/display/MAVEN/MojoFailureException
[ERROR] 
[ERROR] After correcting the problems, you can resume the build with the command
[ERROR]   mvn <goals> -rf :hbase-server
Build step 'Invoke top-level Maven targets' marked build as failure
Performing Post build task...
Match found for :.* : True
Logical operation result is TRUE
Running script  : # Run zombie detector script
./dev-support/zombie-detector.sh --jenkins ${BUILD_ID}
[yahoo-not-h2] $ /bin/bash -xe /tmp/hudson4206334264142314447.sh
+ ./dev-support/zombie-detector.sh --jenkins 720
Fri Feb 19 09:03:45 UTC 2016 We're ok: there is no zombie test


    {color:green}+1 zombies{color}. No zombie tests found running at the end of the build.
POST BUILD TASK : SUCCESS
END OF POST BUILD TASK : 0
Archiving artifacts
Recording test results
[FINDBUGS] Skipping publisher since build result is FAILURE
[CHECKSTYLE] Skipping publisher since build result is FAILURE

Mime
View raw message