hbase-builds mailing list archives

Site index · List index
Message view « Date » · « Thread »
Top « Date » · « Thread »
From Apache Jenkins Server <jenk...@builds.apache.org>
Subject Build failed in Jenkins: HBase-1.3 » latest1.7,yahoo-not-h2 #569
Date Thu, 25 Feb 2016 02:08:20 GMT
See <https://builds.apache.org/job/HBase-1.3/jdk=latest1.7,label=yahoo-not-h2/569/changes>

Changes:

[eclark] HBASE-12133 Add FastLongHistogram for metric computation (Yi Deng)

[eclark] HBASE-15222 Use less contended classes for metrics

------------------------------------------
[...truncated 45402 lines...]
	at org.apache.hadoop.hbase.ipc.TestRpcMetrics.testWrapperSource(TestRpcMetrics.java:67)

Running org.apache.hadoop.hbase.ipc.TestCallRunner
Tests run: 1, Failures: 0, Errors: 0, Skipped: 0, Time elapsed: 2.305 sec - in org.apache.hadoop.hbase.ipc.TestCallRunner
Running org.apache.hadoop.hbase.ipc.TestGlobalEventLoopGroup
Tests run: 1, Failures: 0, Errors: 0, Skipped: 0, Time elapsed: 4.345 sec - in org.apache.hadoop.hbase.ipc.TestGlobalEventLoopGroup
Running org.apache.hadoop.hbase.filter.TestBitComparator
Tests run: 6, Failures: 0, Errors: 0, Skipped: 0, Time elapsed: 2.47 sec - in org.apache.hadoop.hbase.filter.TestBitComparator
Running org.apache.hadoop.hbase.filter.TestSingleColumnValueExcludeFilter
Tests run: 1, Failures: 0, Errors: 0, Skipped: 0, Time elapsed: 1.35 sec - in org.apache.hadoop.hbase.filter.TestSingleColumnValueExcludeFilter
Running org.apache.hadoop.hbase.filter.TestInclusiveStopFilter
Tests run: 2, Failures: 0, Errors: 0, Skipped: 0, Time elapsed: 1.032 sec - in org.apache.hadoop.hbase.filter.TestInclusiveStopFilter
Running org.apache.hadoop.hbase.filter.TestFilterList
Tests run: 7, Failures: 0, Errors: 0, Skipped: 0, Time elapsed: 6.332 sec - in org.apache.hadoop.hbase.filter.TestFilterList
Running org.apache.hadoop.hbase.filter.TestColumnPrefixFilter
Tests run: 2, Failures: 0, Errors: 0, Skipped: 0, Time elapsed: 18.323 sec - in org.apache.hadoop.hbase.filter.TestColumnPrefixFilter
Running org.apache.hadoop.hbase.filter.TestParseFilter
Tests run: 34, Failures: 0, Errors: 0, Skipped: 0, Time elapsed: 7.076 sec - in org.apache.hadoop.hbase.filter.TestParseFilter
Running org.apache.hadoop.hbase.filter.TestFirstKeyValueMatchingQualifiersFilter
Tests run: 1, Failures: 0, Errors: 0, Skipped: 0, Time elapsed: 1.602 sec - in org.apache.hadoop.hbase.filter.TestFirstKeyValueMatchingQualifiersFilter
Running org.apache.hadoop.hbase.filter.TestRandomRowFilter
Tests run: 2, Failures: 0, Errors: 0, Skipped: 0, Time elapsed: 1.95 sec - in org.apache.hadoop.hbase.filter.TestRandomRowFilter
Running org.apache.hadoop.hbase.filter.TestDependentColumnFilter
Tests run: 4, Failures: 0, Errors: 0, Skipped: 0, Time elapsed: 11.402 sec - in org.apache.hadoop.hbase.filter.TestDependentColumnFilter
Running org.apache.hadoop.hbase.filter.TestComparatorSerialization
Tests run: 6, Failures: 0, Errors: 0, Skipped: 0, Time elapsed: 5.721 sec - in org.apache.hadoop.hbase.filter.TestComparatorSerialization
Running org.apache.hadoop.hbase.filter.TestPageFilter
Tests run: 2, Failures: 0, Errors: 0, Skipped: 0, Time elapsed: 1.678 sec - in org.apache.hadoop.hbase.filter.TestPageFilter
Running org.apache.hadoop.hbase.filter.TestColumnPaginationFilter
Tests run: 1, Failures: 0, Errors: 0, Skipped: 0, Time elapsed: 3.86 sec - in org.apache.hadoop.hbase.filter.TestColumnPaginationFilter
Running org.apache.hadoop.hbase.filter.TestRegexComparator
Tests run: 3, Failures: 0, Errors: 0, Skipped: 0, Time elapsed: 4.39 sec - in org.apache.hadoop.hbase.filter.TestRegexComparator
Running org.apache.hadoop.hbase.filter.TestSingleColumnValueFilter
Tests run: 3, Failures: 0, Errors: 0, Skipped: 0, Time elapsed: 6.743 sec - in org.apache.hadoop.hbase.filter.TestSingleColumnValueFilter
Running org.apache.hadoop.hbase.filter.TestInvocationRecordFilter
Tests run: 1, Failures: 0, Errors: 0, Skipped: 0, Time elapsed: 6.207 sec - in org.apache.hadoop.hbase.filter.TestInvocationRecordFilter
Running org.apache.hadoop.hbase.filter.TestMultipleColumnPrefixFilter
Tests run: 3, Failures: 0, Errors: 0, Skipped: 0, Time elapsed: 20.031 sec - in org.apache.hadoop.hbase.filter.TestMultipleColumnPrefixFilter
Running org.apache.hadoop.hbase.filter.TestFuzzyRowFilter
Tests run: 6, Failures: 0, Errors: 0, Skipped: 0, Time elapsed: 3.28 sec - in org.apache.hadoop.hbase.filter.TestFuzzyRowFilter
Running org.apache.hadoop.hbase.filter.TestPrefixFilter
Tests run: 3, Failures: 0, Errors: 0, Skipped: 0, Time elapsed: 1.327 sec - in org.apache.hadoop.hbase.filter.TestPrefixFilter
Running org.apache.hadoop.hbase.filter.TestFilter
Tests run: 22, Failures: 0, Errors: 0, Skipped: 0, Time elapsed: 25.066 sec - in org.apache.hadoop.hbase.filter.TestFilter
Running org.apache.hadoop.hbase.filter.TestFilterSerialization
Tests run: 26, Failures: 0, Errors: 0, Skipped: 0, Time elapsed: 7.43 sec - in org.apache.hadoop.hbase.filter.TestFilterSerialization
Running org.apache.hadoop.hbase.filter.TestNullComparator
Tests run: 3, Failures: 0, Errors: 0, Skipped: 0, Time elapsed: 1.25 sec - in org.apache.hadoop.hbase.filter.TestNullComparator
Running org.apache.hadoop.hbase.replication.TestReplicationWALEntryFilters
Tests run: 4, Failures: 0, Errors: 0, Skipped: 0, Time elapsed: 2.608 sec - in org.apache.hadoop.hbase.replication.TestReplicationWALEntryFilters
Running org.apache.hadoop.hbase.replication.regionserver.TestReplicationThrottler
Tests run: 1, Failures: 0, Errors: 0, Skipped: 0, Time elapsed: 1.233 sec - in org.apache.hadoop.hbase.replication.regionserver.TestReplicationThrottler
Running org.apache.hadoop.hbase.replication.regionserver.TestReplicationSinkManager
Tests run: 5, Failures: 0, Errors: 0, Skipped: 0, Time elapsed: 4.094 sec - in org.apache.hadoop.hbase.replication.regionserver.TestReplicationSinkManager
Running org.apache.hadoop.hbase.protobuf.TestProtobufUtil
Tests run: 7, Failures: 0, Errors: 0, Skipped: 0, Time elapsed: 5.968 sec - in org.apache.hadoop.hbase.protobuf.TestProtobufUtil
Running org.apache.hadoop.hbase.protobuf.TestReplicationProtobuf
Tests run: 1, Failures: 0, Errors: 0, Skipped: 0, Time elapsed: 1.148 sec - in org.apache.hadoop.hbase.protobuf.TestReplicationProtobuf
Running org.apache.hadoop.hbase.master.normalizer.TestSimpleRegionNormalizer
Tests run: 7, Failures: 0, Errors: 0, Skipped: 0, Time elapsed: 5.784 sec - in org.apache.hadoop.hbase.master.normalizer.TestSimpleRegionNormalizer
Running org.apache.hadoop.hbase.master.cleaner.TestReplicationHFileCleaner
Tests run: 3, Failures: 0, Errors: 0, Skipped: 0, Time elapsed: 2.652 sec - in org.apache.hadoop.hbase.master.cleaner.TestReplicationHFileCleaner
Running org.apache.hadoop.hbase.master.cleaner.TestCleanerChore
Tests run: 6, Failures: 0, Errors: 0, Skipped: 0, Time elapsed: 5.237 sec - in org.apache.hadoop.hbase.master.cleaner.TestCleanerChore
Running org.apache.hadoop.hbase.master.cleaner.TestHFileLinkCleaner
Tests run: 1, Failures: 0, Errors: 0, Skipped: 0, Time elapsed: 13.814 sec - in org.apache.hadoop.hbase.master.cleaner.TestHFileLinkCleaner
Running org.apache.hadoop.hbase.master.procedure.TestMasterProcedureScheduler
Tests run: 7, Failures: 0, Errors: 0, Skipped: 0, Time elapsed: 31.645 sec - in org.apache.hadoop.hbase.master.procedure.TestMasterProcedureScheduler
Running org.apache.hadoop.hbase.master.TestClockSkewDetection
Tests run: 1, Failures: 0, Errors: 0, Skipped: 0, Time elapsed: 2.194 sec - in org.apache.hadoop.hbase.master.TestClockSkewDetection
Running org.apache.hadoop.hbase.master.TestHMasterCommandLine
Tests run: 1, Failures: 0, Errors: 0, Skipped: 0, Time elapsed: 0.892 sec - in org.apache.hadoop.hbase.master.TestHMasterCommandLine
Running org.apache.hadoop.hbase.master.balancer.TestRegionLocationFinder
Tests run: 3, Failures: 0, Errors: 0, Skipped: 0, Time elapsed: 10.705 sec - in org.apache.hadoop.hbase.master.balancer.TestRegionLocationFinder
Running org.apache.hadoop.hbase.master.balancer.TestServerAndLoad
Tests run: 1, Failures: 0, Errors: 0, Skipped: 0, Time elapsed: 1.475 sec - in org.apache.hadoop.hbase.master.balancer.TestServerAndLoad
Running org.apache.hadoop.hbase.master.balancer.TestFavoredNodeAssignmentHelper
Tests run: 8, Failures: 0, Errors: 0, Skipped: 8, Time elapsed: 0.004 sec - in org.apache.hadoop.hbase.master.balancer.TestFavoredNodeAssignmentHelper
Running org.apache.hadoop.hbase.master.TestRegionStates
Tests run: 1, Failures: 0, Errors: 0, Skipped: 0, Time elapsed: 3.249 sec - in org.apache.hadoop.hbase.master.TestRegionStates
Running org.apache.hadoop.hbase.master.TestCatalogJanitor
Tests run: 7, Failures: 0, Errors: 0, Skipped: 0, Time elapsed: 19.803 sec - in org.apache.hadoop.hbase.master.TestCatalogJanitor
Running org.apache.hadoop.hbase.master.TestRegionPlan
Tests run: 1, Failures: 0, Errors: 0, Skipped: 0, Time elapsed: 1.825 sec - in org.apache.hadoop.hbase.master.TestRegionPlan
Running org.apache.hadoop.hbase.master.TestRegionState
Tests run: 1, Failures: 0, Errors: 0, Skipped: 0, Time elapsed: 5.127 sec - in org.apache.hadoop.hbase.master.TestRegionState
Running org.apache.hadoop.hbase.master.snapshot.TestSnapshotManager
Tests run: 2, Failures: 0, Errors: 0, Skipped: 0, Time elapsed: 2.593 sec - in org.apache.hadoop.hbase.master.snapshot.TestSnapshotManager
Running org.apache.hadoop.hbase.master.snapshot.TestSnapshotHFileCleaner
Tests run: 1, Failures: 0, Errors: 0, Skipped: 0, Time elapsed: 3.312 sec - in org.apache.hadoop.hbase.master.snapshot.TestSnapshotHFileCleaner
Running org.apache.hadoop.hbase.master.TestMasterQosFunction
Tests run: 2, Failures: 0, Errors: 0, Skipped: 0, Time elapsed: 8.484 sec - in org.apache.hadoop.hbase.master.TestMasterQosFunction
Running org.apache.hadoop.hbase.TestTagRewriteCell
Tests run: 1, Failures: 0, Errors: 0, Skipped: 0, Time elapsed: 1.032 sec - in org.apache.hadoop.hbase.TestTagRewriteCell

Results :

Tests in error: 
org.apache.hadoop.hbase.ipc.TestRpcMetrics.testSourceMethods(org.apache.hadoop.hbase.ipc.TestRpcMetrics)
  Run 1: TestRpcMetrics.testSourceMethods:89 » NullPointer
  Run 2: TestRpcMetrics.testSourceMethods:89 » NullPointer
  Run 3: TestRpcMetrics.testSourceMethods:89 » NullPointer

org.apache.hadoop.hbase.ipc.TestRpcMetrics.testWrapperSource(org.apache.hadoop.hbase.ipc.TestRpcMetrics)
  Run 1: TestRpcMetrics.testWrapperSource:67 » NullPointer
  Run 2: TestRpcMetrics.testWrapperSource:67 » NullPointer
  Run 3: TestRpcMetrics.testWrapperSource:67 » NullPointer

org.apache.hadoop.hbase.regionserver.TestMetricsRegion.testRegionWrapperMetrics(org.apache.hadoop.hbase.regionserver.TestMetricsRegion)
  Run 1: TestMetricsRegion.testRegionWrapperMetrics:38 » NullPointer
  Run 2: TestMetricsRegion.testRegionWrapperMetrics:38 » NullPointer
  Run 3: TestMetricsRegion.testRegionWrapperMetrics:38 » NullPointer

org.apache.hadoop.hbase.regionserver.TestMetricsRegionServer.testSlowCount(org.apache.hadoop.hbase.regionserver.TestMetricsRegionServer)
  Run 1: TestMetricsRegionServer.testSlowCount:126 » NullPointer
  Run 2: TestMetricsRegionServer.testSlowCount:126 » NullPointer
  Run 3: TestMetricsRegionServer.testSlowCount:126 » NullPointer

org.apache.hadoop.hbase.regionserver.TestMetricsRegionServer.testWrapperSource(org.apache.hadoop.hbase.regionserver.TestMetricsRegionServer)
  Run 1: TestMetricsRegionServer.testWrapperSource:56 » NullPointer
  Run 2: TestMetricsRegionServer.testWrapperSource:56 » NullPointer
  Run 3: TestMetricsRegionServer.testWrapperSource:56 » NullPointer

Flaked tests: 
org.apache.hadoop.hbase.ipc.TestAsyncIPC.testRTEDuringAsyncConnectionSetup[0](org.apache.hadoop.hbase.ipc.TestAsyncIPC)
  Run 1: TestAsyncIPC.testRTEDuringAsyncConnectionSetup:229 Waiting timed out after [1,000]
msec
  Run 2: PASS


Tests run: 1003, Failures: 0, Errors: 5, Skipped: 20, Flakes: 1

[INFO] ------------------------------------------------------------------------
[INFO] Reactor Summary:
[INFO] 
[INFO] Apache HBase ...................................... SUCCESS [1:36.951s]
[INFO] Apache HBase - Checkstyle ......................... SUCCESS [10.415s]
[INFO] Apache HBase - Resource Bundle .................... SUCCESS [0.711s]
[INFO] Apache HBase - Annotations ........................ SUCCESS [4.482s]
[INFO] Apache HBase - Protocol ........................... SUCCESS [42.621s]
[INFO] Apache HBase - Common ............................. SUCCESS [5:43.881s]
[INFO] Apache HBase - Procedure .......................... SUCCESS [5:43.929s]
[INFO] Apache HBase - Client ............................. SUCCESS [3:15.232s]
[INFO] Apache HBase - Hadoop Compatibility ............... SUCCESS [19.620s]
[INFO] Apache HBase - Hadoop Two Compatibility ........... SUCCESS [33.006s]
[INFO] Apache HBase - Prefix Tree ........................ SUCCESS [41.228s]
[INFO] Apache HBase - Server ............................. FAILURE [58:47.177s]
[INFO] Apache HBase - Testing Util ....................... SKIPPED
[INFO] Apache HBase - Thrift ............................. SKIPPED
[INFO] Apache HBase - Rest ............................... SKIPPED
[INFO] Apache HBase - Shell .............................. SKIPPED
[INFO] Apache HBase - Integration Tests .................. SKIPPED
[INFO] Apache HBase - Examples ........................... SKIPPED
[INFO] Apache HBase - External Block Cache ............... SKIPPED
[INFO] Apache HBase - Assembly ........................... SKIPPED
[INFO] Apache HBase - Shaded ............................. SKIPPED
[INFO] Apache HBase - Shaded - Client .................... SKIPPED
[INFO] Apache HBase - Shaded - Server .................... SKIPPED
[INFO] ------------------------------------------------------------------------
[INFO] BUILD FAILURE
[INFO] ------------------------------------------------------------------------
[INFO] Total time: 1:18:16.262s
[INFO] Finished at: Thu Feb 25 02:06:49 UTC 2016
[INFO] Final Memory: 96M/864M
[INFO] ------------------------------------------------------------------------
[ERROR] Failed to execute goal org.apache.maven.plugins:maven-surefire-plugin:2.18.1:test
(default-test) on project hbase-server: There are test failures.
[ERROR] 
[ERROR] Please refer to <https://builds.apache.org/job/HBase-1.3/jdk=latest1.7,label=yahoo-not-h2/ws/hbase-server/target/surefire-reports>
for the individual test results.
[ERROR] -> [Help 1]
[ERROR] 
[ERROR] To see the full stack trace of the errors, re-run Maven with the -e switch.
[ERROR] Re-run Maven using the -X switch to enable full debug logging.
[ERROR] 
[ERROR] For more information about the errors and possible solutions, please read the following
articles:
[ERROR] [Help 1] http://cwiki.apache.org/confluence/display/MAVEN/MojoFailureException
[ERROR] 
[ERROR] After correcting the problems, you can resume the build with the command
[ERROR]   mvn <goals> -rf :hbase-server
Build step 'Invoke top-level Maven targets' marked build as failure
Performing Post build task...
Match found for :.* : True
Logical operation result is TRUE
Running script  : # Post-build task script. TODO: Check this in and have all builds reference
check-in.
pwd && ls
# NOTE!!!! The below code has been copied and pasted from ./dev-tools/run-test.sh
# Do not change here without syncing there and vice-versa.
ZOMBIE_TESTS_COUNT=`jps -v | grep surefirebooter | grep -e '-Dhbase.test' | wc -l`
if [[ $ZOMBIE_TESTS_COUNT != 0 ]] ; then
 echo "Suspicious java process found - waiting 30s to see if there are just slow to stop"
 sleep 30
 ZOMBIE_TESTS_COUNT=`jps -v | grep surefirebooter | grep -e '-Dhbase.test' | wc -l`
 if [[ $ZOMBIE_TESTS_COUNT != 0 ]] ; then
   echo " {color:red}There appear to be $ZOMBIE_TESTS_COUNT zombie tests{color}, they should
have been killed by surefire but survived"
   jps -v | grep surefirebooter | grep -e '-Dhbase.test'
   jps -v | grep surefirebooter | grep -e '-Dhbase.test' | cut -d ' ' -f 1 | xargs -n 1 jstack
   # Exit with error
   exit 1
 else
   echo "We're ok: there is no zombie test, but some tests took some time to stop"
 fi
else
  echo "We're ok: there is no zombie test"
fi
[yahoo-not-h2] $ /bin/bash -xe /tmp/hudson1550337214323667701.sh
+ pwd
<https://builds.apache.org/job/HBase-1.3/jdk=latest1.7,label=yahoo-not-h2/ws/>
+ ls
bin
CHANGES.txt
conf
dev-support
hbase-annotations
hbase-assembly
hbase-checkstyle
hbase-client
hbase-common
hbase-examples
hbase-external-blockcache
hbase-hadoop2-compat
hbase-hadoop-compat
hbase-it
hbase-native-client
hbase-prefix-tree
hbase-procedure
hbase-protocol
hbase-resource-bundle
hbase-rest
hbase-server
hbase-shaded
hbase-shell
hbase-testing-util
hbase-thrift
LICENSE.txt
NOTICE.txt
pom.xml
README.txt
src
target
++ jps -v
++ grep surefirebooter
++ grep -e -Dhbase.test
++ wc -l
+ ZOMBIE_TESTS_COUNT=0
+ [[ 0 != 0 ]]
+ echo 'We'\''re ok: there is no zombie test'
We're ok: there is no zombie test
POST BUILD TASK : SUCCESS
END OF POST BUILD TASK : 0
Archiving artifacts
Recording test results

Mime
View raw message