hbase-builds mailing list archives

Site index · List index
Message view « Date » · « Thread »
Top « Date » · « Thread »
From Apache Jenkins Server <jenk...@builds.apache.org>
Subject Build failed in Jenkins: HBase-1.3 » latest1.8,yahoo-not-h2 #541
Date Sat, 06 Feb 2016 04:03:05 GMT
See <https://builds.apache.org/job/HBase-1.3/jdk=latest1.8,label=yahoo-not-h2/541/changes>

Changes:

[anoopsamjohn] HBASE-15214 Valid mutate Ops fail with RPC Codec in use and region moves

------------------------------------------
[...truncated 46064 lines...]
Java HotSpot(TM) 64-Bit Server VM warning: ignoring option MaxPermSize=256m; support was removed
in 8.0
Running org.apache.hadoop.hbase.regionserver.handler.TestOpenRegionHandler
Tests run: 6, Failures: 0, Errors: 0, Skipped: 0, Time elapsed: 4.724 sec - in org.apache.hadoop.hbase.regionserver.handler.TestOpenRegionHandler
Java HotSpot(TM) 64-Bit Server VM warning: ignoring option MaxPermSize=256m; support was removed
in 8.0
Running org.apache.hadoop.hbase.regionserver.handler.TestCloseRegionHandler
Tests run: 3, Failures: 0, Errors: 0, Skipped: 0, Time elapsed: 3.66 sec - in org.apache.hadoop.hbase.regionserver.handler.TestCloseRegionHandler
Java HotSpot(TM) 64-Bit Server VM warning: ignoring option MaxPermSize=256m; support was removed
in 8.0
Running org.apache.hadoop.hbase.regionserver.TestMasterAddressTracker
Tests run: 24, Failures: 0, Errors: 0, Skipped: 0, Time elapsed: 40.579 sec - in org.apache.hadoop.hbase.regionserver.TestDefaultMemStore
Tests run: 5, Failures: 0, Errors: 0, Skipped: 0, Time elapsed: 1.554 sec - in org.apache.hadoop.hbase.regionserver.TestMasterAddressTracker
Java HotSpot(TM) 64-Bit Server VM warning: ignoring option MaxPermSize=256m; support was removed
in 8.0
Java HotSpot(TM) 64-Bit Server VM warning: ignoring option MaxPermSize=256m; support was removed
in 8.0
Running org.apache.hadoop.hbase.regionserver.TestParallelPut
Tests run: 2, Failures: 0, Errors: 0, Skipped: 0, Time elapsed: 10.505 sec - in org.apache.hadoop.hbase.regionserver.TestParallelPut
Java HotSpot(TM) 64-Bit Server VM warning: ignoring option MaxPermSize=256m; support was removed
in 8.0
Java HotSpot(TM) 64-Bit Server VM warning: ignoring option MaxPermSize=256m; support was removed
in 8.0
Running org.apache.hadoop.hbase.regionserver.TestSplitTransactionOnCluster
Running org.apache.hadoop.hbase.regionserver.TestRegionServerOnlineConfigChange
Tests run: 2, Failures: 0, Errors: 0, Skipped: 0, Time elapsed: 2.591 sec - in org.apache.hadoop.hbase.regionserver.TestRegionServerOnlineConfigChange
Java HotSpot(TM) 64-Bit Server VM warning: ignoring option MaxPermSize=256m; support was removed
in 8.0
Java HotSpot(TM) 64-Bit Server VM warning: ignoring option MaxPermSize=256m; support was removed
in 8.0
Running org.apache.hadoop.hbase.regionserver.TestCorruptedRegionStoreFile
Tests run: 3, Failures: 0, Errors: 0, Skipped: 0, Time elapsed: 113.682 sec - in org.apache.hadoop.hbase.regionserver.throttle.TestCompactionWithThroughputController
Java HotSpot(TM) 64-Bit Server VM warning: ignoring option MaxPermSize=256m; support was removed
in 8.0
Running org.apache.hadoop.hbase.regionserver.TestRegionIncrement
Tests run: 4, Failures: 0, Errors: 0, Skipped: 0, Time elapsed: 23.143 sec - in org.apache.hadoop.hbase.regionserver.TestRegionIncrement
Java HotSpot(TM) 64-Bit Server VM warning: ignoring option MaxPermSize=256m; support was removed
in 8.0
Java HotSpot(TM) 64-Bit Server VM warning: ignoring option MaxPermSize=256m; support was removed
in 8.0
Java HotSpot(TM) 64-Bit Server VM warning: ignoring option MaxPermSize=256m; support was removed
in 8.0
Running org.apache.hadoop.hbase.regionserver.TestCompaction
Tests run: 3, Failures: 0, Errors: 0, Skipped: 0, Time elapsed: 172.978 sec - in org.apache.hadoop.hbase.regionserver.throttle.TestFlushWithThroughputController
Java HotSpot(TM) 64-Bit Server VM warning: ignoring option MaxPermSize=256m; support was removed
in 8.0
Java HotSpot(TM) 64-Bit Server VM warning: ignoring option MaxPermSize=256m; support was removed
in 8.0
Tests run: 5, Failures: 0, Errors: 0, Skipped: 0, Time elapsed: 35.823 sec - in org.apache.hadoop.hbase.regionserver.TestCompaction
Java HotSpot(TM) 64-Bit Server VM warning: ignoring option MaxPermSize=256m; support was removed
in 8.0
Running org.apache.hadoop.hbase.regionserver.TestRegionMergeTransactionOnCluster
Running org.apache.hadoop.hbase.regionserver.TestRemoveRegionMetrics
Tests run: 17, Failures: 0, Errors: 0, Skipped: 0, Time elapsed: 157.24 sec - in org.apache.hadoop.hbase.regionserver.TestSplitTransactionOnCluster
Java HotSpot(TM) 64-Bit Server VM warning: ignoring option MaxPermSize=256m; support was removed
in 8.0
Running org.apache.hadoop.hbase.regionserver.TestRecoveredEdits
Tests run: 4, Failures: 0, Errors: 0, Skipped: 0, Time elapsed: 48.433 sec - in org.apache.hadoop.hbase.regionserver.TestRegionMergeTransactionOnCluster
Java HotSpot(TM) 64-Bit Server VM warning: ignoring option MaxPermSize=256m; support was removed
in 8.0
Running org.apache.hadoop.hbase.regionserver.TestGetClosestAtOrBefore
Tests run: 3, Failures: 0, Errors: 0, Skipped: 0, Time elapsed: 4.293 sec - in org.apache.hadoop.hbase.regionserver.TestGetClosestAtOrBefore
Java HotSpot(TM) 64-Bit Server VM warning: ignoring option MaxPermSize=256m; support was removed
in 8.0
Running org.apache.hadoop.hbase.regionserver.TestCompoundBloomFilter
Tests run: 1, Failures: 0, Errors: 0, Skipped: 0, Time elapsed: 19.363 sec - in org.apache.hadoop.hbase.regionserver.TestRecoveredEdits
Java HotSpot(TM) 64-Bit Server VM warning: ignoring option MaxPermSize=256m; support was removed
in 8.0
Running org.apache.hadoop.hbase.regionserver.TestRegionServerReportForDuty
Tests run: 1, Failures: 0, Errors: 0, Skipped: 0, Time elapsed: 31.374 sec - in org.apache.hadoop.hbase.regionserver.TestRegionServerReportForDuty
Java HotSpot(TM) 64-Bit Server VM warning: ignoring option MaxPermSize=256m; support was removed
in 8.0
Tests run: 2, Failures: 0, Errors: 0, Skipped: 0, Time elapsed: 189.361 sec - in org.apache.hadoop.hbase.regionserver.TestCorruptedRegionStoreFile
Java HotSpot(TM) 64-Bit Server VM warning: ignoring option MaxPermSize=256m; support was removed
in 8.0
Java HotSpot(TM) 64-Bit Server VM warning: ignoring option MaxPermSize=256m; support was removed
in 8.0
Java HotSpot(TM) 64-Bit Server VM warning: ignoring option MaxPermSize=256m; support was removed
in 8.0
Java HotSpot(TM) 64-Bit Server VM warning: ignoring option MaxPermSize=256m; support was removed
in 8.0
Java HotSpot(TM) 64-Bit Server VM warning: ignoring option MaxPermSize=256m; support was removed
in 8.0
Java HotSpot(TM) 64-Bit Server VM warning: ignoring option MaxPermSize=256m; support was removed
in 8.0
Java HotSpot(TM) 64-Bit Server VM warning: ignoring option MaxPermSize=256m; support was removed
in 8.0
Running org.apache.hadoop.hbase.regionserver.TestHRegion
Java HotSpot(TM) 64-Bit Server VM warning: ignoring option MaxPermSize=256m; support was removed
in 8.0
Running org.apache.hadoop.hbase.regionserver.compactions.TestCompactedHFilesDischarger
Tests run: 3, Failures: 0, Errors: 0, Skipped: 0, Time elapsed: 7.167 sec - in org.apache.hadoop.hbase.regionserver.compactions.TestCompactedHFilesDischarger
Java HotSpot(TM) 64-Bit Server VM warning: ignoring option MaxPermSize=256m; support was removed
in 8.0
Running org.apache.hadoop.hbase.regionserver.compactions.TestFIFOCompactionPolicy
Tests run: 5, Failures: 0, Errors: 0, Skipped: 0, Time elapsed: 398.471 sec - in org.apache.hadoop.hbase.regionserver.wal.TestLogRolling
Java HotSpot(TM) 64-Bit Server VM warning: ignoring option MaxPermSize=256m; support was removed
in 8.0
Running org.apache.hadoop.hbase.regionserver.TestAtomicOperation
Tests run: 1, Failures: 0, Errors: 0, Skipped: 0, Time elapsed: 165.944 sec - in org.apache.hadoop.hbase.regionserver.TestRemoveRegionMetrics
Java HotSpot(TM) 64-Bit Server VM warning: ignoring option MaxPermSize=256m; support was removed
in 8.0
Java HotSpot(TM) 64-Bit Server VM warning: ignoring option MaxPermSize=256m; support was removed
in 8.0
Running org.apache.hadoop.hbase.regionserver.TestFSErrorsExposed
Tests run: 4, Failures: 0, Errors: 0, Skipped: 0, Time elapsed: 72.731 sec - in org.apache.hadoop.hbase.regionserver.compactions.TestFIFOCompactionPolicy
Java HotSpot(TM) 64-Bit Server VM warning: ignoring option MaxPermSize=256m; support was removed
in 8.0
Running org.apache.hadoop.hbase.regionserver.TestRSKilledWhenInitializing
Tests run: 1, Failures: 0, Errors: 0, Skipped: 0, Time elapsed: 24.73 sec - in org.apache.hadoop.hbase.regionserver.TestRSKilledWhenInitializing
Java HotSpot(TM) 64-Bit Server VM warning: ignoring option MaxPermSize=256m; support was removed
in 8.0
Java HotSpot(TM) 64-Bit Server VM warning: ignoring option MaxPermSize=256m; support was removed
in 8.0
Running org.apache.hadoop.hbase.regionserver.TestMultiColumnScanner
Tests run: 3, Failures: 0, Errors: 0, Skipped: 0, Time elapsed: 51.385 sec - in org.apache.hadoop.hbase.regionserver.TestFSErrorsExposed
Java HotSpot(TM) 64-Bit Server VM warning: ignoring option MaxPermSize=256m; support was removed
in 8.0
Java HotSpot(TM) 64-Bit Server VM warning: ignoring option MaxPermSize=256m; support was removed
in 8.0
Java HotSpot(TM) 64-Bit Server VM warning: ignoring option MaxPermSize=256m; support was removed
in 8.0
Running org.apache.hadoop.hbase.regionserver.TestFlushRegionEntry
Tests run: 1, Failures: 0, Errors: 0, Skipped: 0, Time elapsed: 1.785 sec - in org.apache.hadoop.hbase.regionserver.TestFlushRegionEntry
Java HotSpot(TM) 64-Bit Server VM warning: ignoring option MaxPermSize=256m; support was removed
in 8.0
Running org.apache.hadoop.hbase.regionserver.TestStore
Tests run: 9, Failures: 1, Errors: 0, Skipped: 0, Time elapsed: 121.597 sec <<< FAILURE!
- in org.apache.hadoop.hbase.regionserver.TestAtomicOperation
testMultiRowMutationMultiThreads(org.apache.hadoop.hbase.regionserver.TestAtomicOperation)
 Time elapsed: 15.783 sec  <<< FAILURE!
java.lang.AssertionError: expected:<0> but was:<1>
	at org.junit.Assert.fail(Assert.java:88)
	at org.junit.Assert.failNotEquals(Assert.java:834)
	at org.junit.Assert.assertEquals(Assert.java:645)
	at org.junit.Assert.assertEquals(Assert.java:631)
	at org.apache.hadoop.hbase.regionserver.TestAtomicOperation.testMultiRowMutationMultiThreads(TestAtomicOperation.java:570)

Tests run: 18, Failures: 0, Errors: 0, Skipped: 0, Time elapsed: 19.024 sec - in org.apache.hadoop.hbase.regionserver.TestStore
Java HotSpot(TM) 64-Bit Server VM warning: ignoring option MaxPermSize=256m; support was removed
in 8.0
Java HotSpot(TM) 64-Bit Server VM warning: ignoring option MaxPermSize=256m; support was removed
in 8.0
Java HotSpot(TM) 64-Bit Server VM warning: ignoring option MaxPermSize=256m; support was removed
in 8.0
Tests run: 1, Failures: 0, Errors: 0, Skipped: 0, Time elapsed: 130.292 sec - in org.apache.hadoop.hbase.regionserver.TestAtomicOperation
Java HotSpot(TM) 64-Bit Server VM warning: ignoring option MaxPermSize=256m; support was removed
in 8.0
Running org.apache.hadoop.hbase.TestMetaTableLocator
Java HotSpot(TM) 64-Bit Server VM warning: ignoring option MaxPermSize=256m; support was removed
in 8.0
Java HotSpot(TM) 64-Bit Server VM warning: ignoring option MaxPermSize=256m; support was removed
in 8.0
Java HotSpot(TM) 64-Bit Server VM warning: ignoring option MaxPermSize=256m; support was removed
in 8.0
Java HotSpot(TM) 64-Bit Server VM warning: ignoring option MaxPermSize=256m; support was removed
in 8.0
Tests run: 102, Failures: 0, Errors: 0, Skipped: 0, Time elapsed: 173.071 sec - in org.apache.hadoop.hbase.regionserver.TestHRegion
Java HotSpot(TM) 64-Bit Server VM warning: ignoring option MaxPermSize=256m; support was removed
in 8.0
Tests run: 7, Failures: 0, Errors: 0, Skipped: 0, Time elapsed: 6.145 sec - in org.apache.hadoop.hbase.TestMetaTableLocator
Java HotSpot(TM) 64-Bit Server VM warning: ignoring option MaxPermSize=256m; support was removed
in 8.0
Java HotSpot(TM) 64-Bit Server VM warning: ignoring option MaxPermSize=256m; support was removed
in 8.0
Running org.apache.hadoop.hbase.namespace.TestNamespaceAuditor
Running org.apache.hadoop.hbase.TestStochasticBalancerJmxMetrics
Tests run: 2, Failures: 0, Errors: 0, Skipped: 0, Time elapsed: 2.343 sec - in org.apache.hadoop.hbase.TestStochasticBalancerJmxMetrics
Tests run: 12, Failures: 0, Errors: 0, Skipped: 0, Time elapsed: 104.245 sec - in org.apache.hadoop.hbase.regionserver.TestMultiColumnScanner
Tests run: 3, Failures: 0, Errors: 0, Skipped: 0, Time elapsed: 297.735 sec - in org.apache.hadoop.hbase.regionserver.TestCompoundBloomFilter
Tests run: 12, Failures: 0, Errors: 0, Skipped: 1, Time elapsed: 165.41 sec - in org.apache.hadoop.hbase.namespace.TestNamespaceAuditor

Results :

Tests in error: 
org.apache.hadoop.hbase.coprocessor.TestRowProcessorEndpoint.testReadModifyWrite(org.apache.hadoop.hbase.coprocessor.TestRowProcessorEndpoint)
  Run 1: TestRowProcessorEndpoint.testReadModifyWrite:184 expected:<101> but was:<100>
  Run 2: TestRowProcessorEndpoint.testReadModifyWrite:183->incrementCounter:206 » Service

Flaked tests: 
org.apache.hadoop.hbase.regionserver.TestAtomicOperation.testMultiRowMutationMultiThreads(org.apache.hadoop.hbase.regionserver.TestAtomicOperation)
  Run 1: TestAtomicOperation.testMultiRowMutationMultiThreads:570 expected:<0> but was:<1>
  Run 2: PASS


Tests run: 2474, Failures: 0, Errors: 1, Skipped: 40, Flakes: 1

[INFO] ------------------------------------------------------------------------
[INFO] Reactor Summary:
[INFO] 
[INFO] Apache HBase ...................................... SUCCESS [1:02.077s]
[INFO] Apache HBase - Checkstyle ......................... SUCCESS [5.669s]
[INFO] Apache HBase - Resource Bundle .................... SUCCESS [0.202s]
[INFO] Apache HBase - Annotations ........................ SUCCESS [1.698s]
[INFO] Apache HBase - Protocol ........................... SUCCESS [22.538s]
[INFO] Apache HBase - Common ............................. SUCCESS [2:28.756s]
[INFO] Apache HBase - Procedure .......................... SUCCESS [3:51.901s]
[INFO] Apache HBase - Client ............................. SUCCESS [1:32.445s]
[INFO] Apache HBase - Hadoop Compatibility ............... SUCCESS [9.714s]
[INFO] Apache HBase - Hadoop Two Compatibility ........... SUCCESS [12.249s]
[INFO] Apache HBase - Prefix Tree ........................ SUCCESS [12.402s]
[INFO] Apache HBase - Server ............................. FAILURE [2:11:24.277s]
[INFO] Apache HBase - Testing Util ....................... SKIPPED
[INFO] Apache HBase - Thrift ............................. SKIPPED
[INFO] Apache HBase - Rest ............................... SKIPPED
[INFO] Apache HBase - Shell .............................. SKIPPED
[INFO] Apache HBase - Integration Tests .................. SKIPPED
[INFO] Apache HBase - Examples ........................... SKIPPED
[INFO] Apache HBase - External Block Cache ............... SKIPPED
[INFO] Apache HBase - Assembly ........................... SKIPPED
[INFO] Apache HBase - Shaded ............................. SKIPPED
[INFO] Apache HBase - Shaded - Client .................... SKIPPED
[INFO] Apache HBase - Shaded - Server .................... SKIPPED
[INFO] ------------------------------------------------------------------------
[INFO] BUILD FAILURE
[INFO] ------------------------------------------------------------------------
[INFO] Total time: 2:21:44.752s
[INFO] Finished at: Sat Feb 06 03:59:28 UTC 2016
[INFO] Final Memory: 95M/1138M
[INFO] ------------------------------------------------------------------------
[ERROR] Failed to execute goal org.apache.maven.plugins:maven-surefire-plugin:2.18.1:test
(secondPartTestsExecution) on project hbase-server: ExecutionException: java.lang.RuntimeException:
java.lang.RuntimeException: org.apache.maven.surefire.report.ReporterException: When writing
xml report stdout/stderr: /tmp/stderr2355819549144886629deferred (No such file or directory)
-> [Help 1]
[ERROR] 
[ERROR] To see the full stack trace of the errors, re-run Maven with the -e switch.
[ERROR] Re-run Maven using the -X switch to enable full debug logging.
[ERROR] 
[ERROR] For more information about the errors and possible solutions, please read the following
articles:
[ERROR] [Help 1] http://cwiki.apache.org/confluence/display/MAVEN/MojoFailureException
[ERROR] 
[ERROR] After correcting the problems, you can resume the build with the command
[ERROR]   mvn <goals> -rf :hbase-server
Build step 'Invoke top-level Maven targets' marked build as failure
Performing Post build task...
Match found for :.* : True
Logical operation result is TRUE
Running script  : # Post-build task script. TODO: Check this in and have all builds reference
check-in.
pwd && ls
# NOTE!!!! The below code has been copied and pasted from ./dev-tools/run-test.sh
# Do not change here without syncing there and vice-versa.
ZOMBIE_TESTS_COUNT=`jps -v | grep surefirebooter | grep -e '-Dhbase.test' | wc -l`
if [[ $ZOMBIE_TESTS_COUNT != 0 ]] ; then
 echo "Suspicious java process found - waiting 30s to see if there are just slow to stop"
 sleep 30
 ZOMBIE_TESTS_COUNT=`jps -v | grep surefirebooter | grep -e '-Dhbase.test' | wc -l`
 if [[ $ZOMBIE_TESTS_COUNT != 0 ]] ; then
   echo " {color:red}There appear to be $ZOMBIE_TESTS_COUNT zombie tests{color}, they should
have been killed by surefire but survived"
   jps -v | grep surefirebooter | grep -e '-Dhbase.test'
   jps -v | grep surefirebooter | grep -e '-Dhbase.test' | cut -d ' ' -f 1 | xargs -n 1 jstack
   # Exit with error
   exit 1
 else
   echo "We're ok: there is no zombie test, but some tests took some time to stop"
 fi
else
  echo "We're ok: there is no zombie test"
fi
[yahoo-not-h2] $ /bin/bash -xe /tmp/hudson4958605456885540776.sh
+ pwd
<https://builds.apache.org/job/HBase-1.3/jdk=latest1.8,label=yahoo-not-h2/ws/>
+ ls
bin
CHANGES.txt
conf
dev-support
hbase-annotations
hbase-assembly
hbase-checkstyle
hbase-client
hbase-common
hbase-examples
hbase-external-blockcache
hbase-hadoop2-compat
hbase-hadoop-compat
hbase-it
hbase-native-client
hbase-prefix-tree
hbase-procedure
hbase-protocol
hbase-resource-bundle
hbase-rest
hbase-server
hbase-shaded
hbase-shell
hbase-testing-util
hbase-thrift
LICENSE.txt
NOTICE.txt
pom.xml
README.txt
src
target
++ jps -v
++ grep surefirebooter
++ grep -e -Dhbase.test
++ wc -l
+ ZOMBIE_TESTS_COUNT=0
+ [[ 0 != 0 ]]
+ echo 'We'\''re ok: there is no zombie test'
We're ok: there is no zombie test
POST BUILD TASK : SUCCESS
END OF POST BUILD TASK : 0
Archiving artifacts
Recording test results

Mime
View raw message