hbase-builds mailing list archives

Site index · List index
Message view « Date » · « Thread »
Top « Date » · « Thread »
From Apache Jenkins Server <jenk...@builds.apache.org>
Subject Build failed in Jenkins: HBase-0.98-matrix » latest1.6,yahoo-not-h2 #298
Date Sat, 13 Feb 2016 16:46:39 GMT
See <https://builds.apache.org/job/HBase-0.98-matrix/jdk=latest1.6,label=yahoo-not-h2/298/changes>

Changes:

[zhangduo] HBASE-15152 Addendum fix hadoop-1.1 compat for 0.98

[tedyu] HBASE-15219 Revert pending verification of test result

[apurtell] Revert "HBASE-15079 TestMultiParallel.validateLoadedData AssertionError:

------------------------------------------
[...truncated 1960 lines...]
	at org.apache.hadoop.hbase.mapreduce.TestCopyTable.testCopyTableWithBulkload(TestCopyTable.java:131)

Running org.apache.hadoop.hbase.mapreduce.TestImportTSVWithOperationAttributes
Tests run: 2, Failures: 1, Errors: 0, Skipped: 0, Time elapsed: 69.548 sec <<< FAILURE!
- in org.apache.hadoop.hbase.mapreduce.TestImportTSVWithOperationAttributes
testMROnTableWithInvalidOperationAttr(org.apache.hadoop.hbase.mapreduce.TestImportTSVWithOperationAttributes)
 Time elapsed: 15.458 sec  <<< FAILURE!
java.lang.AssertionError: expected:<0> but was:<1>
	at org.junit.Assert.fail(Assert.java:88)
	at org.junit.Assert.failNotEquals(Assert.java:743)
	at org.junit.Assert.assertEquals(Assert.java:118)
	at org.junit.Assert.assertEquals(Assert.java:555)
	at org.junit.Assert.assertEquals(Assert.java:542)
	at org.apache.hadoop.hbase.mapreduce.TestImportTSVWithOperationAttributes.doMROnTableTest(TestImportTSVWithOperationAttributes.java:175)
	at org.apache.hadoop.hbase.mapreduce.TestImportTSVWithOperationAttributes.testMROnTableWithInvalidOperationAttr(TestImportTSVWithOperationAttributes.java:137)

Running org.apache.hadoop.hbase.mapreduce.TestRowCounter
Tests run: 6, Failures: 0, Errors: 0, Skipped: 0, Time elapsed: 185.423 sec - in org.apache.hadoop.hbase.mapreduce.TestRowCounter
Running org.apache.hadoop.hbase.mapreduce.TestImportTsv
Tests run: 9, Failures: 2, Errors: 0, Skipped: 0, Time elapsed: 290.828 sec <<< FAILURE!
- in org.apache.hadoop.hbase.mapreduce.TestImportTsv
testMROnTable(org.apache.hadoop.hbase.mapreduce.TestImportTsv)  Time elapsed: 138.216 sec
 <<< FAILURE!
java.lang.AssertionError: expected:<0> but was:<1>
	at org.junit.Assert.fail(Assert.java:88)
	at org.junit.Assert.failNotEquals(Assert.java:743)
	at org.junit.Assert.assertEquals(Assert.java:118)
	at org.junit.Assert.assertEquals(Assert.java:555)
	at org.junit.Assert.assertEquals(Assert.java:542)
	at org.apache.hadoop.hbase.mapreduce.TestImportTsv.doMROnTableTest(TestImportTsv.java:294)
	at org.apache.hadoop.hbase.mapreduce.TestImportTsv.testMROnTable(TestImportTsv.java:114)

testMROnTableWithCustomMapper(org.apache.hadoop.hbase.mapreduce.TestImportTsv)  Time elapsed:
14.242 sec  <<< FAILURE!
java.lang.AssertionError: expected:<0> but was:<1>
	at org.junit.Assert.fail(Assert.java:88)
	at org.junit.Assert.failNotEquals(Assert.java:743)
	at org.junit.Assert.assertEquals(Assert.java:118)
	at org.junit.Assert.assertEquals(Assert.java:555)
	at org.junit.Assert.assertEquals(Assert.java:542)
	at org.apache.hadoop.hbase.mapreduce.TestImportTsv.doMROnTableTest(TestImportTsv.java:294)
	at org.apache.hadoop.hbase.mapreduce.TestImportTsv.testMROnTableWithCustomMapper(TestImportTsv.java:149)

Running org.apache.hadoop.hbase.mapreduce.TestLoadIncrementalHFilesUseSecurityEndPoint
Tests run: 21, Failures: 0, Errors: 0, Skipped: 0, Time elapsed: 25.727 sec - in org.apache.hadoop.hbase.mapreduce.TestLoadIncrementalHFilesUseSecurityEndPoint
Running org.apache.hadoop.hbase.mapreduce.TestBufferedHTable
Tests run: 2, Failures: 0, Errors: 0, Skipped: 0, Time elapsed: 1.295 sec - in org.apache.hadoop.hbase.mapreduce.TestBufferedHTable
Running org.apache.hadoop.hbase.mapreduce.TestSecureLoadIncrementalHFiles
Tests run: 21, Failures: 0, Errors: 0, Skipped: 0, Time elapsed: 26.582 sec - in org.apache.hadoop.hbase.mapreduce.TestSecureLoadIncrementalHFiles
Running org.apache.hadoop.hbase.mapreduce.TestTableInputFormat
Tests run: 6, Failures: 0, Errors: 0, Skipped: 0, Time elapsed: 31.569 sec - in org.apache.hadoop.hbase.mapreduce.TestTableInputFormat
Running org.apache.hadoop.hbase.mapreduce.TestTimeRangeMapRed
Tests run: 1, Failures: 0, Errors: 0, Skipped: 0, Time elapsed: 56.121 sec - in org.apache.hadoop.hbase.mapreduce.TestTimeRangeMapRed
Running org.apache.hadoop.hbase.mapreduce.TestTableSnapshotInputFormat
Tests run: 8, Failures: 0, Errors: 0, Skipped: 0, Time elapsed: 254.078 sec - in org.apache.hadoop.hbase.mapreduce.TestTableSnapshotInputFormat
Running org.apache.hadoop.hbase.mapreduce.TestImportTSVWithTTLs
Tests run: 1, Failures: 0, Errors: 0, Skipped: 0, Time elapsed: 50.968 sec - in org.apache.hadoop.hbase.mapreduce.TestImportTSVWithTTLs
Running org.apache.hadoop.hbase.mapreduce.TestLoadIncrementalHFiles
Tests run: 21, Failures: 0, Errors: 0, Skipped: 0, Time elapsed: 22.742 sec - in org.apache.hadoop.hbase.mapreduce.TestLoadIncrementalHFiles
Running org.apache.hadoop.hbase.mapreduce.TestHRegionPartitioner
Tests run: 1, Failures: 0, Errors: 0, Skipped: 0, Time elapsed: 2.763 sec - in org.apache.hadoop.hbase.mapreduce.TestHRegionPartitioner
Running org.apache.hadoop.hbase.mapreduce.TestLoadIncrementalHFilesSplitRecovery
Tests run: 5, Failures: 0, Errors: 0, Skipped: 0, Time elapsed: 13.621 sec - in org.apache.hadoop.hbase.mapreduce.TestLoadIncrementalHFilesSplitRecovery
Running org.apache.hadoop.hbase.mapreduce.TestImportTSVWithVisibilityLabels
Tests run: 7, Failures: 2, Errors: 0, Skipped: 0, Time elapsed: 196.799 sec <<< FAILURE!
- in org.apache.hadoop.hbase.mapreduce.TestImportTSVWithVisibilityLabels
testMROnTableWithDeletes(org.apache.hadoop.hbase.mapreduce.TestImportTSVWithVisibilityLabels)
 Time elapsed: 14.071 sec  <<< FAILURE!
java.lang.AssertionError: expected:<0> but was:<1>
	at org.junit.Assert.fail(Assert.java:88)
	at org.junit.Assert.failNotEquals(Assert.java:743)
	at org.junit.Assert.assertEquals(Assert.java:118)
	at org.junit.Assert.assertEquals(Assert.java:555)
	at org.junit.Assert.assertEquals(Assert.java:542)
	at org.apache.hadoop.hbase.mapreduce.TestImportTSVWithVisibilityLabels.doMROnTableTest(TestImportTSVWithVisibilityLabels.java:356)
	at org.apache.hadoop.hbase.mapreduce.TestImportTSVWithVisibilityLabels.doMROnTableTest(TestImportTSVWithVisibilityLabels.java:315)
	at org.apache.hadoop.hbase.mapreduce.TestImportTSVWithVisibilityLabels.testMROnTableWithDeletes(TestImportTSVWithVisibilityLabels.java:180)

testMROnTable(org.apache.hadoop.hbase.mapreduce.TestImportTSVWithVisibilityLabels)  Time elapsed:
16.175 sec  <<< FAILURE!
java.lang.AssertionError: expected:<0> but was:<1>
	at org.junit.Assert.fail(Assert.java:88)
	at org.junit.Assert.failNotEquals(Assert.java:743)
	at org.junit.Assert.assertEquals(Assert.java:118)
	at org.junit.Assert.assertEquals(Assert.java:555)
	at org.junit.Assert.assertEquals(Assert.java:542)
	at org.apache.hadoop.hbase.mapreduce.TestImportTSVWithVisibilityLabels.doMROnTableTest(TestImportTSVWithVisibilityLabels.java:356)
	at org.apache.hadoop.hbase.mapreduce.TestImportTSVWithVisibilityLabels.doMROnTableTest(TestImportTSVWithVisibilityLabels.java:315)
	at org.apache.hadoop.hbase.mapreduce.TestImportTSVWithVisibilityLabels.testMROnTable(TestImportTSVWithVisibilityLabels.java:165)

Running org.apache.hadoop.hbase.mapreduce.TestHFileOutputFormat
Tests run: 13, Failures: 0, Errors: 0, Skipped: 1, Time elapsed: 215.345 sec - in org.apache.hadoop.hbase.mapreduce.TestHFileOutputFormat
Running org.apache.hadoop.hbase.mapreduce.TestMultithreadedTableMapper
Tests run: 1, Failures: 1, Errors: 0, Skipped: 0, Time elapsed: 45.54 sec <<< FAILURE!
- in org.apache.hadoop.hbase.mapreduce.TestMultithreadedTableMapper
testMultithreadedTableMapper(org.apache.hadoop.hbase.mapreduce.TestMultithreadedTableMapper)
 Time elapsed: 15.335 sec  <<< FAILURE!
java.lang.AssertionError: null
	at org.junit.Assert.fail(Assert.java:86)
	at org.junit.Assert.assertTrue(Assert.java:41)
	at org.junit.Assert.assertTrue(Assert.java:52)
	at org.apache.hadoop.hbase.mapreduce.TestMultithreadedTableMapper.runTestOnTable(TestMultithreadedTableMapper.java:150)
	at org.apache.hadoop.hbase.mapreduce.TestMultithreadedTableMapper.testMultithreadedTableMapper(TestMultithreadedTableMapper.java:126)

Running org.apache.hadoop.hbase.mapreduce.TestHFileOutputFormat2
Tests run: 14, Failures: 0, Errors: 0, Skipped: 1, Time elapsed: 411.927 sec - in org.apache.hadoop.hbase.mapreduce.TestHFileOutputFormat2
Running org.apache.hadoop.hbase.mapreduce.TestTableInputFormatScan1
Tests run: 7, Failures: 0, Errors: 0, Skipped: 0, Time elapsed: 220.534 sec - in org.apache.hadoop.hbase.mapreduce.TestTableInputFormatScan1
Running org.apache.hadoop.hbase.mapreduce.TestCellCounter
Tests run: 7, Failures: 0, Errors: 0, Skipped: 0, Time elapsed: 162.674 sec - in org.apache.hadoop.hbase.mapreduce.TestCellCounter
Running org.apache.hadoop.hbase.mapreduce.TestMultiTableInputFormat
Tests run: 4, Failures: 0, Errors: 0, Skipped: 0, Time elapsed: 154.256 sec - in org.apache.hadoop.hbase.mapreduce.TestMultiTableInputFormat
Running org.apache.hadoop.hbase.mapreduce.TestSecureLoadIncrementalHFilesSplitRecovery
Tests run: 5, Failures: 0, Errors: 0, Skipped: 0, Time elapsed: 13.506 sec - in org.apache.hadoop.hbase.mapreduce.TestSecureLoadIncrementalHFilesSplitRecovery
Running org.apache.hadoop.hbase.filter.TestFilterWithScanLimits
Tests run: 1, Failures: 0, Errors: 0, Skipped: 0, Time elapsed: 1.802 sec - in org.apache.hadoop.hbase.filter.TestFilterWithScanLimits
Running org.apache.hadoop.hbase.filter.TestFuzzyRowAndColumnRangeFilter
Tests run: 1, Failures: 0, Errors: 0, Skipped: 0, Time elapsed: 1.742 sec - in org.apache.hadoop.hbase.filter.TestFuzzyRowAndColumnRangeFilter
Running org.apache.hadoop.hbase.filter.TestColumnRangeFilter
Tests run: 1, Failures: 0, Errors: 0, Skipped: 0, Time elapsed: 7.654 sec - in org.apache.hadoop.hbase.filter.TestColumnRangeFilter
Running org.apache.hadoop.hbase.filter.TestFilterWrapper
Tests run: 1, Failures: 0, Errors: 0, Skipped: 0, Time elapsed: 1.44 sec - in org.apache.hadoop.hbase.filter.TestFilterWrapper
Running org.apache.hadoop.hbase.filter.TestFuzzyRowFilterEndToEnd
Tests run: 3, Failures: 0, Errors: 0, Skipped: 0, Time elapsed: 127.825 sec - in org.apache.hadoop.hbase.filter.TestFuzzyRowFilterEndToEnd

Results :

Failed tests: 
  TestCopyTable.testCopyTable:123->doCopyTableTest:101 copy job failed expected:<0>
but was:<1>
  TestCopyTable.testRenameFamily:214 null
  TestCopyTable.testStartStopRow:159 expected:<0> but was:<1>
  TestImportExport.testDurability:654 null
  TestImportExport.testWithDeletes:323 null
  TestImportExport.testWithFilter:460 null
  TestImportExport.testWithMultipleDeleteFamilyMarkersOfSameRowSameFamily:393 null
  TestImportTSVWithOperationAttributes.testMROnTableWithInvalidOperationAttr:137->doMROnTableTest:175
expected:<0> but was:<1>
  TestImportTSVWithVisibilityLabels.testMROnTable:165->doMROnTableTest:315->doMROnTableTest:356
expected:<0> but was:<1>
  TestImportTSVWithVisibilityLabels.testMROnTableWithDeletes:180->doMROnTableTest:315->doMROnTableTest:356
expected:<0> but was:<1>
  TestImportTsv.testMROnTable:114->doMROnTableTest:294 expected:<0> but was:<1>
  TestImportTsv.testMROnTableWithCustomMapper:149->doMROnTableTest:294 expected:<0>
but was:<1>
  TestMultithreadedTableMapper.testMultithreadedTableMapper:126->runTestOnTable:150 null
  TestSyncTable.testSyncTable:88->syncTables:189 sync table job failed expected:<0>
but was:<1>
  TestTableMapReduce>TestTableMapReduceBase.testMultiRegionTable:96->runTestOnTable:110
null
Tests in error: 
  TestCopyTable.testCopyTableWithBulkload:131->doCopyTableTest:81 » TableExists ...
  TestCopyTable.testDeprecatedCopyTable:276 » TableExists org.apache.hadoop.hbas...

Tests run: 2153, Failures: 15, Errors: 2, Skipped: 22

[INFO] ------------------------------------------------------------------------
[INFO] Reactor Summary:
[INFO] 
[INFO] Apache HBase ...................................... SUCCESS [3.859s]
[INFO] Apache HBase - Checkstyle ......................... SUCCESS [1.063s]
[INFO] Apache HBase - Resource Bundle .................... SUCCESS [0.371s]
[INFO] Apache HBase - Annotations ........................ SUCCESS [0.454s]
[INFO] Apache HBase - Common ............................. SUCCESS [1:00.500s]
[INFO] Apache HBase - Protocol ........................... SUCCESS [26.963s]
[INFO] Apache HBase - Client ............................. SUCCESS [1:02.457s]
[INFO] Apache HBase - Hadoop Compatibility ............... SUCCESS [7.721s]
[INFO] Apache HBase - Hadoop Two Compatibility ........... SUCCESS [7.331s]
[INFO] Apache HBase - Prefix Tree ........................ SUCCESS [11.329s]
[INFO] Apache HBase - Server ............................. FAILURE [3:53:23.658s]
[INFO] Apache HBase - Testing Util ....................... SKIPPED
[INFO] Apache HBase - Thrift ............................. SKIPPED
[INFO] Apache HBase - Rest ............................... SKIPPED
[INFO] Apache HBase - Shell .............................. SKIPPED
[INFO] Apache HBase - Integration Tests .................. SKIPPED
[INFO] Apache HBase - Examples ........................... SKIPPED
[INFO] Apache HBase - Assembly ........................... SKIPPED
[INFO] ------------------------------------------------------------------------
[INFO] BUILD FAILURE
[INFO] ------------------------------------------------------------------------
[INFO] Total time: 3:56:28.579s
[INFO] Finished at: Sat Feb 13 16:44:33 UTC 2016
[INFO] Final Memory: 64M/479M
[INFO] ------------------------------------------------------------------------
[ERROR] Failed to execute goal org.apache.maven.plugins:maven-surefire-plugin:2.18.1:test
(secondPartTestsExecution) on project hbase-server: There are test failures.
[ERROR] 
[ERROR] Please refer to <https://builds.apache.org/job/HBase-0.98-matrix/jdk=latest1.6,label=yahoo-not-h2/ws/hbase-server/target/surefire-reports>
for the individual test results.
[ERROR] -> [Help 1]
[ERROR] 
[ERROR] To see the full stack trace of the errors, re-run Maven with the -e switch.
[ERROR] Re-run Maven using the -X switch to enable full debug logging.
[ERROR] 
[ERROR] For more information about the errors and possible solutions, please read the following
articles:
[ERROR] [Help 1] http://cwiki.apache.org/confluence/display/MAVEN/MojoFailureException
[ERROR] 
[ERROR] After correcting the problems, you can resume the build with the command
[ERROR]   mvn <goals> -rf :hbase-server
Build step 'Invoke top-level Maven targets' marked build as failure
Performing Post build task...
Match found for :.* : True
Logical operation result is TRUE
Running script  : # Post-build task script. TODO: Check this in and have all builds reference
check-in.
pwd && ls
# NOTE!!!! The below code has been copied and pasted from ./dev-tools/run-test.sh
# Do not change here without syncing there and vice-versa.
ZOMBIE_TESTS_COUNT=`jps -v | grep surefirebooter | grep -e '-Dhbase.test' | wc -l`
if [[ $ZOMBIE_TESTS_COUNT != 0 ]] ; then
 echo "Suspicious java process found - waiting 30s to see if there are just slow to stop"
 sleep 30
 ZOMBIE_TESTS_COUNT=`jps -v | grep surefirebooter | grep -e '-Dhbase.test' | wc -l`
 if [[ $ZOMBIE_TESTS_COUNT != 0 ]] ; then
   echo " {color:red}There appear to be $ZOMBIE_TESTS_COUNT zombie tests{color}, they should
have been killed by surefire but survived"
   jps -v | grep surefirebooter | grep -e '-Dhbase.test'
   jps -v | grep surefirebooter | grep -e '-Dhbase.test' | cut -d ' ' -f 1 | xargs -n 1 jstack
   # Exit with error
   exit 1
 else
   echo "We're ok: there is no zombie test, but some tests took some time to stop"
 fi
else
  echo "We're ok: there is no zombie test"
fi
[yahoo-not-h2] $ /bin/bash -xe /tmp/hudson5740943454370577422.sh
+ pwd
<https://builds.apache.org/job/HBase-0.98-matrix/jdk=latest1.6,label=yahoo-not-h2/ws/>
+ ls
bin
CHANGES.txt
conf
dev-support
hbase-annotations
hbase-assembly
hbase-checkstyle
hbase-client
hbase-common
hbase-examples
hbase-hadoop1-compat
hbase-hadoop2-compat
hbase-hadoop-compat
hbase-it
hbase-prefix-tree
hbase-protocol
hbase-resource-bundle
hbase-rest
hbase-server
hbase-shell
hbase-testing-util
hbase-thrift
LICENSE.txt
NOTICE.txt
pom.xml
README.txt
src
target
++ jps -v
++ grep surefirebooter
++ wc -l
++ grep -e -Dhbase.test
+ ZOMBIE_TESTS_COUNT=0
+ [[ 0 != 0 ]]
+ echo 'We'\''re ok: there is no zombie test'
We're ok: there is no zombie test
POST BUILD TASK : SUCCESS
END OF POST BUILD TASK : 0
Archiving artifacts
Recording test results

Mime
View raw message