hbase-builds mailing list archives

Site index · List index
Message view « Date » · « Thread »
Top « Date » · « Thread »
From Apache Jenkins Server <jenk...@builds.apache.org>
Subject Build failed in Jenkins: HBase-1.1-JDK8 #1752
Date Thu, 18 Feb 2016 07:34:01 GMT
See <https://builds.apache.org/job/HBase-1.1-JDK8/1752/changes>

Changes:

[matteo.bertozzi] HBASE-15100 ProcedureInfo constructor should be

------------------------------------------
[...truncated 3565 lines...]
Running org.apache.hadoop.hbase.mapreduce.TestTableSnapshotInputFormat
Running org.apache.hadoop.hbase.mapreduce.TestTableInputFormat
Running org.apache.hadoop.hbase.mapreduce.TestTimeRangeMapRed
Tests run: 12, Failures: 0, Errors: 0, Skipped: 0, Time elapsed: 634.36 sec - in org.apache.hadoop.hbase.mapreduce.TestImportExport
Java HotSpot(TM) 64-Bit Server VM warning: ignoring option MaxPermSize=256m; support was removed
in 8.0
Tests run: 1, Failures: 0, Errors: 0, Skipped: 0, Time elapsed: 89.753 sec - in org.apache.hadoop.hbase.mapreduce.TestTimeRangeMapRed
Java HotSpot(TM) 64-Bit Server VM warning: ignoring option MaxPermSize=256m; support was removed
in 8.0
Running org.apache.hadoop.hbase.mapreduce.TestImportTSVWithTTLs
Running org.apache.hadoop.hbase.mapreduce.TestLoadIncrementalHFiles
Tests run: 8, Failures: 0, Errors: 0, Skipped: 0, Time elapsed: 126.788 sec - in org.apache.hadoop.hbase.mapreduce.TestTableInputFormat
Java HotSpot(TM) 64-Bit Server VM warning: ignoring option MaxPermSize=256m; support was removed
in 8.0
Running org.apache.hadoop.hbase.mapreduce.TestHRegionPartitioner
Tests run: 1, Failures: 0, Errors: 0, Skipped: 0, Time elapsed: 4.614 sec - in org.apache.hadoop.hbase.mapreduce.TestHRegionPartitioner
Java HotSpot(TM) 64-Bit Server VM warning: ignoring option MaxPermSize=256m; support was removed
in 8.0
Running org.apache.hadoop.hbase.mapreduce.TestLoadIncrementalHFilesSplitRecovery
Tests run: 1, Failures: 0, Errors: 0, Skipped: 0, Time elapsed: 85.092 sec - in org.apache.hadoop.hbase.mapreduce.TestImportTSVWithTTLs
Java HotSpot(TM) 64-Bit Server VM warning: ignoring option MaxPermSize=256m; support was removed
in 8.0
Tests run: 11, Failures: 0, Errors: 0, Skipped: 0, Time elapsed: 415.996 sec - in org.apache.hadoop.hbase.mapreduce.TestImportTsv
Java HotSpot(TM) 64-Bit Server VM warning: ignoring option MaxPermSize=256m; support was removed
in 8.0
Running org.apache.hadoop.hbase.mapreduce.TestHFileOutputFormat
Tests run: 5, Failures: 0, Errors: 0, Skipped: 0, Time elapsed: 36.587 sec - in org.apache.hadoop.hbase.mapreduce.TestLoadIncrementalHFilesSplitRecovery
Java HotSpot(TM) 64-Bit Server VM warning: ignoring option MaxPermSize=256m; support was removed
in 8.0
Running org.apache.hadoop.hbase.mapreduce.TestImportTSVWithVisibilityLabels
Running org.apache.hadoop.hbase.mapreduce.TestMultithreadedTableMapper
Tests run: 21, Failures: 0, Errors: 0, Skipped: 0, Time elapsed: 199.473 sec - in org.apache.hadoop.hbase.mapreduce.TestLoadIncrementalHFiles
Java HotSpot(TM) 64-Bit Server VM warning: ignoring option MaxPermSize=256m; support was removed
in 8.0
Java HotSpot(TM) 64-Bit Server VM warning: ignoring option MaxPermSize=256m; support was removed
in 8.0
Running org.apache.hadoop.hbase.mapreduce.TestHFileOutputFormat2
Tests run: 1, Failures: 0, Errors: 0, Skipped: 0, Time elapsed: 146.197 sec - in org.apache.hadoop.hbase.mapreduce.TestMultithreadedTableMapper
Java HotSpot(TM) 64-Bit Server VM warning: ignoring option MaxPermSize=256m; support was removed
in 8.0
Tests run: 8, Failures: 0, Errors: 0, Skipped: 0, Time elapsed: 430.668 sec - in org.apache.hadoop.hbase.mapreduce.TestTableSnapshotInputFormat
Java HotSpot(TM) 64-Bit Server VM warning: ignoring option MaxPermSize=256m; support was removed
in 8.0
Running org.apache.hadoop.hbase.mapreduce.TestTableInputFormatScan1
Running org.apache.hadoop.hbase.mapreduce.TestCellCounter
Tests run: 13, Failures: 0, Errors: 0, Skipped: 1, Time elapsed: 373.635 sec - in org.apache.hadoop.hbase.mapreduce.TestHFileOutputFormat
Java HotSpot(TM) 64-Bit Server VM warning: ignoring option MaxPermSize=256m; support was removed
in 8.0
Running org.apache.hadoop.hbase.mapreduce.TestWALRecordReader
Tests run: 2, Failures: 0, Errors: 0, Skipped: 0, Time elapsed: 1.79 sec - in org.apache.hadoop.hbase.mapreduce.TestWALRecordReader
Java HotSpot(TM) 64-Bit Server VM warning: ignoring option MaxPermSize=256m; support was removed
in 8.0
Tests run: 7, Failures: 0, Errors: 0, Skipped: 0, Time elapsed: 383.753 sec - in org.apache.hadoop.hbase.mapreduce.TestImportTSVWithVisibilityLabels
Java HotSpot(TM) 64-Bit Server VM warning: ignoring option MaxPermSize=256m; support was removed
in 8.0
Running org.apache.hadoop.hbase.mapreduce.TestMultiTableInputFormat
Running org.apache.hadoop.hbase.mapreduce.TestSecureLoadIncrementalHFilesSplitRecovery
Tests run: 5, Failures: 0, Errors: 0, Skipped: 0, Time elapsed: 39.432 sec - in org.apache.hadoop.hbase.mapreduce.TestSecureLoadIncrementalHFilesSplitRecovery
Java HotSpot(TM) 64-Bit Server VM warning: ignoring option MaxPermSize=256m; support was removed
in 8.0
Java HotSpot(TM) 64-Bit Server VM warning: ignoring option MaxPermSize=256m; support was removed
in 8.0
Java HotSpot(TM) 64-Bit Server VM warning: ignoring option MaxPermSize=256m; support was removed
in 8.0
Java HotSpot(TM) 64-Bit Server VM warning: ignoring option MaxPermSize=256m; support was removed
in 8.0
Java HotSpot(TM) 64-Bit Server VM warning: ignoring option MaxPermSize=256m; support was removed
in 8.0
Java HotSpot(TM) 64-Bit Server VM warning: ignoring option MaxPermSize=256m; support was removed
in 8.0
Java HotSpot(TM) 64-Bit Server VM warning: ignoring option MaxPermSize=256m; support was removed
in 8.0
Java HotSpot(TM) 64-Bit Server VM warning: ignoring option MaxPermSize=256m; support was removed
in 8.0
Java HotSpot(TM) 64-Bit Server VM warning: ignoring option MaxPermSize=256m; support was removed
in 8.0
Running org.apache.hadoop.hbase.filter.TestMultiRowRangeFilter
Tests run: 13, Failures: 0, Errors: 0, Skipped: 1, Time elapsed: 397.224 sec - in org.apache.hadoop.hbase.mapreduce.TestHFileOutputFormat2
Java HotSpot(TM) 64-Bit Server VM warning: ignoring option MaxPermSize=256m; support was removed
in 8.0
Tests run: 20, Failures: 0, Errors: 0, Skipped: 0, Time elapsed: 26.683 sec - in org.apache.hadoop.hbase.filter.TestMultiRowRangeFilter
Java HotSpot(TM) 64-Bit Server VM warning: ignoring option MaxPermSize=256m; support was removed
in 8.0
Java HotSpot(TM) 64-Bit Server VM warning: ignoring option MaxPermSize=256m; support was removed
in 8.0
Java HotSpot(TM) 64-Bit Server VM warning: ignoring option MaxPermSize=256m; support was removed
in 8.0
Running org.apache.hadoop.hbase.filter.TestScanRowPrefix
Tests run: 7, Failures: 0, Errors: 0, Skipped: 0, Time elapsed: 290.856 sec - in org.apache.hadoop.hbase.mapreduce.TestCellCounter
Java HotSpot(TM) 64-Bit Server VM warning: ignoring option MaxPermSize=256m; support was removed
in 8.0
Java HotSpot(TM) 64-Bit Server VM warning: ignoring option MaxPermSize=256m; support was removed
in 8.0
Tests run: 1, Failures: 0, Errors: 0, Skipped: 0, Time elapsed: 7.469 sec - in org.apache.hadoop.hbase.filter.TestScanRowPrefix
Java HotSpot(TM) 64-Bit Server VM warning: ignoring option MaxPermSize=256m; support was removed
in 8.0
Java HotSpot(TM) 64-Bit Server VM warning: ignoring option MaxPermSize=256m; support was removed
in 8.0
Java HotSpot(TM) 64-Bit Server VM warning: ignoring option MaxPermSize=256m; support was removed
in 8.0
Java HotSpot(TM) 64-Bit Server VM warning: ignoring option MaxPermSize=256m; support was removed
in 8.0
Java HotSpot(TM) 64-Bit Server VM warning: ignoring option MaxPermSize=256m; support was removed
in 8.0
Running org.apache.hadoop.hbase.filter.TestFilterWithScanLimits
Java HotSpot(TM) 64-Bit Server VM warning: ignoring option MaxPermSize=256m; support was removed
in 8.0
Java HotSpot(TM) 64-Bit Server VM warning: ignoring option MaxPermSize=256m; support was removed
in 8.0
Tests run: 1, Failures: 0, Errors: 0, Skipped: 0, Time elapsed: 4.338 sec - in org.apache.hadoop.hbase.filter.TestFilterWithScanLimits
Java HotSpot(TM) 64-Bit Server VM warning: ignoring option MaxPermSize=256m; support was removed
in 8.0
Running org.apache.hadoop.hbase.filter.TestFuzzyRowAndColumnRangeFilter
Tests run: 1, Failures: 0, Errors: 0, Skipped: 0, Time elapsed: 5.282 sec - in org.apache.hadoop.hbase.filter.TestFuzzyRowAndColumnRangeFilter
Java HotSpot(TM) 64-Bit Server VM warning: ignoring option MaxPermSize=256m; support was removed
in 8.0
Java HotSpot(TM) 64-Bit Server VM warning: ignoring option MaxPermSize=256m; support was removed
in 8.0
Java HotSpot(TM) 64-Bit Server VM warning: ignoring option MaxPermSize=256m; support was removed
in 8.0
Java HotSpot(TM) 64-Bit Server VM warning: ignoring option MaxPermSize=256m; support was removed
in 8.0
Running org.apache.hadoop.hbase.filter.TestColumnRangeFilter
Java HotSpot(TM) 64-Bit Server VM warning: ignoring option MaxPermSize=256m; support was removed
in 8.0
Java HotSpot(TM) 64-Bit Server VM warning: ignoring option MaxPermSize=256m; support was removed
in 8.0
Running org.apache.hadoop.hbase.filter.TestFilterWrapper
Tests run: 1, Failures: 0, Errors: 0, Skipped: 0, Time elapsed: 4.92 sec - in org.apache.hadoop.hbase.filter.TestFilterWrapper
Tests run: 1, Failures: 0, Errors: 0, Skipped: 0, Time elapsed: 14.232 sec - in org.apache.hadoop.hbase.filter.TestColumnRangeFilter
Java HotSpot(TM) 64-Bit Server VM warning: ignoring option MaxPermSize=256m; support was removed
in 8.0
Java HotSpot(TM) 64-Bit Server VM warning: ignoring option MaxPermSize=256m; support was removed
in 8.0
Running org.apache.hadoop.hbase.filter.TestFuzzyRowFilterEndToEnd
Tests run: 7, Failures: 0, Errors: 0, Skipped: 0, Time elapsed: 347.953 sec - in org.apache.hadoop.hbase.mapreduce.TestTableInputFormatScan1
Running org.apache.hadoop.hbase.TestMetaTableAccessor
Tests run: 13, Failures: 0, Errors: 0, Skipped: 0, Time elapsed: 17.781 sec - in org.apache.hadoop.hbase.TestMetaTableAccessor
Tests run: 4, Failures: 0, Errors: 0, Skipped: 0, Time elapsed: 239.303 sec - in org.apache.hadoop.hbase.mapreduce.TestMultiTableInputFormat
Tests run: 3, Failures: 0, Errors: 0, Skipped: 0, Time elapsed: 155.148 sec - in org.apache.hadoop.hbase.filter.TestFuzzyRowFilterEndToEnd

Results :

Failed tests: 
org.apache.hadoop.hbase.util.TestHBaseFsck.testHbckThreadpooling(org.apache.hadoop.hbase.util.TestHBaseFsck)
  Run 1: TestHBaseFsck.testHbckThreadpooling:516 expected:<[]> but was:<[NOT_IN_META_OR_DEPLOYED,
LAST_REGION_ENDKEY_NOT_EMPTY]>
  Run 2: TestHBaseFsck.testHbckThreadpooling:516 expected:<[]> but was:<[NOT_IN_META_OR_DEPLOYED,
HOLE_IN_REGION_CHAIN]>
  Run 3: TestHBaseFsck.testHbckThreadpooling:516 expected:<[]> but was:<[NOT_IN_META_OR_DEPLOYED,
LAST_REGION_ENDKEY_NOT_EMPTY]>

Tests in error: 
org.apache.hadoop.hbase.regionserver.TestWALLockup.testLockupWhenSyncInMiddleOfZigZagSetup(org.apache.hadoop.hbase.regionserver.TestWALLockup)
  Run 1: TestWALLockup.testLockupWhenSyncInMiddleOfZigZagSetup » DamagedWAL Append sequ...
  Run 2: TestWALLockup.testLockupWhenSyncInMiddleOfZigZagSetup:261 » TestTimedOut test ...
  Run 3: TestWALLockup.testLockupWhenSyncInMiddleOfZigZagSetup » DamagedWAL Append sequ...

org.apache.hadoop.hbase.util.TestHBaseFsck.testQuarantineMissingRegionDir(org.apache.hadoop.hbase.util.TestHBaseFsck)
  Run 1: TestHBaseFsck.testQuarantineMissingRegionDir:2236->doQuarantineTest:2148->cleanupTable:475->deleteTable:2816
» TableNotDisabled
  Run 2: TestHBaseFsck.testQuarantineMissingRegionDir:2236->doQuarantineTest:2148->cleanupTable:475->deleteTable:2816
» TableNotDisabled
  Run 3: TestHBaseFsck.testQuarantineMissingRegionDir:2236->doQuarantineTest:2148->cleanupTable:475->deleteTable:2816
» TableNotDisabled

Flaked tests: 
org.apache.hadoop.hbase.client.TestSnapshotCloneIndependence.testOnlineSnapshotDeleteIndependent(org.apache.hadoop.hbase.client.TestSnapshotCloneIndependence)
  Run 1: TestSnapshotCloneIndependence.testOnlineSnapshotDeleteIndependent:182->runTestSnapshotDeleteIndependent:425
expected:<17576> but was:<14046>
  Run 2: TestSnapshotCloneIndependence.testOnlineSnapshotDeleteIndependent:182->runTestSnapshotDeleteIndependent:425
expected:<17576> but was:<14046>
  Run 3: PASS

org.apache.hadoop.hbase.master.handler.TestEnableTableHandler.testEnableTableWithNoRegionServers(org.apache.hadoop.hbase.master.handler.TestEnableTableHandler)
  Run 1: TestEnableTableHandler.testEnableTableWithNoRegionServers:123 Waiting timed out after
[60,000] msec table enabled in zk,
  Run 2: PASS

org.apache.hadoop.hbase.regionserver.TestSplitTransactionOnCluster.testFailedSplit(org.apache.hadoop.hbase.regionserver.TestSplitTransactionOnCluster)
  Run 1: TestSplitTransactionOnCluster.testFailedSplit:1339 null
  Run 2: PASS


Tests run: 2496, Failures: 1, Errors: 2, Skipped: 21, Flakes: 3

[INFO] ------------------------------------------------------------------------
[INFO] Reactor Summary:
[INFO] 
[INFO] Apache HBase ...................................... SUCCESS [3.634s]
[INFO] Apache HBase - Checkstyle ......................... SUCCESS [1.057s]
[INFO] Apache HBase - Resource Bundle .................... SUCCESS [0.357s]
[INFO] Apache HBase - Annotations ........................ SUCCESS [1.610s]
[INFO] Apache HBase - Protocol ........................... SUCCESS [16.798s]
[INFO] Apache HBase - Common ............................. SUCCESS [1:30.040s]
[INFO] Apache HBase - Procedure .......................... SUCCESS [3:00.485s]
[INFO] Apache HBase - Client ............................. SUCCESS [1:29.578s]
[INFO] Apache HBase - Hadoop Compatibility ............... SUCCESS [8.299s]
[INFO] Apache HBase - Hadoop Two Compatibility ........... SUCCESS [7.870s]
[INFO] Apache HBase - Prefix Tree ........................ SUCCESS [9.766s]
[INFO] Apache HBase - Server ............................. FAILURE [1:46:23.375s]
[INFO] Apache HBase - Testing Util ....................... SKIPPED
[INFO] Apache HBase - Thrift ............................. SKIPPED
[INFO] Apache HBase - Rest ............................... SKIPPED
[INFO] Apache HBase - Shell .............................. SKIPPED
[INFO] Apache HBase - Integration Tests .................. SKIPPED
[INFO] Apache HBase - Examples ........................... SKIPPED
[INFO] Apache HBase - Assembly ........................... SKIPPED
[INFO] Apache HBase - Shaded ............................. SKIPPED
[INFO] Apache HBase - Shaded - Client .................... SKIPPED
[INFO] Apache HBase - Shaded - Server .................... SKIPPED
[INFO] ------------------------------------------------------------------------
[INFO] BUILD FAILURE
[INFO] ------------------------------------------------------------------------
[INFO] Total time: 1:53:14.671s
[INFO] Finished at: Thu Feb 18 07:30:32 UTC 2016
[INFO] Final Memory: 55M/810M
[INFO] ------------------------------------------------------------------------
[ERROR] Failed to execute goal org.apache.maven.plugins:maven-surefire-plugin:2.18.1:test
(secondPartTestsExecution) on project hbase-server: There are test failures.
[ERROR] 
[ERROR] Please refer to <https://builds.apache.org/job/HBase-1.1-JDK8/ws/hbase-server/target/surefire-reports>
for the individual test results.
[ERROR] -> [Help 1]
[ERROR] 
[ERROR] To see the full stack trace of the errors, re-run Maven with the -e switch.
[ERROR] Re-run Maven using the -X switch to enable full debug logging.
[ERROR] 
[ERROR] For more information about the errors and possible solutions, please read the following
articles:
[ERROR] [Help 1] http://cwiki.apache.org/confluence/display/MAVEN/MojoFailureException
[ERROR] 
[ERROR] After correcting the problems, you can resume the build with the command
[ERROR]   mvn <goals> -rf :hbase-server
Build step 'Invoke top-level Maven targets' marked build as failure
Performing Post build task...
Match found for :.* : True
Logical operation result is TRUE
Running script  : # Post-build task script. TODO: Check this in and have all builds reference
check-in.
pwd && ls
# NOTE!!!! The below code has been copied and pasted from ./dev-tools/run-test.sh
# Do not change here without syncing there and vice-versa.
ZOMBIE_TESTS_COUNT=`jps -v | grep surefirebooter | grep -e '-Dhbase.test' | wc -l`
if [[ $ZOMBIE_TESTS_COUNT != 0 ]] ; then
 echo "Suspicious java process found - waiting 30s to see if there are just slow to stop"
 sleep 30
 ZOMBIE_TESTS_COUNT=`jps -v | grep surefirebooter | grep -e '-Dhbase.test' | wc -l`
 if [[ $ZOMBIE_TESTS_COUNT != 0 ]] ; then
   echo " {color:red}There appear to be $ZOMBIE_TESTS_COUNT zombie tests{color}, they should
have been killed by surefire but survived"
   jps -v | grep surefirebooter | grep -e '-Dhbase.test'
   jps -v | grep surefirebooter | grep -e '-Dhbase.test' | cut -d ' ' -f 1 | xargs -n 1 jstack
   # Exit with error
   exit 1
 else
   echo "We're ok: there is no zombie test, but some tests took some time to stop"
 fi
else
  echo "We're ok: there is no zombie test"
fi
[HBase-1.1-JDK8] $ /bin/bash -xe /tmp/hudson3866596644794713344.sh
+ pwd
<https://builds.apache.org/job/HBase-1.1-JDK8/ws/>
+ ls
bin
CHANGES.txt
conf
dev-support
hbase-annotations
hbase-assembly
hbase-checkstyle
hbase-client
hbase-common
hbase-examples
hbase-hadoop2-compat
hbase-hadoop-compat
hbase-it
hbase-native-client
hbase-prefix-tree
hbase-procedure
hbase-protocol
hbase-resource-bundle
hbase-rest
hbase-server
hbase-shaded
hbase-shell
hbase-testing-util
hbase-thrift
LICENSE.txt
NOTICE.txt
pom.xml
README.txt
src
target
++ jps -v
++ grep surefirebooter
++ wc -l
++ grep -e -Dhbase.test
+ ZOMBIE_TESTS_COUNT=0
+ [[ 0 != 0 ]]
+ echo 'We'\''re ok: there is no zombie test'
We're ok: there is no zombie test
POST BUILD TASK : SUCCESS
END OF POST BUILD TASK : 0
Archiving artifacts
Recording test results
Updating HBASE-15100

Mime
View raw message