hbase-builds mailing list archives

Site index · List index
Message view « Date » · « Thread »
Top « Date » · « Thread »
From Apache Jenkins Server <jenk...@builds.apache.org>
Subject Build failed in Jenkins: HBase-1.3 » latest1.7,yahoo-not-h2 #559
Date Thu, 18 Feb 2016 12:35:19 GMT
See <https://builds.apache.org/job/HBase-1.3/jdk=latest1.7,label=yahoo-not-h2/559/changes>

Changes:

[zhangduo] HBASE-14949 Resolve name conflict when splitting if there are duplicated

------------------------------------------
[...truncated 45266 lines...]
5/5 KB   25/25 KB   51/281 KB   181/246 KB   20/20 KB   
5/5 KB   25/25 KB   55/281 KB   181/246 KB   20/20 KB   
5/5 KB   25/25 KB   59/281 KB   185/246 KB   20/20 KB   
5/5 KB   25/25 KB   59/281 KB   185/246 KB   20/20 KB   
5/5 KB   25/25 KB   59/281 KB   189/246 KB   20/20 KB   
5/5 KB   25/25 KB   63/281 KB   189/246 KB   20/20 KB   
5/5 KB   25/25 KB   63/281 KB   193/246 KB   20/20 KB   
5/5 KB   25/25 KB   67/281 KB   193/246 KB   20/20 KB   
5/5 KB   25/25 KB   71/281 KB   197/246 KB   20/20 KB   
5/5 KB   25/25 KB   71/281 KB   197/246 KB   20/20 KB   
5/5 KB   25/25 KB   75/281 KB   201/246 KB   20/20 KB   
5/5 KB   25/25 KB   75/281 KB   201/246 KB   20/20 KB   
5/5 KB   25/25 KB   75/281 KB   205/246 KB   20/20 KB   
5/5 KB   25/25 KB   79/281 KB   205/246 KB   20/20 KB   
5/5 KB   25/25 KB   83/281 KB   209/246 KB   20/20 KB   
5/5 KB   25/25 KB   83/281 KB   209/246 KB   20/20 KB   
5/5 KB   25/25 KB   83/281 KB   213/246 KB   20/20 KB   
5/5 KB   25/25 KB   87/281 KB   213/246 KB   20/20 KB   
5/5 KB   25/25 KB   91/281 KB   217/246 KB   20/20 KB   
5/5 KB   25/25 KB   91/281 KB   217/246 KB   20/20 KB   
5/5 KB   25/25 KB   95/281 KB   221/246 KB   20/20 KB   
5/5 KB   25/25 KB   95/281 KB   221/246 KB   20/20 KB   
5/5 KB   25/25 KB   95/281 KB   225/246 KB   20/20 KB   
5/5 KB   25/25 KB   99/281 KB   225/246 KB   20/20 KB   
5/5 KB   25/25 KB   99/281 KB   229/246 KB   20/20 KB   
5/5 KB   25/25 KB   103/281 KB   229/246 KB   20/20 KB   
5/5 KB   25/25 KB   107/281 KB   233/246 KB   20/20 KB   
5/5 KB   25/25 KB   107/281 KB   233/246 KB   20/20 KB   
5/5 KB   25/25 KB   107/281 KB   237/246 KB   20/20 KB   
5/5 KB   25/25 KB   111/281 KB   237/246 KB   20/20 KB   
5/5 KB   25/25 KB   115/281 KB   241/246 KB   20/20 KB   
5/5 KB   25/25 KB   115/281 KB   241/246 KB   20/20 KB   
5/5 KB   25/25 KB   119/281 KB   245/246 KB   20/20 KB   
5/5 KB   25/25 KB   119/281 KB   245/246 KB   20/20 KB   
5/5 KB   25/25 KB   123/281 KB   246/246 KB   20/20 KB   
5/5 KB   25/25 KB   123/281 KB   246/246 KB   20/20 KB   
5/5 KB   25/25 KB   127/281 KB   246/246 KB   20/20 KB   
5/5 KB   25/25 KB   131/281 KB   246/246 KB   20/20 KB   
5/5 KB   25/25 KB   135/281 KB   246/246 KB   20/20 KB   
5/5 KB   25/25 KB   139/281 KB   246/246 KB   20/20 KB   
5/5 KB   25/25 KB   143/281 KB   246/246 KB   20/20 KB   
5/5 KB   25/25 KB   147/281 KB   246/246 KB   20/20 KB   
5/5 KB   25/25 KB   151/281 KB   246/246 KB   20/20 KB   
5/5 KB   25/25 KB   155/281 KB   246/246 KB   20/20 KB   
5/5 KB   25/25 KB   159/281 KB   246/246 KB   20/20 KB   
5/5 KB   25/25 KB   163/281 KB   246/246 KB   20/20 KB   
5/5 KB   25/25 KB   167/281 KB   246/246 KB   20/20 KB   
5/5 KB   25/25 KB   171/281 KB   246/246 KB   20/20 KB   
5/5 KB   25/25 KB   175/281 KB   246/246 KB   20/20 KB   
5/5 KB   25/25 KB   179/281 KB   246/246 KB   20/20 KB   
5/5 KB   25/25 KB   183/281 KB   246/246 KB   20/20 KB   
5/5 KB   25/25 KB   187/281 KB   246/246 KB   20/20 KB   
5/5 KB   25/25 KB   191/281 KB   246/246 KB   20/20 KB   
5/5 KB   25/25 KB   195/281 KB   246/246 KB   20/20 KB   
5/5 KB   25/25 KB   199/281 KB   246/246 KB   20/20 KB   
5/5 KB   25/25 KB   203/281 KB   246/246 KB   20/20 KB   
5/5 KB   25/25 KB   207/281 KB   246/246 KB   20/20 KB   
5/5 KB   25/25 KB   211/281 KB   246/246 KB   20/20 KB   
5/5 KB   25/25 KB   215/281 KB   246/246 KB   20/20 KB   
5/5 KB   25/25 KB   219/281 KB   246/246 KB   20/20 KB   
5/5 KB   25/25 KB   223/281 KB   246/246 KB   20/20 KB   
5/5 KB   25/25 KB   227/281 KB   246/246 KB   20/20 KB   
5/5 KB   25/25 KB   231/281 KB   246/246 KB   20/20 KB   
5/5 KB   25/25 KB   235/281 KB   246/246 KB   20/20 KB   
5/5 KB   25/25 KB   239/281 KB   246/246 KB   20/20 KB   
5/5 KB   25/25 KB   243/281 KB   246/246 KB   20/20 KB   
5/5 KB   25/25 KB   247/281 KB   246/246 KB   20/20 KB   
5/5 KB   25/25 KB   251/281 KB   246/246 KB   20/20 KB   
5/5 KB   25/25 KB   255/281 KB   246/246 KB   20/20 KB   
5/5 KB   25/25 KB   259/281 KB   246/246 KB   20/20 KB   
5/5 KB   25/25 KB   263/281 KB   246/246 KB   20/20 KB   
5/5 KB   25/25 KB   267/281 KB   246/246 KB   20/20 KB   
5/5 KB   25/25 KB   271/281 KB   246/246 KB   20/20 KB   
5/5 KB   25/25 KB   275/281 KB   246/246 KB   20/20 KB   
5/5 KB   25/25 KB   279/281 KB   246/246 KB   20/20 KB   
5/5 KB   25/25 KB   281/281 KB   246/246 KB   20/20 KB   
                                                         
                                                         
Downloaded: http://repo.maven.apache.org/maven2/org/jamon/jamon-api/2.3.0/jamon-api-2.3.0.jar
(5 KB at 89.9 KB/sec)
Downloaded: http://repo.maven.apache.org/maven2/org/codehaus/plexus/plexus-compiler-api/1.8.1/plexus-compiler-api-1.8.1.jar
(20 KB at 397.8 KB/sec)
                                                         
Downloaded: http://repo.maven.apache.org/maven2/org/jamon/jamon-runtime/2.4.0/jamon-runtime-2.4.0.jar
(25 KB at 467.5 KB/sec)
                                                         
Downloaded: http://repo.maven.apache.org/maven2/org/codehaus/plexus/plexus-utils/1.5.5/plexus-utils-1.5.5.jar
(246 KB at 4461.6 KB/sec)
                                                         
Downloaded: http://repo.maven.apache.org/maven2/org/jamon/jamon-processor/2.4.1/jamon-processor-2.4.1.jar
(281 KB at 4525.4 KB/sec)
[INFO] Translating 10 templates from <https://builds.apache.org/job/HBase-1.3/jdk=latest1.7,label=yahoo-not-h2/ws/hbase-server/src/main/jamon>
to <https://builds.apache.org/job/HBase-1.3/jdk=latest1.7,label=yahoo-not-h2/ws/hbase-server/target/generated-jamon>
[INFO] 
[INFO] --- maven-antrun-plugin:1.6:run (generate) @ hbase-server ---
[INFO] Executing tasks

main:
    [mkdir] Created dir: <https://builds.apache.org/job/HBase-1.3/jdk=latest1.7,label=yahoo-not-h2/ws/hbase-server/target/hbase-webapps>
     [copy] Copying 20 files to <https://builds.apache.org/job/HBase-1.3/jdk=latest1.7,label=yahoo-not-h2/ws/hbase-server/target/hbase-webapps>
log4j:WARN No appenders could be found for logger (org.mortbay.log).
log4j:WARN Please initialize the log4j system properly.
log4j:WARN See http://logging.apache.org/log4j/1.2/faq.html#noconfig for more info.
    [mkdir] Created dir: <https://builds.apache.org/job/HBase-1.3/jdk=latest1.7,label=yahoo-not-h2/ws/hbase-server/target/hbase-webapps/master/WEB-INF>
    [mkdir] Created dir: <https://builds.apache.org/job/HBase-1.3/jdk=latest1.7,label=yahoo-not-h2/ws/hbase-server/target/hbase-webapps/regionserver/WEB-INF>
[INFO] Executed tasks
[INFO] 
[INFO] --- maven-remote-resources-plugin:1.5:process (default) @ hbase-server ---
[INFO] 
[INFO] --- maven-resources-plugin:2.6:resources (default-resources) @ hbase-server ---
[INFO] Using 'UTF-8' encoding to copy filtered resources.
[INFO] Copying 22 resources
[INFO] Copying 2 resources
[INFO] 
[INFO] --- maven-compiler-plugin:2.5.1:compile (default-compile) @ hbase-server ---
[INFO] Compiling 808 source files to <https://builds.apache.org/job/HBase-1.3/jdk=latest1.7,label=yahoo-not-h2/ws/hbase-server/target/classes>
[INFO] -------------------------------------------------------------
[ERROR] COMPILATION ERROR : 
[INFO] -------------------------------------------------------------
[ERROR] <https://builds.apache.org/job/HBase-1.3/jdk=latest1.7,label=yahoo-not-h2/ws/hbase-server/src/main/java/org/apache/hadoop/hbase/wal/WALSplitter.java>:[1195,68]
error: unreported exception IOException; must be caught or declared to be thrown
[ERROR] <https://builds.apache.org/job/HBase-1.3/jdk=latest1.7,label=yahoo-not-h2/ws/hbase-server/src/main/java/org/apache/hadoop/hbase/wal/WALSplitter.java>:[1197,28]
error: unreported exception IOException; must be caught or declared to be thrown
[ERROR] <https://builds.apache.org/job/HBase-1.3/jdk=latest1.7,label=yahoo-not-h2/ws/hbase-server/src/main/java/org/apache/hadoop/hbase/wal/WALSplitter.java>:[1563,88]
error: unreported exception IOException; must be caught or declared to be thrown
[ERROR] <https://builds.apache.org/job/HBase-1.3/jdk=latest1.7,label=yahoo-not-h2/ws/hbase-server/src/main/java/org/apache/hadoop/hbase/regionserver/snapshot/RegionServerSnapshotManager.java>:[231,20]
Signal is internal proprietary API and may be removed in a future release
[ERROR] <https://builds.apache.org/job/HBase-1.3/jdk=latest1.7,label=yahoo-not-h2/ws/hbase-server/src/main/java/org/apache/hadoop/hbase/regionserver/snapshot/RegionServerSnapshotManager.java>:[231,44]
SignalHandler is internal proprietary API and may be removed in a future release
[ERROR] <https://builds.apache.org/job/HBase-1.3/jdk=latest1.7,label=yahoo-not-h2/ws/hbase-server/src/main/java/org/apache/hadoop/hbase/regionserver/HRegionServer.java>:[617,24]
Signal is internal proprietary API and may be removed in a future release
[ERROR] <https://builds.apache.org/job/HBase-1.3/jdk=latest1.7,label=yahoo-not-h2/ws/hbase-server/src/main/java/org/apache/hadoop/hbase/regionserver/HRegionServer.java>:[617,43]
SignalHandler is internal proprietary API and may be removed in a future release
[ERROR] <https://builds.apache.org/job/HBase-1.3/jdk=latest1.7,label=yahoo-not-h2/ws/hbase-server/src/main/java/org/apache/hadoop/hbase/regionserver/HRegionServer.java>:[618,27]
Signal is internal proprietary API and may be removed in a future release
[ERROR] <https://builds.apache.org/job/HBase-1.3/jdk=latest1.7,label=yahoo-not-h2/ws/hbase-server/src/main/java/org/apache/hadoop/hbase/regionserver/HRegionServer.java>:[617,6]
Signal is internal proprietary API and may be removed in a future release
[INFO] 9 errors 
[INFO] -------------------------------------------------------------
[INFO] ------------------------------------------------------------------------
[INFO] Reactor Summary:
[INFO] 
[INFO] Apache HBase ...................................... SUCCESS [1:04.295s]
[INFO] Apache HBase - Checkstyle ......................... SUCCESS [5.213s]
[INFO] Apache HBase - Resource Bundle .................... SUCCESS [0.272s]
[INFO] Apache HBase - Annotations ........................ SUCCESS [1.408s]
[INFO] Apache HBase - Protocol ........................... SUCCESS [20.194s]
[INFO] Apache HBase - Common ............................. SUCCESS [2:43.686s]
[INFO] Apache HBase - Procedure .......................... SUCCESS [3:47.068s]
[INFO] Apache HBase - Client ............................. SUCCESS [1:37.824s]
[INFO] Apache HBase - Hadoop Compatibility ............... SUCCESS [8.989s]
[INFO] Apache HBase - Hadoop Two Compatibility ........... SUCCESS [10.970s]
[INFO] Apache HBase - Prefix Tree ........................ SUCCESS [13.405s]
[INFO] Apache HBase - Server ............................. FAILURE [1:32.335s]
[INFO] Apache HBase - Testing Util ....................... SKIPPED
[INFO] Apache HBase - Thrift ............................. SKIPPED
[INFO] Apache HBase - Rest ............................... SKIPPED
[INFO] Apache HBase - Shell .............................. SKIPPED
[INFO] Apache HBase - Integration Tests .................. SKIPPED
[INFO] Apache HBase - Examples ........................... SKIPPED
[INFO] Apache HBase - External Block Cache ............... SKIPPED
[INFO] Apache HBase - Assembly ........................... SKIPPED
[INFO] Apache HBase - Shaded ............................. SKIPPED
[INFO] Apache HBase - Shaded - Client .................... SKIPPED
[INFO] Apache HBase - Shaded - Server .................... SKIPPED
[INFO] ------------------------------------------------------------------------
[INFO] BUILD FAILURE
[INFO] ------------------------------------------------------------------------
[INFO] Total time: 12:05.623s
[INFO] Finished at: Thu Feb 18 12:34:26 UTC 2016
[INFO] Final Memory: 89M/1422M
[INFO] ------------------------------------------------------------------------
[ERROR] Failed to execute goal org.apache.maven.plugins:maven-compiler-plugin:2.5.1:compile
(default-compile) on project hbase-server: Compilation failure: Compilation failure:
[ERROR] <https://builds.apache.org/job/HBase-1.3/jdk=latest1.7,label=yahoo-not-h2/ws/hbase-server/src/main/java/org/apache/hadoop/hbase/wal/WALSplitter.java>:[1195,68]
error: unreported exception IOException; must be caught or declared to be thrown
[ERROR] <https://builds.apache.org/job/HBase-1.3/jdk=latest1.7,label=yahoo-not-h2/ws/hbase-server/src/main/java/org/apache/hadoop/hbase/wal/WALSplitter.java>:[1197,28]
error: unreported exception IOException; must be caught or declared to be thrown
[ERROR] <https://builds.apache.org/job/HBase-1.3/jdk=latest1.7,label=yahoo-not-h2/ws/hbase-server/src/main/java/org/apache/hadoop/hbase/wal/WALSplitter.java>:[1563,88]
error: unreported exception IOException; must be caught or declared to be thrown
[ERROR] <https://builds.apache.org/job/HBase-1.3/jdk=latest1.7,label=yahoo-not-h2/ws/hbase-server/src/main/java/org/apache/hadoop/hbase/regionserver/snapshot/RegionServerSnapshotManager.java>:[231,20]
Signal is internal proprietary API and may be removed in a future release
[ERROR] <https://builds.apache.org/job/HBase-1.3/jdk=latest1.7,label=yahoo-not-h2/ws/hbase-server/src/main/java/org/apache/hadoop/hbase/regionserver/snapshot/RegionServerSnapshotManager.java>:[231,44]
SignalHandler is internal proprietary API and may be removed in a future release
[ERROR] <https://builds.apache.org/job/HBase-1.3/jdk=latest1.7,label=yahoo-not-h2/ws/hbase-server/src/main/java/org/apache/hadoop/hbase/regionserver/HRegionServer.java>:[617,24]
Signal is internal proprietary API and may be removed in a future release
[ERROR] <https://builds.apache.org/job/HBase-1.3/jdk=latest1.7,label=yahoo-not-h2/ws/hbase-server/src/main/java/org/apache/hadoop/hbase/regionserver/HRegionServer.java>:[617,43]
SignalHandler is internal proprietary API and may be removed in a future release
[ERROR] <https://builds.apache.org/job/HBase-1.3/jdk=latest1.7,label=yahoo-not-h2/ws/hbase-server/src/main/java/org/apache/hadoop/hbase/regionserver/HRegionServer.java>:[618,27]
Signal is internal proprietary API and may be removed in a future release
[ERROR] <https://builds.apache.org/job/HBase-1.3/jdk=latest1.7,label=yahoo-not-h2/ws/hbase-server/src/main/java/org/apache/hadoop/hbase/regionserver/HRegionServer.java>:[617,6]
Signal is internal proprietary API and may be removed in a future release
[ERROR] -> [Help 1]
[ERROR] 
[ERROR] To see the full stack trace of the errors, re-run Maven with the -e switch.
[ERROR] Re-run Maven using the -X switch to enable full debug logging.
[ERROR] 
[ERROR] For more information about the errors and possible solutions, please read the following
articles:
[ERROR] [Help 1] http://cwiki.apache.org/confluence/display/MAVEN/MojoFailureException
[ERROR] 
[ERROR] After correcting the problems, you can resume the build with the command
[ERROR]   mvn <goals> -rf :hbase-server
Build step 'Invoke top-level Maven targets' marked build as failure
Performing Post build task...
Match found for :.* : True
Logical operation result is TRUE
Running script  : # Post-build task script. TODO: Check this in and have all builds reference
check-in.
pwd && ls
# NOTE!!!! The below code has been copied and pasted from ./dev-tools/run-test.sh
# Do not change here without syncing there and vice-versa.
ZOMBIE_TESTS_COUNT=`jps -v | grep surefirebooter | grep -e '-Dhbase.test' | wc -l`
if [[ $ZOMBIE_TESTS_COUNT != 0 ]] ; then
 echo "Suspicious java process found - waiting 30s to see if there are just slow to stop"
 sleep 30
 ZOMBIE_TESTS_COUNT=`jps -v | grep surefirebooter | grep -e '-Dhbase.test' | wc -l`
 if [[ $ZOMBIE_TESTS_COUNT != 0 ]] ; then
   echo " {color:red}There appear to be $ZOMBIE_TESTS_COUNT zombie tests{color}, they should
have been killed by surefire but survived"
   jps -v | grep surefirebooter | grep -e '-Dhbase.test'
   jps -v | grep surefirebooter | grep -e '-Dhbase.test' | cut -d ' ' -f 1 | xargs -n 1 jstack
   # Exit with error
   exit 1
 else
   echo "We're ok: there is no zombie test, but some tests took some time to stop"
 fi
else
  echo "We're ok: there is no zombie test"
fi
[yahoo-not-h2] $ /bin/bash -xe /tmp/hudson3976771665339952286.sh
+ pwd
<https://builds.apache.org/job/HBase-1.3/jdk=latest1.7,label=yahoo-not-h2/ws/>
+ ls
bin
CHANGES.txt
conf
dev-support
hbase-annotations
hbase-assembly
hbase-checkstyle
hbase-client
hbase-common
hbase-examples
hbase-external-blockcache
hbase-hadoop2-compat
hbase-hadoop-compat
hbase-it
hbase-native-client
hbase-prefix-tree
hbase-procedure
hbase-protocol
hbase-resource-bundle
hbase-rest
hbase-server
hbase-shaded
hbase-shell
hbase-testing-util
hbase-thrift
LICENSE.txt
NOTICE.txt
pom.xml
README.txt
src
target
++ wc -l
++ grep -e -Dhbase.test
++ grep surefirebooter
++ jps -v
+ ZOMBIE_TESTS_COUNT=0
+ [[ 0 != 0 ]]
+ echo 'We'\''re ok: there is no zombie test'
We're ok: there is no zombie test
POST BUILD TASK : SUCCESS
END OF POST BUILD TASK : 0
Archiving artifacts
Recording test results

Mime
View raw message