hbase-builds mailing list archives

Site index · List index
Message view « Date » · « Thread »
Top « Date » · « Thread »
From Apache Jenkins Server <jenk...@builds.apache.org>
Subject Build failed in Jenkins: HBase-Trunk_matrix » latest1.7,yahoo-not-h2 #736
Date Thu, 25 Feb 2016 04:02:48 GMT
See <https://builds.apache.org/job/HBase-Trunk_matrix/jdk=latest1.7,label=yahoo-not-h2/736/changes>

Changes:

[eclark] HBASE-15222 Use less contended classes for metrics

[eclark] HBASE-15319 clearJmxCache does not take effect actually

------------------------------------------
[...truncated 4414 lines...]
Tests run: 9, Failures: 0, Errors: 0, Skipped: 0, Time elapsed: 1.499 sec - in org.apache.hadoop.hbase.client.TestResult
Running org.apache.hadoop.hbase.client.TestPutDeleteEtcCellIteration
Tests run: 6, Failures: 0, Errors: 0, Skipped: 0, Time elapsed: 1.689 sec - in org.apache.hadoop.hbase.client.TestPutDeleteEtcCellIteration
Running org.apache.hadoop.hbase.client.TestHBaseAdminNoCluster
Tests run: 2, Failures: 0, Errors: 0, Skipped: 1, Time elapsed: 14.502 sec - in org.apache.hadoop.hbase.client.TestHBaseAdminNoCluster
Running org.apache.hadoop.hbase.quotas.TestQuotaState
Tests run: 5, Failures: 0, Errors: 0, Skipped: 0, Time elapsed: 4.201 sec - in org.apache.hadoop.hbase.quotas.TestQuotaState
Running org.apache.hadoop.hbase.quotas.TestRateLimiter
Tests run: 12, Failures: 0, Errors: 0, Skipped: 0, Time elapsed: 1.784 sec - in org.apache.hadoop.hbase.quotas.TestRateLimiter
Running org.apache.hadoop.hbase.snapshot.TestMobRestoreSnapshotHelper
Tests run: 2, Failures: 0, Errors: 0, Skipped: 0, Time elapsed: 8.908 sec - in org.apache.hadoop.hbase.snapshot.TestMobRestoreSnapshotHelper
Running org.apache.hadoop.hbase.snapshot.TestRestoreSnapshotHelper
Tests run: 2, Failures: 0, Errors: 0, Skipped: 0, Time elapsed: 9.368 sec - in org.apache.hadoop.hbase.snapshot.TestRestoreSnapshotHelper
Running org.apache.hadoop.hbase.coprocessor.TestCoprocessorConfiguration
Tests run: 5, Failures: 0, Errors: 0, Skipped: 0, Time elapsed: 2.483 sec - in org.apache.hadoop.hbase.coprocessor.TestCoprocessorConfiguration
Running org.apache.hadoop.hbase.coprocessor.TestCoprocessorHost
Tests run: 1, Failures: 0, Errors: 0, Skipped: 0, Time elapsed: 1.917 sec - in org.apache.hadoop.hbase.coprocessor.TestCoprocessorHost
Running org.apache.hadoop.hbase.coprocessor.TestRegionObserverStacking
Tests run: 1, Failures: 0, Errors: 0, Skipped: 0, Time elapsed: 4.934 sec - in org.apache.hadoop.hbase.coprocessor.TestRegionObserverStacking
Running org.apache.hadoop.hbase.coprocessor.TestCoprocessorInterface
Tests run: 2, Failures: 0, Errors: 0, Skipped: 0, Time elapsed: 20.733 sec - in org.apache.hadoop.hbase.coprocessor.TestCoprocessorInterface
Running org.apache.hadoop.hbase.regionserver.TestStoreFileInfo
Tests run: 2, Failures: 0, Errors: 0, Skipped: 0, Time elapsed: 1.976 sec - in org.apache.hadoop.hbase.regionserver.TestStoreFileInfo
Running org.apache.hadoop.hbase.regionserver.TestResettingCounters
Tests run: 1, Failures: 0, Errors: 0, Skipped: 0, Time elapsed: 8.797 sec - in org.apache.hadoop.hbase.regionserver.TestResettingCounters
Running org.apache.hadoop.hbase.regionserver.TestBlocksScanned
Tests run: 2, Failures: 0, Errors: 0, Skipped: 0, Time elapsed: 19.149 sec - in org.apache.hadoop.hbase.regionserver.TestBlocksScanned
Running org.apache.hadoop.hbase.regionserver.TestKeyValueScanFixture
Tests run: 1, Failures: 0, Errors: 0, Skipped: 0, Time elapsed: 0.878 sec - in org.apache.hadoop.hbase.regionserver.TestKeyValueScanFixture
Running org.apache.hadoop.hbase.regionserver.TestMinVersions
Tests run: 6, Failures: 0, Errors: 0, Skipped: 0, Time elapsed: 11.789 sec - in org.apache.hadoop.hbase.regionserver.TestMinVersions
Running org.apache.hadoop.hbase.regionserver.TestExplicitColumnTracker
Tests run: 4, Failures: 0, Errors: 0, Skipped: 0, Time elapsed: 3.025 sec - in org.apache.hadoop.hbase.regionserver.TestExplicitColumnTracker
Running org.apache.hadoop.hbase.regionserver.TestDefaultStoreEngine
Tests run: 1, Failures: 0, Errors: 0, Skipped: 0, Time elapsed: 2.527 sec - in org.apache.hadoop.hbase.regionserver.TestDefaultStoreEngine
Running org.apache.hadoop.hbase.regionserver.TestTimeRangeTracker
Tests run: 3, Failures: 0, Errors: 0, Skipped: 0, Time elapsed: 0.851 sec - in org.apache.hadoop.hbase.regionserver.TestTimeRangeTracker
Running org.apache.hadoop.hbase.regionserver.TestQosFunction
Tests run: 2, Failures: 0, Errors: 0, Skipped: 0, Time elapsed: 5.514 sec - in org.apache.hadoop.hbase.regionserver.TestQosFunction
Running org.apache.hadoop.hbase.regionserver.TestScanWildcardColumnTracker
Tests run: 2, Failures: 0, Errors: 0, Skipped: 0, Time elapsed: 0.746 sec - in org.apache.hadoop.hbase.regionserver.TestScanWildcardColumnTracker
Running org.apache.hadoop.hbase.regionserver.TestKeepDeletes
Tests run: 12, Failures: 0, Errors: 0, Skipped: 0, Time elapsed: 14.648 sec - in org.apache.hadoop.hbase.regionserver.TestKeepDeletes
Running org.apache.hadoop.hbase.regionserver.TestDefaultCompactSelection
Tests run: 4, Failures: 0, Errors: 0, Skipped: 0, Time elapsed: 7.458 sec - in org.apache.hadoop.hbase.regionserver.TestDefaultCompactSelection
Running org.apache.hadoop.hbase.regionserver.TestScanDeleteTracker
Tests run: 8, Failures: 0, Errors: 0, Skipped: 0, Time elapsed: 1.244 sec - in org.apache.hadoop.hbase.regionserver.TestScanDeleteTracker
Running org.apache.hadoop.hbase.regionserver.TestBulkLoad
Tests run: 9, Failures: 0, Errors: 0, Skipped: 0, Time elapsed: 9.78 sec - in org.apache.hadoop.hbase.regionserver.TestBulkLoad
Running org.apache.hadoop.hbase.regionserver.TestRegionSplitPolicy
Tests run: 7, Failures: 0, Errors: 0, Skipped: 0, Time elapsed: 6.401 sec - in org.apache.hadoop.hbase.regionserver.TestRegionSplitPolicy
Running org.apache.hadoop.hbase.regionserver.TestStripeCompactor
Tests run: 3, Failures: 0, Errors: 0, Skipped: 0, Time elapsed: 5.04 sec - in org.apache.hadoop.hbase.regionserver.TestStripeCompactor
Running org.apache.hadoop.hbase.regionserver.TestServerNonceManager
Tests run: 6, Failures: 0, Errors: 0, Skipped: 0, Time elapsed: 5.188 sec - in org.apache.hadoop.hbase.regionserver.TestServerNonceManager
Running org.apache.hadoop.hbase.regionserver.TestHRegionFileSystem
Tests run: 3, Failures: 0, Errors: 0, Skipped: 0, Time elapsed: 21.448 sec - in org.apache.hadoop.hbase.regionserver.TestHRegionFileSystem
Running org.apache.hadoop.hbase.regionserver.TestScanWithBloomError
Tests run: 3, Failures: 0, Errors: 0, Skipped: 0, Time elapsed: 8.329 sec - in org.apache.hadoop.hbase.regionserver.TestScanWithBloomError
Running org.apache.hadoop.hbase.regionserver.TestStripeStoreEngine
Tests run: 2, Failures: 0, Errors: 0, Skipped: 0, Time elapsed: 3.908 sec - in org.apache.hadoop.hbase.regionserver.TestStripeStoreEngine
Running org.apache.hadoop.hbase.regionserver.TestHRegionInfo
Tests run: 11, Failures: 0, Errors: 0, Skipped: 0, Time elapsed: 12.763 sec - in org.apache.hadoop.hbase.regionserver.TestHRegionInfo
Running org.apache.hadoop.hbase.regionserver.TestHeapMemoryManager
Tests run: 13, Failures: 0, Errors: 0, Skipped: 0, Time elapsed: 23.051 sec - in org.apache.hadoop.hbase.regionserver.TestHeapMemoryManager
Running org.apache.hadoop.hbase.regionserver.TestMemStoreLAB
Tests run: 3, Failures: 0, Errors: 0, Skipped: 0, Time elapsed: 3.653 sec - in org.apache.hadoop.hbase.regionserver.TestMemStoreLAB
Running org.apache.hadoop.hbase.regionserver.wal.TestMetricsWAL
Tests run: 3, Failures: 0, Errors: 0, Skipped: 0, Time elapsed: 2.446 sec - in org.apache.hadoop.hbase.regionserver.wal.TestMetricsWAL
Running org.apache.hadoop.hbase.regionserver.wal.TestSequenceIdAccounting
Tests run: 3, Failures: 0, Errors: 0, Skipped: 0, Time elapsed: 0.821 sec - in org.apache.hadoop.hbase.regionserver.wal.TestSequenceIdAccounting
Running org.apache.hadoop.hbase.regionserver.wal.TestCompressor
Tests run: 4, Failures: 0, Errors: 0, Skipped: 0, Time elapsed: 1.027 sec - in org.apache.hadoop.hbase.regionserver.wal.TestCompressor
Running org.apache.hadoop.hbase.regionserver.wal.TestWALCellCodecWithCompression
Tests run: 2, Failures: 0, Errors: 0, Skipped: 0, Time elapsed: 0.776 sec - in org.apache.hadoop.hbase.regionserver.wal.TestWALCellCodecWithCompression
Running org.apache.hadoop.hbase.regionserver.wal.TestCustomWALCellCodec
Tests run: 1, Failures: 0, Errors: 0, Skipped: 0, Time elapsed: 0.73 sec - in org.apache.hadoop.hbase.regionserver.wal.TestCustomWALCellCodec
Running org.apache.hadoop.hbase.regionserver.wal.TestKeyValueCompression
Tests run: 3, Failures: 0, Errors: 0, Skipped: 0, Time elapsed: 0.613 sec - in org.apache.hadoop.hbase.regionserver.wal.TestKeyValueCompression
Running org.apache.hadoop.hbase.regionserver.wal.TestWALActionsListener
Tests run: 1, Failures: 0, Errors: 0, Skipped: 0, Time elapsed: 1.823 sec - in org.apache.hadoop.hbase.regionserver.wal.TestWALActionsListener
Running org.apache.hadoop.hbase.regionserver.TestScanner
Tests run: 7, Failures: 0, Errors: 0, Skipped: 0, Time elapsed: 25.397 sec - in org.apache.hadoop.hbase.regionserver.TestScanner
Running org.apache.hadoop.hbase.regionserver.TestStripeStoreFileManager
Tests run: 15, Failures: 0, Errors: 0, Skipped: 0, Time elapsed: 15.067 sec - in org.apache.hadoop.hbase.regionserver.TestStripeStoreFileManager
Running org.apache.hadoop.hbase.regionserver.TestRegionMergeTransaction
Tests run: 11, Failures: 0, Errors: 0, Skipped: 0, Time elapsed: 46.866 sec - in org.apache.hadoop.hbase.regionserver.TestRegionMergeTransaction
Running org.apache.hadoop.hbase.regionserver.TestStoreFile
Tests run: 13, Failures: 0, Errors: 0, Skipped: 0, Time elapsed: 11.655 sec - in org.apache.hadoop.hbase.regionserver.TestStoreFile
Running org.apache.hadoop.hbase.regionserver.TestRSStatusServlet
Tests run: 2, Failures: 0, Errors: 0, Skipped: 0, Time elapsed: 3.942 sec - in org.apache.hadoop.hbase.regionserver.TestRSStatusServlet
Running org.apache.hadoop.hbase.regionserver.TestMemStoreChunkPool
Tests run: 3, Failures: 0, Errors: 0, Skipped: 0, Time elapsed: 1.918 sec - in org.apache.hadoop.hbase.regionserver.TestMemStoreChunkPool
Running org.apache.hadoop.hbase.regionserver.TestWideScanner
Tests run: 1, Failures: 0, Errors: 0, Skipped: 0, Time elapsed: 10.339 sec - in org.apache.hadoop.hbase.regionserver.TestWideScanner
Running org.apache.hadoop.hbase.regionserver.TestKeyValueHeap
Tests run: 4, Failures: 0, Errors: 0, Skipped: 0, Time elapsed: 0.951 sec - in org.apache.hadoop.hbase.regionserver.TestKeyValueHeap
Running org.apache.hadoop.hbase.regionserver.TestMetricsRegion
Tests run: 1, Failures: 0, Errors: 1, Skipped: 0, Time elapsed: 1.001 sec <<< FAILURE!
- in org.apache.hadoop.hbase.regionserver.TestMetricsRegion
testRegionWrapperMetrics(org.apache.hadoop.hbase.regionserver.TestMetricsRegion)  Time elapsed:
0.92 sec  <<< ERROR!
java.lang.NullPointerException: null
	at org.apache.hadoop.metrics2.lib.MutableHistogram.updateSnapshotMetrics(MutableHistogram.java:72)
	at org.apache.hadoop.metrics2.lib.MutableRangeHistogram.snapshot(MutableRangeHistogram.java:59)
	at org.apache.hadoop.metrics2.lib.DynamicMetricsRegistry.snapshot(DynamicMetricsRegistry.java:391)
	at org.apache.hadoop.hbase.regionserver.MetricsRegionAggregateSourceImpl.getMetrics(MetricsRegionAggregateSourceImpl.java:109)
	at org.apache.hadoop.hbase.test.MetricsAssertHelperImpl.getMetrics(MetricsAssertHelperImpl.java:243)
	at org.apache.hadoop.hbase.test.MetricsAssertHelperImpl.getGaugeLong(MetricsAssertHelperImpl.java:224)
	at org.apache.hadoop.hbase.test.MetricsAssertHelperImpl.assertGauge(MetricsAssertHelperImpl.java:147)
	at org.apache.hadoop.hbase.regionserver.TestMetricsRegion.testRegionWrapperMetrics(TestMetricsRegion.java:39)

Running org.apache.hadoop.hbase.regionserver.TestMultiVersionConcurrencyControlBasic
Tests run: 1, Failures: 0, Errors: 0, Skipped: 0, Time elapsed: 0.61 sec - in org.apache.hadoop.hbase.regionserver.TestMultiVersionConcurrencyControlBasic
Running org.apache.hadoop.hbase.regionserver.TestQueryMatcher
Tests run: 5, Failures: 0, Errors: 0, Skipped: 0, Time elapsed: 1.21 sec - in org.apache.hadoop.hbase.regionserver.TestQueryMatcher
Running org.apache.hadoop.hbase.regionserver.TestStoreFileScannerWithTagCompression
Tests run: 1, Failures: 0, Errors: 0, Skipped: 0, Time elapsed: 0.876 sec - in org.apache.hadoop.hbase.regionserver.TestStoreFileScannerWithTagCompression
Running org.apache.hadoop.hbase.regionserver.TestStoreFileRefresherChore
Tests run: 1, Failures: 0, Errors: 0, Skipped: 0, Time elapsed: 11.836 sec - in org.apache.hadoop.hbase.regionserver.TestStoreFileRefresherChore
Running org.apache.hadoop.hbase.regionserver.compactions.TestStripeCompactionPolicy
Tests run: 15, Failures: 0, Errors: 0, Skipped: 0, Time elapsed: 8.23 sec - in org.apache.hadoop.hbase.regionserver.compactions.TestStripeCompactionPolicy
Running org.apache.hadoop.hbase.regionserver.compactions.TestOffPeakHours
Tests run: 3, Failures: 0, Errors: 0, Skipped: 0, Time elapsed: 0.614 sec - in org.apache.hadoop.hbase.regionserver.compactions.TestOffPeakHours
Running org.apache.hadoop.hbase.regionserver.TestMiniBatchOperationInProgress
Tests run: 1, Failures: 0, Errors: 0, Skipped: 0, Time elapsed: 0.609 sec - in org.apache.hadoop.hbase.regionserver.TestMiniBatchOperationInProgress
Running org.apache.hadoop.hbase.regionserver.TestMetricsRegionServer
Tests run: 3, Failures: 0, Errors: 2, Skipped: 0, Time elapsed: 1.428 sec <<< FAILURE!
- in org.apache.hadoop.hbase.regionserver.TestMetricsRegionServer
testWrapperSource(org.apache.hadoop.hbase.regionserver.TestMetricsRegionServer)  Time elapsed:
0.227 sec  <<< ERROR!
java.lang.NullPointerException: null
	at org.apache.hadoop.metrics2.lib.MutableHistogram.updateSnapshotMetrics(MutableHistogram.java:72)
	at org.apache.hadoop.metrics2.lib.MutableRangeHistogram.snapshot(MutableRangeHistogram.java:59)
	at org.apache.hadoop.metrics2.lib.DynamicMetricsRegistry.snapshot(DynamicMetricsRegistry.java:391)
	at org.apache.hadoop.hbase.regionserver.MetricsRegionServerSourceImpl.getMetrics(MetricsRegionServerSourceImpl.java:334)
	at org.apache.hadoop.hbase.test.MetricsAssertHelperImpl.getMetrics(MetricsAssertHelperImpl.java:243)
	at org.apache.hadoop.hbase.test.MetricsAssertHelperImpl.assertTag(MetricsAssertHelperImpl.java:140)
	at org.apache.hadoop.hbase.regionserver.TestMetricsRegionServer.testWrapperSource(TestMetricsRegionServer.java:57)

testSlowCount(org.apache.hadoop.hbase.regionserver.TestMetricsRegionServer)  Time elapsed:
0.104 sec  <<< ERROR!
java.lang.NullPointerException: null
	at org.apache.hadoop.metrics2.lib.MutableHistogram.updateSnapshotMetrics(MutableHistogram.java:72)
	at org.apache.hadoop.metrics2.lib.MutableRangeHistogram.snapshot(MutableRangeHistogram.java:59)
	at org.apache.hadoop.metrics2.lib.DynamicMetricsRegistry.snapshot(DynamicMetricsRegistry.java:391)
	at org.apache.hadoop.hbase.regionserver.MetricsRegionServerSourceImpl.getMetrics(MetricsRegionServerSourceImpl.java:334)
	at org.apache.hadoop.hbase.test.MetricsAssertHelperImpl.getMetrics(MetricsAssertHelperImpl.java:243)
	at org.apache.hadoop.hbase.test.MetricsAssertHelperImpl.getCounter(MetricsAssertHelperImpl.java:201)
	at org.apache.hadoop.hbase.test.MetricsAssertHelperImpl.assertCounter(MetricsAssertHelperImpl.java:183)
	at org.apache.hadoop.hbase.regionserver.TestMetricsRegionServer.testSlowCount(TestMetricsRegionServer.java:128)

Running org.apache.hadoop.hbase.regionserver.TestSplitTransaction
Tests run: 8, Failures: 0, Errors: 0, Skipped: 0, Time elapsed: 108.627 sec - in org.apache.hadoop.hbase.regionserver.TestSplitTransaction
Running org.apache.hadoop.hbase.regionserver.TestCellSkipListSet
Tests run: 4, Failures: 0, Errors: 0, Skipped: 0, Time elapsed: 1.006 sec - in org.apache.hadoop.hbase.regionserver.TestCellSkipListSet
Running org.apache.hadoop.hbase.TestServerName
Tests run: 7, Failures: 0, Errors: 0, Skipped: 0, Time elapsed: 1.795 sec - in org.apache.hadoop.hbase.TestServerName
Running org.apache.hadoop.hbase.TestServerLoad
Tests run: 3, Failures: 0, Errors: 0, Skipped: 0, Time elapsed: 0.873 sec - in org.apache.hadoop.hbase.TestServerLoad
Running org.apache.hadoop.hbase.TestHDFSBlocksDistribution
Tests run: 2, Failures: 0, Errors: 0, Skipped: 0, Time elapsed: 0.786 sec - in org.apache.hadoop.hbase.TestHDFSBlocksDistribution
Running org.apache.hadoop.hbase.errorhandling.TestTimeoutExceptionInjector
Tests run: 4, Failures: 0, Errors: 0, Skipped: 0, Time elapsed: 1.421 sec - in org.apache.hadoop.hbase.errorhandling.TestTimeoutExceptionInjector
Running org.apache.hadoop.hbase.errorhandling.TestForeignExceptionDispatcher
Tests run: 3, Failures: 0, Errors: 0, Skipped: 0, Time elapsed: 1.06 sec - in org.apache.hadoop.hbase.errorhandling.TestForeignExceptionDispatcher
Running org.apache.hadoop.hbase.errorhandling.TestForeignExceptionSerialization
Tests run: 2, Failures: 0, Errors: 0, Skipped: 0, Time elapsed: 0.744 sec - in org.apache.hadoop.hbase.errorhandling.TestForeignExceptionSerialization
Running org.apache.hadoop.hbase.TestFSTableDescriptorForceCreation
Tests run: 3, Failures: 0, Errors: 0, Skipped: 0, Time elapsed: 3.883 sec - in org.apache.hadoop.hbase.TestFSTableDescriptorForceCreation
Running org.apache.hadoop.hbase.TestCheckTestClasses
Tests run: 1, Failures: 0, Errors: 0, Skipped: 0, Time elapsed: 8.035 sec - in org.apache.hadoop.hbase.TestCheckTestClasses

Results :

Failed tests: 
  TestSimpleRpcScheduler.testSoftAndHardQueueLimits:360 null
Tests in error: 
  TestRpcMetrics.testSourceMethods:90 » NullPointer
  TestRpcMetrics.testWrapperSource:68 » NullPointer
  TestMetricsRegion.testRegionWrapperMetrics:39 » NullPointer
  TestMetricsRegionServer.testSlowCount:128 » NullPointer
  TestMetricsRegionServer.testWrapperSource:57 » NullPointer

Tests run: 1041, Failures: 1, Errors: 5, Skipped: 21

[INFO] ------------------------------------------------------------------------
[INFO] Reactor Summary:
[INFO] 
[INFO] Apache HBase ...................................... SUCCESS [ 10.363 s]
[INFO] Apache HBase - Checkstyle ......................... SUCCESS [  3.046 s]
[INFO] Apache HBase - Resource Bundle .................... SUCCESS [  0.473 s]
[INFO] Apache HBase - Annotations ........................ SUCCESS [  0.845 s]
[INFO] Apache HBase - Protocol ........................... SUCCESS [  7.295 s]
[INFO] Apache HBase - Common ............................. SUCCESS [04:14 min]
[INFO] Apache HBase - Procedure .......................... SUCCESS [05:15 min]
[INFO] Apache HBase - Client ............................. SUCCESS [01:43 min]
[INFO] Apache HBase - Hadoop Compatibility ............... SUCCESS [ 14.034 s]
[INFO] Apache HBase - Hadoop Two Compatibility ........... SUCCESS [ 25.591 s]
[INFO] Apache HBase - Prefix Tree ........................ SUCCESS [ 30.836 s]
[INFO] Apache HBase - Server ............................. FAILURE [48:54 min]
[INFO] Apache HBase - Testing Util ....................... SKIPPED
[INFO] Apache HBase - Thrift ............................. SKIPPED
[INFO] Apache HBase - Shell .............................. SKIPPED
[INFO] Apache HBase - Integration Tests .................. SKIPPED
[INFO] Apache HBase - Examples ........................... SKIPPED
[INFO] Apache HBase - Rest ............................... SKIPPED
[INFO] Apache HBase - External Block Cache ............... SKIPPED
[INFO] Apache HBase - Spark .............................. SKIPPED
[INFO] Apache HBase - Assembly ........................... SKIPPED
[INFO] Apache HBase - Shaded ............................. SKIPPED
[INFO] Apache HBase - Shaded - Client .................... SKIPPED
[INFO] Apache HBase - Shaded - Server .................... SKIPPED
[INFO] Apache HBase - Archetypes ......................... SKIPPED
[INFO] Apache HBase - Exemplar for hbase-client archetype  SKIPPED
[INFO] Apache HBase - Archetype builder .................. SKIPPED
[INFO] ------------------------------------------------------------------------
[INFO] BUILD FAILURE
[INFO] ------------------------------------------------------------------------
[INFO] Total time: 01:01 h
[INFO] Finished at: 2016-02-25T04:01:29+00:00
[INFO] Final Memory: 73M/843M
[INFO] ------------------------------------------------------------------------
[ERROR] Failed to execute goal org.apache.maven.plugins:maven-surefire-plugin:2.18.1:test
(default-test) on project hbase-server: There are test failures.
[ERROR] 
[ERROR] Please refer to <https://builds.apache.org/job/HBase-Trunk_matrix/jdk=latest1.7,label=yahoo-not-h2/ws/hbase-server/target/surefire-reports>
for the individual test results.
[ERROR] -> [Help 1]
[ERROR] 
[ERROR] To see the full stack trace of the errors, re-run Maven with the -e switch.
[ERROR] Re-run Maven using the -X switch to enable full debug logging.
[ERROR] 
[ERROR] For more information about the errors and possible solutions, please read the following
articles:
[ERROR] [Help 1] http://cwiki.apache.org/confluence/display/MAVEN/MojoFailureException
[ERROR] 
[ERROR] After correcting the problems, you can resume the build with the command
[ERROR]   mvn <goals> -rf :hbase-server
Build step 'Invoke top-level Maven targets' marked build as failure
Performing Post build task...
Match found for :.* : True
Logical operation result is TRUE
Running script  : # Run zombie detector script
./dev-support/zombie-detector.sh --jenkins ${BUILD_ID}
[yahoo-not-h2] $ /bin/bash -xe /tmp/hudson7310062059463803942.sh
+ ./dev-support/zombie-detector.sh --jenkins 736
Thu Feb 25 04:01:32 UTC 2016 We're ok: there is no zombie test


    {color:green}+1 zombies{color}. No zombie tests found running at the end of the build.
POST BUILD TASK : SUCCESS
END OF POST BUILD TASK : 0
Archiving artifacts
Recording test results
[FINDBUGS] Skipping publisher since build result is FAILURE
[CHECKSTYLE] Skipping publisher since build result is FAILURE

Mime
View raw message