hbase-builds mailing list archives

Site index · List index
Message view « Date » · « Thread »
Top « Date » · « Thread »
From Apache Jenkins Server <jenk...@builds.apache.org>
Subject Build failed in Jenkins: HBase-1.3 » latest1.8,Hadoop #504
Date Thu, 21 Jan 2016 01:04:43 GMT
See <https://builds.apache.org/job/HBase-1.3/jdk=latest1.8,label=Hadoop/504/changes>

Changes:

[antonov] HBASE-15139 Connection manager doesn't pass client metrics to RpcClient

------------------------------------------
[...truncated 44404 lines...]
Java HotSpot(TM) 64-Bit Server VM warning: ignoring option MaxPermSize=256m; support was removed
in 8.0
Java HotSpot(TM) 64-Bit Server VM warning: ignoring option MaxPermSize=256m; support was removed
in 8.0
Running org.apache.hadoop.hbase.wal.TestWALMethods
Tests run: 3, Failures: 0, Errors: 0, Skipped: 0, Time elapsed: 0.726 sec - in org.apache.hadoop.hbase.wal.TestWALMethods
Java HotSpot(TM) 64-Bit Server VM warning: ignoring option MaxPermSize=256m; support was removed
in 8.0
Running org.apache.hadoop.hbase.errorhandling.TestForeignExceptionDispatcher
Tests run: 3, Failures: 0, Errors: 0, Skipped: 0, Time elapsed: 0.511 sec - in org.apache.hadoop.hbase.errorhandling.TestForeignExceptionDispatcher
Java HotSpot(TM) 64-Bit Server VM warning: ignoring option MaxPermSize=256m; support was removed
in 8.0
Running org.apache.hadoop.hbase.errorhandling.TestForeignExceptionSerialization
Tests run: 2, Failures: 0, Errors: 0, Skipped: 0, Time elapsed: 0.414 sec - in org.apache.hadoop.hbase.errorhandling.TestForeignExceptionSerialization
Java HotSpot(TM) 64-Bit Server VM warning: ignoring option MaxPermSize=256m; support was removed
in 8.0
Running org.apache.hadoop.hbase.errorhandling.TestTimeoutExceptionInjector
Tests run: 4, Failures: 0, Errors: 0, Skipped: 0, Time elapsed: 0.567 sec - in org.apache.hadoop.hbase.errorhandling.TestTimeoutExceptionInjector
Java HotSpot(TM) 64-Bit Server VM warning: ignoring option MaxPermSize=256m; support was removed
in 8.0
Java HotSpot(TM) 64-Bit Server VM warning: ignoring option MaxPermSize=256m; support was removed
in 8.0
Java HotSpot(TM) 64-Bit Server VM warning: ignoring option MaxPermSize=256m; support was removed
in 8.0
Java HotSpot(TM) 64-Bit Server VM warning: ignoring option MaxPermSize=256m; support was removed
in 8.0
Java HotSpot(TM) 64-Bit Server VM warning: ignoring option MaxPermSize=256m; support was removed
in 8.0
Java HotSpot(TM) 64-Bit Server VM warning: ignoring option MaxPermSize=256m; support was removed
in 8.0
Java HotSpot(TM) 64-Bit Server VM warning: ignoring option MaxPermSize=256m; support was removed
in 8.0
Java HotSpot(TM) 64-Bit Server VM warning: ignoring option MaxPermSize=256m; support was removed
in 8.0
Java HotSpot(TM) 64-Bit Server VM warning: ignoring option MaxPermSize=256m; support was removed
in 8.0
Running org.apache.hadoop.hbase.replication.regionserver.TestReplicationThrottler
Tests run: 1, Failures: 0, Errors: 0, Skipped: 0, Time elapsed: 0.259 sec - in org.apache.hadoop.hbase.replication.regionserver.TestReplicationThrottler
Java HotSpot(TM) 64-Bit Server VM warning: ignoring option MaxPermSize=256m; support was removed
in 8.0
Java HotSpot(TM) 64-Bit Server VM warning: ignoring option MaxPermSize=256m; support was removed
in 8.0
Java HotSpot(TM) 64-Bit Server VM warning: ignoring option MaxPermSize=256m; support was removed
in 8.0
Java HotSpot(TM) 64-Bit Server VM warning: ignoring option MaxPermSize=256m; support was removed
in 8.0
Running org.apache.hadoop.hbase.replication.regionserver.TestReplicationSinkManager
Tests run: 5, Failures: 0, Errors: 0, Skipped: 0, Time elapsed: 0.795 sec - in org.apache.hadoop.hbase.replication.regionserver.TestReplicationSinkManager
Java HotSpot(TM) 64-Bit Server VM warning: ignoring option MaxPermSize=256m; support was removed
in 8.0
Java HotSpot(TM) 64-Bit Server VM warning: ignoring option MaxPermSize=256m; support was removed
in 8.0
Java HotSpot(TM) 64-Bit Server VM warning: ignoring option MaxPermSize=256m; support was removed
in 8.0
Java HotSpot(TM) 64-Bit Server VM warning: ignoring option MaxPermSize=256m; support was removed
in 8.0
Java HotSpot(TM) 64-Bit Server VM warning: ignoring option MaxPermSize=256m; support was removed
in 8.0
Java HotSpot(TM) 64-Bit Server VM warning: ignoring option MaxPermSize=256m; support was removed
in 8.0
Java HotSpot(TM) 64-Bit Server VM warning: ignoring option MaxPermSize=256m; support was removed
in 8.0
Java HotSpot(TM) 64-Bit Server VM warning: ignoring option MaxPermSize=256m; support was removed
in 8.0
Java HotSpot(TM) 64-Bit Server VM warning: ignoring option MaxPermSize=256m; support was removed
in 8.0
Java HotSpot(TM) 64-Bit Server VM warning: ignoring option MaxPermSize=256m; support was removed
in 8.0
Java HotSpot(TM) 64-Bit Server VM warning: ignoring option MaxPermSize=256m; support was removed
in 8.0
Java HotSpot(TM) 64-Bit Server VM warning: ignoring option MaxPermSize=256m; support was removed
in 8.0
Running org.apache.hadoop.hbase.replication.TestReplicationWALEntryFilters
Tests run: 4, Failures: 0, Errors: 0, Skipped: 0, Time elapsed: 0.629 sec - in org.apache.hadoop.hbase.replication.TestReplicationWALEntryFilters
Java HotSpot(TM) 64-Bit Server VM warning: ignoring option MaxPermSize=256m; support was removed
in 8.0
Java HotSpot(TM) 64-Bit Server VM warning: ignoring option MaxPermSize=256m; support was removed
in 8.0
Java HotSpot(TM) 64-Bit Server VM warning: ignoring option MaxPermSize=256m; support was removed
in 8.0
Java HotSpot(TM) 64-Bit Server VM warning: ignoring option MaxPermSize=256m; support was removed
in 8.0
Java HotSpot(TM) 64-Bit Server VM warning: ignoring option MaxPermSize=256m; support was removed
in 8.0
Running org.apache.hadoop.hbase.TestServerLoad
Tests run: 3, Failures: 0, Errors: 0, Skipped: 0, Time elapsed: 0.44 sec - in org.apache.hadoop.hbase.TestServerLoad
Java HotSpot(TM) 64-Bit Server VM warning: ignoring option MaxPermSize=256m; support was removed
in 8.0
Java HotSpot(TM) 64-Bit Server VM warning: ignoring option MaxPermSize=256m; support was removed
in 8.0
Java HotSpot(TM) 64-Bit Server VM warning: ignoring option MaxPermSize=256m; support was removed
in 8.0
Java HotSpot(TM) 64-Bit Server VM warning: ignoring option MaxPermSize=256m; support was removed
in 8.0
Java HotSpot(TM) 64-Bit Server VM warning: ignoring option MaxPermSize=256m; support was removed
in 8.0
Java HotSpot(TM) 64-Bit Server VM warning: ignoring option MaxPermSize=256m; support was removed
in 8.0
Running org.apache.hadoop.hbase.coprocessor.TestCoprocessorHost
Tests run: 1, Failures: 0, Errors: 0, Skipped: 0, Time elapsed: 0.457 sec - in org.apache.hadoop.hbase.coprocessor.TestCoprocessorHost
Java HotSpot(TM) 64-Bit Server VM warning: ignoring option MaxPermSize=256m; support was removed
in 8.0
Java HotSpot(TM) 64-Bit Server VM warning: ignoring option MaxPermSize=256m; support was removed
in 8.0
Java HotSpot(TM) 64-Bit Server VM warning: ignoring option MaxPermSize=256m; support was removed
in 8.0
Running org.apache.hadoop.hbase.coprocessor.TestRegionObserverStacking
Tests run: 1, Failures: 0, Errors: 0, Skipped: 0, Time elapsed: 1.142 sec - in org.apache.hadoop.hbase.coprocessor.TestRegionObserverStacking
Java HotSpot(TM) 64-Bit Server VM warning: ignoring option MaxPermSize=256m; support was removed
in 8.0
Running org.apache.hadoop.hbase.coprocessor.TestCoprocessorInterface
Tests run: 2, Failures: 0, Errors: 0, Skipped: 0, Time elapsed: 6.761 sec - in org.apache.hadoop.hbase.coprocessor.TestCoprocessorInterface
Java HotSpot(TM) 64-Bit Server VM warning: ignoring option MaxPermSize=256m; support was removed
in 8.0
Java HotSpot(TM) 64-Bit Server VM warning: ignoring option MaxPermSize=256m; support was removed
in 8.0
Java HotSpot(TM) 64-Bit Server VM warning: ignoring option MaxPermSize=256m; support was removed
in 8.0
Java HotSpot(TM) 64-Bit Server VM warning: ignoring option MaxPermSize=256m; support was removed
in 8.0
Running org.apache.hadoop.hbase.coprocessor.TestCoprocessorConfiguration
Tests run: 5, Failures: 0, Errors: 0, Skipped: 0, Time elapsed: 0.591 sec - in org.apache.hadoop.hbase.coprocessor.TestCoprocessorConfiguration
Java HotSpot(TM) 64-Bit Server VM warning: ignoring option MaxPermSize=256m; support was removed
in 8.0
Java HotSpot(TM) 64-Bit Server VM warning: ignoring option MaxPermSize=256m; support was removed
in 8.0
Java HotSpot(TM) 64-Bit Server VM warning: ignoring option MaxPermSize=256m; support was removed
in 8.0
Java HotSpot(TM) 64-Bit Server VM warning: ignoring option MaxPermSize=256m; support was removed
in 8.0
Java HotSpot(TM) 64-Bit Server VM warning: ignoring option MaxPermSize=256m; support was removed
in 8.0
Java HotSpot(TM) 64-Bit Server VM warning: ignoring option MaxPermSize=256m; support was removed
in 8.0
Java HotSpot(TM) 64-Bit Server VM warning: ignoring option MaxPermSize=256m; support was removed
in 8.0
Java HotSpot(TM) 64-Bit Server VM warning: ignoring option MaxPermSize=256m; support was removed
in 8.0
Java HotSpot(TM) 64-Bit Server VM warning: ignoring option MaxPermSize=256m; support was removed
in 8.0
Java HotSpot(TM) 64-Bit Server VM warning: ignoring option MaxPermSize=256m; support was removed
in 8.0
Java HotSpot(TM) 64-Bit Server VM warning: ignoring option MaxPermSize=256m; support was removed
in 8.0
Java HotSpot(TM) 64-Bit Server VM warning: ignoring option MaxPermSize=256m; support was removed
in 8.0
Java HotSpot(TM) 64-Bit Server VM warning: ignoring option MaxPermSize=256m; support was removed
in 8.0
Java HotSpot(TM) 64-Bit Server VM warning: ignoring option MaxPermSize=256m; support was removed
in 8.0
Java HotSpot(TM) 64-Bit Server VM warning: ignoring option MaxPermSize=256m; support was removed
in 8.0
Java HotSpot(TM) 64-Bit Server VM warning: ignoring option MaxPermSize=256m; support was removed
in 8.0
Java HotSpot(TM) 64-Bit Server VM warning: ignoring option MaxPermSize=256m; support was removed
in 8.0

Results :

Failed tests: 
  TestSecureIPC.testSaslNoCommonQop 
Expected: (an instance of javax.security.sasl.SaslException and exception with message a string
containing "No common protection layer between client and server")
     but: an instance of javax.security.sasl.SaslException <GSSException: No valid credentials
provided (Mechanism level: Failed to find any Kerberos tgt)> is a org.ietf.jgss.GSSException
Stacktrace was: GSSException: No valid credentials provided (Mechanism level: Failed to find
any Kerberos tgt)
	at sun.security.jgss.krb5.Krb5InitCredential.getInstance(Krb5InitCredential.java:147)
	at sun.security.jgss.krb5.Krb5MechFactory.getCredentialElement(Krb5MechFactory.java:122)
	at sun.security.jgss.krb5.Krb5MechFactory.getMechanismContext(Krb5MechFactory.java:187)
	at sun.security.jgss.GSSManagerImpl.getMechanismContext(GSSManagerImpl.java:224)
	at sun.security.jgss.GSSContextImpl.initSecContext(GSSContextImpl.java:212)
	at sun.security.jgss.GSSContextImpl.initSecContext(GSSContextImpl.java:179)
	at com.sun.security.sasl.gsskerb.GssKrb5Client.evaluateChallenge(GssKrb5Client.java:192)
	at org.apache.hadoop.hbase.security.HBaseSaslRpcClient.saslConnect(HBaseSaslRpcClient.java:181)
	at org.apache.hadoop.hbase.ipc.RpcClientImpl$Connection.setupSaslConnection(RpcClientImpl.java:617)
	at org.apache.hadoop.hbase.ipc.RpcClientImpl$Connection.access$700(RpcClientImpl.java:162)
	at org.apache.hadoop.hbase.ipc.RpcClientImpl$Connection$2.run(RpcClientImpl.java:743)
	at org.apache.hadoop.hbase.ipc.RpcClientImpl$Connection$2.run(RpcClientImpl.java:740)
	at java.security.AccessController.doPrivileged(Native Method)
	at javax.security.auth.Subject.doAs(Subject.java:422)
	at org.apache.hadoop.security.UserGroupInformation.doAs(UserGroupInformation.java:1614)
	at org.apache.hadoop.hbase.ipc.RpcClientImpl$Connection.setupIOstreams(RpcClientImpl.java:740)
	at org.apache.hadoop.hbase.ipc.RpcClientImpl$Connection.writeRequest(RpcClientImpl.java:906)
	at org.apache.hadoop.hbase.ipc.RpcClientImpl$Connection.tracedWriteRequest(RpcClientImpl.java:873)
	at org.apache.hadoop.hbase.ipc.RpcClientImpl.call(RpcClientImpl.java:1242)
	at org.apache.hadoop.hbase.ipc.AbstractRpcClient.callBlockingMethod(AbstractRpcClient.java:221)
	at org.apache.hadoop.hbase.ipc.AbstractRpcClient$BlockingRpcChannelImplementation.callBlockingMethod(AbstractRpcClient.java:326)
	at org.apache.hadoop.hbase.ipc.protobuf.generated.TestDelayedRpcProtos$TestDelayedService$BlockingStub.test(TestDelayedRpcProtos.java:1115)
	at org.apache.hadoop.hbase.ipc.TestDelayedRpc$TestThread.run(TestDelayedRpc.java:277)

Tests in error: 
  TestSecureIPC>AbstractTestSecureIPC.setUp:95 » FileNotFound /home/jenkins/jenk...

Tests run: 1001, Failures: 1, Errors: 1, Skipped: 20

[INFO] ------------------------------------------------------------------------
[INFO] Reactor Summary:
[INFO] 
[INFO] Apache HBase ...................................... SUCCESS [54.114s]
[INFO] Apache HBase - Checkstyle ......................... SUCCESS [4.682s]
[INFO] Apache HBase - Resource Bundle .................... SUCCESS [0.159s]
[INFO] Apache HBase - Annotations ........................ SUCCESS [1.051s]
[INFO] Apache HBase - Protocol ........................... SUCCESS [14.738s]
[INFO] Apache HBase - Common ............................. SUCCESS [1:57.401s]
[INFO] Apache HBase - Procedure .......................... SUCCESS [3:25.787s]
[INFO] Apache HBase - Client ............................. SUCCESS [1:16.388s]
[INFO] Apache HBase - Hadoop Compatibility ............... SUCCESS [7.902s]
[INFO] Apache HBase - Hadoop Two Compatibility ........... SUCCESS [7.958s]
[INFO] Apache HBase - Prefix Tree ........................ SUCCESS [7.539s]
[INFO] Apache HBase - Server ............................. FAILURE [13:52.382s]
[INFO] Apache HBase - Testing Util ....................... SKIPPED
[INFO] Apache HBase - Thrift ............................. SKIPPED
[INFO] Apache HBase - Rest ............................... SKIPPED
[INFO] Apache HBase - Shell .............................. SKIPPED
[INFO] Apache HBase - Integration Tests .................. SKIPPED
[INFO] Apache HBase - Examples ........................... SKIPPED
[INFO] Apache HBase - External Block Cache ............... SKIPPED
[INFO] Apache HBase - Assembly ........................... SKIPPED
[INFO] Apache HBase - Shaded ............................. SKIPPED
[INFO] Apache HBase - Shaded - Client .................... SKIPPED
[INFO] Apache HBase - Shaded - Server .................... SKIPPED
[INFO] ------------------------------------------------------------------------
[INFO] BUILD FAILURE
[INFO] ------------------------------------------------------------------------
[INFO] Total time: 22:26.250s
[INFO] Finished at: Thu Jan 21 01:04:17 UTC 2016
[INFO] Final Memory: 94M/1134M
[INFO] ------------------------------------------------------------------------
[ERROR] Failed to execute goal org.apache.maven.plugins:maven-surefire-plugin:2.18.1:test
(default-test) on project hbase-server: ExecutionException: java.lang.RuntimeException: There
was an error in the forked process
[ERROR] java.lang.ArrayIndexOutOfBoundsException: 1
[ERROR] at org.apache.maven.surefire.common.junit4.JUnit4ProviderUtil.generateFailingTests(JUnit4ProviderUtil.java:64)
[ERROR] at org.apache.maven.surefire.junitcore.JUnitCoreProvider.invoke(JUnitCoreProvider.java:151)
[ERROR] at org.apache.maven.surefire.booter.ForkedBooter.invokeProviderInSameClassLoader(ForkedBooter.java:203)
[ERROR] at org.apache.maven.surefire.booter.ForkedBooter.runSuitesInProcess(ForkedBooter.java:155)
[ERROR] at org.apache.maven.surefire.booter.ForkedBooter.main(ForkedBooter.java:103)
[ERROR] -> [Help 1]
[ERROR] 
[ERROR] To see the full stack trace of the errors, re-run Maven with the -e switch.
[ERROR] Re-run Maven using the -X switch to enable full debug logging.
[ERROR] 
[ERROR] For more information about the errors and possible solutions, please read the following
articles:
[ERROR] [Help 1] http://cwiki.apache.org/confluence/display/MAVEN/MojoFailureException
[ERROR] 
[ERROR] After correcting the problems, you can resume the build with the command
[ERROR]   mvn <goals> -rf :hbase-server
Build step 'Invoke top-level Maven targets' marked build as failure
Performing Post build task...
Match found for :.* : True
Logical operation result is TRUE
Running script  : # Post-build task script. TODO: Check this in and have all builds reference
check-in.
pwd && ls
# NOTE!!!! The below code has been copied and pasted from ./dev-tools/run-test.sh
# Do not change here without syncing there and vice-versa.
ZOMBIE_TESTS_COUNT=`jps -v | grep surefirebooter | grep -e '-Dhbase.test' | wc -l`
if [[ $ZOMBIE_TESTS_COUNT != 0 ]] ; then
 echo "Suspicious java process found - waiting 30s to see if there are just slow to stop"
 sleep 30
 ZOMBIE_TESTS_COUNT=`jps -v | grep surefirebooter | grep -e '-Dhbase.test' | wc -l`
 if [[ $ZOMBIE_TESTS_COUNT != 0 ]] ; then
   echo " {color:red}There appear to be $ZOMBIE_TESTS_COUNT zombie tests{color}, they should
have been killed by surefire but survived"
   jps -v | grep surefirebooter | grep -e '-Dhbase.test'
   jps -v | grep surefirebooter | grep -e '-Dhbase.test' | cut -d ' ' -f 1 | xargs -n 1 jstack
   # Exit with error
   exit 1
 else
   echo "We're ok: there is no zombie test, but some tests took some time to stop"
 fi
else
  echo "We're ok: there is no zombie test"
fi
[Hadoop] $ /bin/bash -xe /tmp/hudson1478555589975016567.sh
+ pwd
<https://builds.apache.org/job/HBase-1.3/jdk=latest1.8,label=Hadoop/ws/>
+ ls
bin
CHANGES.txt
conf
dev-support
hbase-annotations
hbase-assembly
hbase-checkstyle
hbase-client
hbase-common
hbase-examples
hbase-external-blockcache
hbase-hadoop2-compat
hbase-hadoop-compat
hbase-it
hbase-native-client
hbase-prefix-tree
hbase-procedure
hbase-protocol
hbase-resource-bundle
hbase-rest
hbase-server
hbase-shaded
hbase-shell
hbase-testing-util
hbase-thrift
LICENSE.txt
NOTICE.txt
pom.xml
README.txt
src
target
++ jps -v
++ grep surefirebooter
++ wc -l
++ grep -e -Dhbase.test
+ ZOMBIE_TESTS_COUNT=0
+ [[ 0 != 0 ]]
+ echo 'We'\''re ok: there is no zombie test'
We're ok: there is no zombie test
POST BUILD TASK : SUCCESS
END OF POST BUILD TASK : 0
Archiving artifacts
Recording test results

Mime
View raw message