hbase-builds mailing list archives

Site index · List index
Message view « Date » · « Thread »
Top « Date » · « Thread »
From Apache Jenkins Server <jenk...@builds.apache.org>
Subject Build failed in Jenkins: HBase-Trunk_matrix » latest1.8,Hadoop #623
Date Sat, 09 Jan 2016 02:04:57 GMT
See <https://builds.apache.org/job/HBase-Trunk_matrix/jdk=latest1.8,label=Hadoop/623/changes>

Changes:

[eclark] HBASE-14975 Don't color the total RIT line yellow if it's zero (Pallavi

[tedyu] HBASE-15065 Addendum fixes checkstyle warnings

[tedyu] HBASE-15057 local-master-backup.sh doesn't start HMaster correctly

------------------------------------------
[...truncated 1685 lines...]
[INFO] 
[INFO] --- maven-resources-plugin:2.6:resources (default-resources) @ hbase-protocol ---
[INFO] Using 'UTF-8' encoding to copy filtered resources.
[INFO] skip non existing resourceDirectory <https://builds.apache.org/job/HBase-Trunk_matrix/jdk=latest1.8,label=Hadoop/ws/hbase-protocol/src/main/resources>
[INFO] Copying 3 resources
[INFO] 
[INFO] --- maven-compiler-plugin:3.2:compile (default-compile) @ hbase-protocol ---
[INFO] Nothing to compile - all classes are up to date
[INFO] 
[INFO] --- maven-resources-plugin:2.6:testResources (default-testResources) @ hbase-protocol
---
[INFO] Using 'UTF-8' encoding to copy filtered resources.
[INFO] skip non existing resourceDirectory <https://builds.apache.org/job/HBase-Trunk_matrix/jdk=latest1.8,label=Hadoop/ws/hbase-protocol/src/test/resources>
[INFO] Copying 3 resources
[INFO] 
[INFO] --- maven-compiler-plugin:3.2:testCompile (default-testCompile) @ hbase-protocol ---
[INFO] No sources to compile
[INFO] 
[INFO] --- maven-surefire-plugin:2.18.1:test (default-test) @ hbase-protocol ---
[INFO] Tests are skipped.
[INFO] 
[INFO] --- maven-surefire-plugin:2.18.1:test (secondPartTestsExecution) @ hbase-protocol ---
[INFO] Tests are skipped.
[INFO] 
[INFO] --- maven-source-plugin:2.2.1:jar-no-fork (attach-sources) @ hbase-protocol ---
[INFO] Building jar: <https://builds.apache.org/job/HBase-Trunk_matrix/jdk=latest1.8,label=Hadoop/ws/hbase-protocol/target/hbase-protocol-2.0.0-SNAPSHOT-sources.jar>
[INFO] 
[INFO] --- maven-jar-plugin:2.4:test-jar (default) @ hbase-protocol ---
[INFO] Building jar: <https://builds.apache.org/job/HBase-Trunk_matrix/jdk=latest1.8,label=Hadoop/ws/hbase-protocol/target/hbase-protocol-2.0.0-SNAPSHOT-tests.jar>
[INFO] 
[INFO] --- maven-jar-plugin:2.4:jar (default-jar) @ hbase-protocol ---
[INFO] Building jar: <https://builds.apache.org/job/HBase-Trunk_matrix/jdk=latest1.8,label=Hadoop/ws/hbase-protocol/target/hbase-protocol-2.0.0-SNAPSHOT.jar>
[INFO] 
[INFO] --- maven-checkstyle-plugin:2.17:checkstyle (default-cli) @ hbase-protocol ---
[INFO] There are 4 errors reported by Checkstyle 6.11.2 with hbase/checkstyle.xml ruleset.
[INFO]                                                                         
[INFO] ------------------------------------------------------------------------
[INFO] Building Apache HBase - Common 2.0.0-SNAPSHOT
[INFO] ------------------------------------------------------------------------
[INFO] 
[INFO] --- maven-enforcer-plugin:1.0.1:enforce (enforce) @ hbase-common ---
[INFO] 
[INFO] --- buildnumber-maven-plugin:1.3:create-timestamp (default) @ hbase-common ---
[INFO] 
[INFO] --- maven-antrun-plugin:1.8:run (generate) @ hbase-common ---
[INFO] Executing tasks

main:
     [exec] ~/jenkins-slave/workspace/HBase-Trunk_matrix/jdk/latest1.8/label/Hadoop/hbase-common
~/jenkins-slave/workspace/HBase-Trunk_matrix/jdk/latest1.8/label/Hadoop/hbase-common
     [exec] ~/jenkins-slave/workspace/HBase-Trunk_matrix/jdk/latest1.8/label/Hadoop/hbase-common
[INFO] Executed tasks
[INFO] 
[INFO] --- build-helper-maven-plugin:1.9.1:add-source (versionInfo-source) @ hbase-common
---
[INFO] Source directory: <https://builds.apache.org/job/HBase-Trunk_matrix/jdk=latest1.8,label=Hadoop/ws/hbase-common/target/generated-sources/java>
added.
[INFO] 
[INFO] --- maven-remote-resources-plugin:1.5:process (default) @ hbase-common ---
[INFO] 
[INFO] --- maven-resources-plugin:2.6:resources (default-resources) @ hbase-common ---
[INFO] Using 'UTF-8' encoding to copy filtered resources.
[INFO] Copying 1 resource
[INFO] Copying 3 resources
[INFO] 
[INFO] --- maven-antrun-plugin:1.8:run (default) @ hbase-common ---
[INFO] Executing tasks

main:
[INFO] Executed tasks
[INFO] 
[INFO] --- maven-compiler-plugin:3.2:compile (default-compile) @ hbase-common ---
[INFO] Compiling 2 source files to <https://builds.apache.org/job/HBase-Trunk_matrix/jdk=latest1.8,label=Hadoop/ws/hbase-common/target/classes>
[INFO] 
[INFO] --- maven-dependency-plugin:2.8:build-classpath (create-mrapp-generated-classpath)
@ hbase-common ---
[INFO] Skipped writing classpath file '<https://builds.apache.org/job/HBase-Trunk_matrix/jdk=latest1.8,label=Hadoop/ws/hbase-common/target/test-classes/mrapp-generated-classpath'.>
 No changes found.
[INFO] 
[INFO] --- maven-resources-plugin:2.6:testResources (default-testResources) @ hbase-common
---
[INFO] Using 'UTF-8' encoding to copy filtered resources.
[INFO] Copying 1 resource to META-INF/
[INFO] Copying 3 resources
[INFO] 
[INFO] --- maven-compiler-plugin:3.2:testCompile (default-testCompile) @ hbase-common ---
[INFO] Nothing to compile - all classes are up to date
[INFO] 
[INFO] --- maven-surefire-plugin:2.18.1:test (default-test) @ hbase-common ---
[INFO] Tests are skipped.
[INFO] 
[INFO] --- maven-surefire-plugin:2.18.1:test (secondPartTestsExecution) @ hbase-common ---
[INFO] Tests are skipped.
[INFO] 
[INFO] --- maven-source-plugin:2.2.1:jar-no-fork (attach-sources) @ hbase-common ---
[INFO] Building jar: <https://builds.apache.org/job/HBase-Trunk_matrix/jdk=latest1.8,label=Hadoop/ws/hbase-common/target/hbase-common-2.0.0-SNAPSHOT-sources.jar>
[INFO] 
[INFO] --- maven-jar-plugin:2.4:test-jar (default) @ hbase-common ---
[INFO] Building jar: <https://builds.apache.org/job/HBase-Trunk_matrix/jdk=latest1.8,label=Hadoop/ws/hbase-common/target/hbase-common-2.0.0-SNAPSHOT-tests.jar>
[INFO] 
[INFO] --- maven-jar-plugin:2.4:jar (default-jar) @ hbase-common ---
[INFO] Building jar: <https://builds.apache.org/job/HBase-Trunk_matrix/jdk=latest1.8,label=Hadoop/ws/hbase-common/target/hbase-common-2.0.0-SNAPSHOT.jar>
[INFO] 
[INFO] --- maven-checkstyle-plugin:2.17:checkstyle (default-cli) @ hbase-common ---
[INFO] There are 1188 errors reported by Checkstyle 6.11.2 with hbase/checkstyle.xml ruleset.
[INFO]                                                                         
[INFO] ------------------------------------------------------------------------
[INFO] Building Apache HBase - Procedure 2.0.0-SNAPSHOT
[INFO] ------------------------------------------------------------------------
[INFO] 
[INFO] --- maven-enforcer-plugin:1.0.1:enforce (enforce) @ hbase-procedure ---
[INFO] 
[INFO] --- buildnumber-maven-plugin:1.3:create-timestamp (default) @ hbase-procedure ---
[INFO] 
[INFO] --- maven-remote-resources-plugin:1.5:process (default) @ hbase-procedure ---
[INFO] 
[INFO] --- maven-resources-plugin:2.6:resources (default-resources) @ hbase-procedure ---
[INFO] Using 'UTF-8' encoding to copy filtered resources.
[INFO] skip non existing resourceDirectory <https://builds.apache.org/job/HBase-Trunk_matrix/jdk=latest1.8,label=Hadoop/ws/hbase-procedure/src/main/resources>
[INFO] Copying 3 resources
[INFO] 
[INFO] --- maven-compiler-plugin:3.2:compile (default-compile) @ hbase-procedure ---
[INFO] Nothing to compile - all classes are up to date
[INFO] 
[INFO] --- maven-resources-plugin:2.6:testResources (default-testResources) @ hbase-procedure
---
[INFO] Using 'UTF-8' encoding to copy filtered resources.
[INFO] Copying 2 resources
[INFO] Copying 3 resources
[INFO] 
[INFO] --- maven-compiler-plugin:3.2:testCompile (default-testCompile) @ hbase-procedure ---
[INFO] Nothing to compile - all classes are up to date
[INFO] 
[INFO] --- maven-surefire-plugin:2.18.1:test (default-test) @ hbase-procedure ---
[INFO] Tests are skipped.
[INFO] 
[INFO] --- maven-surefire-plugin:2.18.1:test (secondPartTestsExecution) @ hbase-procedure
---
[INFO] Tests are skipped.
[INFO] 
[INFO] --- maven-source-plugin:2.2.1:jar-no-fork (attach-sources) @ hbase-procedure ---
[INFO] Building jar: <https://builds.apache.org/job/HBase-Trunk_matrix/jdk=latest1.8,label=Hadoop/ws/hbase-procedure/target/hbase-procedure-2.0.0-SNAPSHOT-sources.jar>
[INFO] 
[INFO] --- maven-jar-plugin:2.4:test-jar (default) @ hbase-procedure ---
[INFO] Building jar: <https://builds.apache.org/job/HBase-Trunk_matrix/jdk=latest1.8,label=Hadoop/ws/hbase-procedure/target/hbase-procedure-2.0.0-SNAPSHOT-tests.jar>
[INFO] 
[INFO] --- maven-jar-plugin:2.4:jar (default-jar) @ hbase-procedure ---
[INFO] Building jar: <https://builds.apache.org/job/HBase-Trunk_matrix/jdk=latest1.8,label=Hadoop/ws/hbase-procedure/target/hbase-procedure-2.0.0-SNAPSHOT.jar>
[INFO] 
[INFO] --- maven-checkstyle-plugin:2.17:checkstyle (default-cli) @ hbase-procedure ---
[INFO] There are 33 errors reported by Checkstyle 6.11.2 with hbase/checkstyle.xml ruleset.
[INFO]                                                                         
[INFO] ------------------------------------------------------------------------
[INFO] Building Apache HBase - Client 2.0.0-SNAPSHOT
[INFO] ------------------------------------------------------------------------
[INFO] 
[INFO] --- maven-enforcer-plugin:1.0.1:enforce (enforce) @ hbase-client ---
[INFO] 
[INFO] --- buildnumber-maven-plugin:1.3:create-timestamp (default) @ hbase-client ---
[INFO] 
[INFO] --- maven-remote-resources-plugin:1.5:process (default) @ hbase-client ---
[INFO] 
[INFO] --- maven-resources-plugin:2.6:resources (default-resources) @ hbase-client ---
[INFO] Using 'UTF-8' encoding to copy filtered resources.
[INFO] Copying 1 resource
[INFO] Copying 3 resources
[INFO] 
[INFO] --- maven-compiler-plugin:3.2:compile (default-compile) @ hbase-client ---
[INFO] Compiling 3 source files to <https://builds.apache.org/job/HBase-Trunk_matrix/jdk=latest1.8,label=Hadoop/ws/hbase-client/target/classes>
[INFO] 
[INFO] --- maven-resources-plugin:2.6:testResources (default-testResources) @ hbase-client
---
[INFO] Using 'UTF-8' encoding to copy filtered resources.
[INFO] Copying 2 resources
[INFO] Copying 3 resources
[INFO] 
[INFO] --- maven-compiler-plugin:3.2:testCompile (default-testCompile) @ hbase-client ---
[INFO] Nothing to compile - all classes are up to date
[INFO] 
[INFO] --- maven-surefire-plugin:2.18.1:test (default-test) @ hbase-client ---
[INFO] Tests are skipped.
[INFO] 
[INFO] --- maven-surefire-plugin:2.18.1:test (secondPartTestsExecution) @ hbase-client ---
[INFO] Tests are skipped.
[INFO] 
[INFO] --- maven-source-plugin:2.2.1:jar-no-fork (attach-sources) @ hbase-client ---
[INFO] Building jar: <https://builds.apache.org/job/HBase-Trunk_matrix/jdk=latest1.8,label=Hadoop/ws/hbase-client/target/hbase-client-2.0.0-SNAPSHOT-sources.jar>
[INFO] 
[INFO] --- maven-jar-plugin:2.4:test-jar (default) @ hbase-client ---
[INFO] Building jar: <https://builds.apache.org/job/HBase-Trunk_matrix/jdk=latest1.8,label=Hadoop/ws/hbase-client/target/hbase-client-2.0.0-SNAPSHOT-tests.jar>
[INFO] 
[INFO] --- maven-jar-plugin:2.4:jar (default-jar) @ hbase-client ---
[INFO] Building jar: <https://builds.apache.org/job/HBase-Trunk_matrix/jdk=latest1.8,label=Hadoop/ws/hbase-client/target/hbase-client-2.0.0-SNAPSHOT.jar>
[INFO] 
[INFO] --- maven-checkstyle-plugin:2.17:checkstyle (default-cli) @ hbase-client ---
[INFO] ------------------------------------------------------------------------
[INFO] Reactor Summary:
[INFO] 
[INFO] Apache HBase ...................................... SUCCESS [  5.359 s]
[INFO] Apache HBase - Checkstyle ......................... SUCCESS [  1.175 s]
[INFO] Apache HBase - Resource Bundle .................... SUCCESS [  0.437 s]
[INFO] Apache HBase - Annotations ........................ SUCCESS [  1.784 s]
[INFO] Apache HBase - Protocol ........................... SUCCESS [03:00 min]
[INFO] Apache HBase - Common ............................. SUCCESS [ 54.171 s]
[INFO] Apache HBase - Procedure .......................... SUCCESS [  6.180 s]
[INFO] Apache HBase - Client ............................. FAILURE [ 55.068 s]
[INFO] Apache HBase - Hadoop Compatibility ............... SKIPPED
[INFO] Apache HBase - Hadoop Two Compatibility ........... SKIPPED
[INFO] Apache HBase - Prefix Tree ........................ SKIPPED
[INFO] Apache HBase - Server ............................. SKIPPED
[INFO] Apache HBase - Testing Util ....................... SKIPPED
[INFO] Apache HBase - Thrift ............................. SKIPPED
[INFO] Apache HBase - Shell .............................. SKIPPED
[INFO] Apache HBase - Integration Tests .................. SKIPPED
[INFO] Apache HBase - Examples ........................... SKIPPED
[INFO] Apache HBase - Rest ............................... SKIPPED
[INFO] Apache HBase - External Block Cache ............... SKIPPED
[INFO] Apache HBase - Assembly ........................... SKIPPED
[INFO] Apache HBase - Shaded ............................. SKIPPED
[INFO] Apache HBase - Shaded - Client .................... SKIPPED
[INFO] Apache HBase - Shaded - Server .................... SKIPPED
[INFO] Apache HBase - Spark .............................. SKIPPED
[INFO] ------------------------------------------------------------------------
[INFO] BUILD FAILURE
[INFO] ------------------------------------------------------------------------
[INFO] Total time: 05:05 min
[INFO] Finished at: 2016-01-09T02:04:34+00:00
[INFO] Final Memory: 131M/3821M
[INFO] ------------------------------------------------------------------------
[ERROR] Failed to execute goal org.apache.maven.plugins:maven-checkstyle-plugin:2.17:checkstyle
(default-cli) on project hbase-client: Execution default-cli of goal org.apache.maven.plugins:maven-checkstyle-plugin:2.17:checkstyle
failed. NullPointerException -> [Help 1]
[ERROR] 
[ERROR] To see the full stack trace of the errors, re-run Maven with the -e switch.
[ERROR] Re-run Maven using the -X switch to enable full debug logging.
[ERROR] 
[ERROR] For more information about the errors and possible solutions, please read the following
articles:
[ERROR] [Help 1] http://cwiki.apache.org/confluence/display/MAVEN/PluginExecutionException
[ERROR] 
[ERROR] After correcting the problems, you can resume the build with the command
[ERROR]   mvn <goals> -rf :hbase-client
Build step 'Invoke top-level Maven targets' marked build as failure
Performing Post build task...
Match found for :.* : True
Logical operation result is TRUE
Running script  : # Run zombie detector script
./dev-support/zombie-detector.sh --jenkins ${BUILD_ID}
[Hadoop] $ /bin/bash -xe /tmp/hudson6538511488388448126.sh
+ ./dev-support/zombie-detector.sh --jenkins 623
Sat Jan  9 02:04:35 UTC 2016 We're ok: there is no zombie test


    {color:green}+1 zombies{color}. No zombie tests found running at the end of the build.
POST BUILD TASK : SUCCESS
END OF POST BUILD TASK : 0
Archiving artifacts
Compressed 5.20 MB of artifacts by 46.9% relative to #622
Recording test results
ERROR: Publisher 'Publish JUnit test result report' failed: No test report files were found.
Configuration error?
[FINDBUGS] Skipping publisher since build result is FAILURE
[CHECKSTYLE] Skipping publisher since build result is FAILURE

Mime
View raw message