hbase-builds mailing list archives

Site index · List index
Message view « Date » · « Thread »
Top « Date » · « Thread »
From Apache Jenkins Server <jenk...@builds.apache.org>
Subject Build failed in Jenkins: HBase-0.94.28 #58
Date Tue, 05 Jan 2016 06:12:51 GMT
See <https://builds.apache.org/job/HBase-0.94.28/58/>

------------------------------------------
[...truncated 1608 lines...]
[WARNING] <https://builds.apache.org/job/HBase-0.94.28/ws/src/test/java/org/apache/hadoop/hbase/catalog/TestMetaReaderEditorNoCluster.java>:85:
warning - Tag @see: reference not found: https://issues.apache.org/jira/browse/HBASE-3446
[WARNING] <https://builds.apache.org/job/HBase-0.94.28/ws/src/test/java/org/apache/hadoop/hbase/HBaseCluster.java>:99:
warning - Tag @link: reference not found: HmasterInterface
[WARNING] <https://builds.apache.org/job/HBase-0.94.28/ws/src/test/java/org/apache/hadoop/hbase/HBaseCluster.java>:99:
warning - Tag @link: reference not found: HmasterInterface
[WARNING] <https://builds.apache.org/job/HBase-0.94.28/ws/src/test/java/org/apache/hadoop/hbase/HBaseCluster.java>:99:
warning - Tag @link: reference not found: HmasterInterface
[WARNING] <https://builds.apache.org/job/HBase-0.94.28/ws/src/test/java/org/apache/hadoop/hbase/HBaseCluster.java>:99:
warning - Tag @link: reference not found: HmasterInterface
[WARNING] <https://builds.apache.org/job/HBase-0.94.28/ws/src/test/java/org/apache/hadoop/hbase/HBaseCluster.java>:122:
warning - @return tag cannot be used in method with void return type.
[WARNING] <https://builds.apache.org/job/HBase-0.94.28/ws/src/test/java/org/apache/hadoop/hbase/HBaseCluster.java>:129:
warning - @return tag cannot be used in method with void return type.
[WARNING] <https://builds.apache.org/job/HBase-0.94.28/ws/src/test/java/org/apache/hadoop/hbase/HBaseCluster.java>:148:
warning - @return tag cannot be used in method with void return type.
[WARNING] <https://builds.apache.org/job/HBase-0.94.28/ws/src/test/java/org/apache/hadoop/hbase/HBaseCluster.java>:158:
warning - @return tag cannot be used in method with void return type.
[WARNING] <https://builds.apache.org/job/HBase-0.94.28/ws/src/test/java/org/apache/hadoop/hbase/HBaseTestCase.java>:210:
warning - Tag @link: reference not found: COLUMNS
[WARNING] <https://builds.apache.org/job/HBase-0.94.28/ws/src/test/java/org/apache/hadoop/hbase/HBaseTestCase.java>:221:
warning - Tag @link: reference not found: COLUMNS
[WARNING] <https://builds.apache.org/job/HBase-0.94.28/ws/src/test/java/org/apache/hadoop/hbase/HBaseTestCase.java>:234:
warning - Tag @link: reference not found: COLUMNS
[WARNING] <https://builds.apache.org/job/HBase-0.94.28/ws/src/test/java/org/apache/hadoop/hbase/HBaseTestCase.java>:210:
warning - Tag @link: reference not found: COLUMNS
[WARNING] <https://builds.apache.org/job/HBase-0.94.28/ws/src/test/java/org/apache/hadoop/hbase/HBaseTestCase.java>:221:
warning - Tag @link: reference not found: COLUMNS
[WARNING] <https://builds.apache.org/job/HBase-0.94.28/ws/src/test/java/org/apache/hadoop/hbase/HBaseTestCase.java>:234:
warning - Tag @link: reference not found: COLUMNS
[WARNING] <https://builds.apache.org/job/HBase-0.94.28/ws/src/test/java/org/apache/hadoop/hbase/HBaseTestingUtility.java>:2118:
warning - @return tag has no arguments.
[WARNING] <https://builds.apache.org/job/HBase-0.94.28/ws/src/test/java/org/apache/hadoop/hbase/HBaseTestingUtility.java>:1283:
warning - @return tag has no arguments.
[WARNING] <https://builds.apache.org/job/HBase-0.94.28/ws/src/test/java/org/apache/hadoop/hbase/HBaseTestingUtility.java>:2393:
warning - @return tag has no arguments.
[WARNING] <https://builds.apache.org/job/HBase-0.94.28/ws/src/test/java/org/apache/hadoop/hbase/HBaseTestingUtility.java>:719:
warning - Tag @see:illegal character: "123" in "{@link #startMiniCluster(int)}"
[WARNING] <https://builds.apache.org/job/HBase-0.94.28/ws/src/test/java/org/apache/hadoop/hbase/HBaseTestingUtility.java>:719:
warning - Tag @see:illegal character: "64" in "{@link #startMiniCluster(int)}"
[WARNING] <https://builds.apache.org/job/HBase-0.94.28/ws/src/test/java/org/apache/hadoop/hbase/HBaseTestingUtility.java>:553:
warning - Tag @see:illegal character: "123" in "{@link #shutdownMiniDFSCluster()}"
[WARNING] <https://builds.apache.org/job/HBase-0.94.28/ws/src/test/java/org/apache/hadoop/hbase/HBaseTestingUtility.java>:553:
warning - Tag @see:illegal character: "64" in "{@link #shutdownMiniDFSCluster()}"
[WARNING] <https://builds.apache.org/job/HBase-0.94.28/ws/src/test/java/org/apache/hadoop/hbase/HBaseTestingUtility.java>:570:
warning - Tag @see:illegal character: "123" in "{@link #shutdownMiniCluster()}"
[WARNING] <https://builds.apache.org/job/HBase-0.94.28/ws/src/test/java/org/apache/hadoop/hbase/HBaseTestingUtility.java>:570:
warning - Tag @see:illegal character: "64" in "{@link #shutdownMiniCluster()}"
[WARNING] <https://builds.apache.org/job/HBase-0.94.28/ws/src/test/java/org/apache/hadoop/hbase/HBaseTestingUtility.java>:582:
warning - Tag @see:illegal character: "123" in "{@link #shutdownMiniCluster()}"
[WARNING] <https://builds.apache.org/job/HBase-0.94.28/ws/src/test/java/org/apache/hadoop/hbase/HBaseTestingUtility.java>:582:
warning - Tag @see:illegal character: "64" in "{@link #shutdownMiniCluster()}"
[WARNING] <https://builds.apache.org/job/HBase-0.94.28/ws/src/test/java/org/apache/hadoop/hbase/HBaseTestingUtility.java>:613:
warning - Tag @see:illegal character: "123" in "{@link #shutdownMiniCluster()}"
[WARNING] <https://builds.apache.org/job/HBase-0.94.28/ws/src/test/java/org/apache/hadoop/hbase/HBaseTestingUtility.java>:613:
warning - Tag @see:illegal character: "64" in "{@link #shutdownMiniCluster()}"
[WARNING] <https://builds.apache.org/job/HBase-0.94.28/ws/src/test/java/org/apache/hadoop/hbase/HBaseTestingUtility.java>:408:
warning - Tag @see:illegal character: "123" in "{@link #shutdownMiniDFSCluster()}"
[WARNING] <https://builds.apache.org/job/HBase-0.94.28/ws/src/test/java/org/apache/hadoop/hbase/HBaseTestingUtility.java>:408:
warning - Tag @see:illegal character: "64" in "{@link #shutdownMiniDFSCluster()}"
[WARNING] <https://builds.apache.org/job/HBase-0.94.28/ws/src/test/java/org/apache/hadoop/hbase/HBaseTestingUtility.java>:441:
warning - Tag @see:illegal character: "123" in "{@link #shutdownMiniDFSCluster()}"
[WARNING] <https://builds.apache.org/job/HBase-0.94.28/ws/src/test/java/org/apache/hadoop/hbase/HBaseTestingUtility.java>:441:
warning - Tag @see:illegal character: "64" in "{@link #shutdownMiniDFSCluster()}"
[WARNING] <https://builds.apache.org/job/HBase-0.94.28/ws/src/test/java/org/apache/hadoop/hbase/HBaseTestingUtility.java>:423:
warning - Tag @see:illegal character: "123" in "{@link #shutdownMiniDFSCluster()}"
[WARNING] <https://builds.apache.org/job/HBase-0.94.28/ws/src/test/java/org/apache/hadoop/hbase/HBaseTestingUtility.java>:423:
warning - Tag @see:illegal character: "64" in "{@link #shutdownMiniDFSCluster()}"
[WARNING] <https://builds.apache.org/job/HBase-0.94.28/ws/src/test/java/org/apache/hadoop/hbase/HBaseTestingUtility.java>:651:
warning - Tag @see:illegal character: "123" in "{@link #startMiniCluster()}"
[WARNING] <https://builds.apache.org/job/HBase-0.94.28/ws/src/test/java/org/apache/hadoop/hbase/HBaseTestingUtility.java>:651:
warning - Tag @see:illegal character: "64" in "{@link #startMiniCluster()}"
[WARNING] <https://builds.apache.org/job/HBase-0.94.28/ws/src/test/java/org/apache/hadoop/hbase/HBaseTestingUtility.java>:408:
warning - Tag @see: reference not found: {@link #shutdownMiniDFSCluster()}
[WARNING] <https://builds.apache.org/job/HBase-0.94.28/ws/src/test/java/org/apache/hadoop/hbase/HBaseTestingUtility.java>:423:
warning - Tag @see: reference not found: {@link #shutdownMiniDFSCluster()}
[WARNING] <https://builds.apache.org/job/HBase-0.94.28/ws/src/test/java/org/apache/hadoop/hbase/HBaseTestingUtility.java>:441:
warning - Tag @see: reference not found: {@link #shutdownMiniDFSCluster()}
[WARNING] <https://builds.apache.org/job/HBase-0.94.28/ws/src/test/java/org/apache/hadoop/hbase/HBaseTestingUtility.java>:553:
warning - Tag @see: reference not found: {@link #shutdownMiniDFSCluster()}
[WARNING] <https://builds.apache.org/job/HBase-0.94.28/ws/src/test/java/org/apache/hadoop/hbase/HBaseTestingUtility.java>:570:
warning - Tag @see: reference not found: {@link #shutdownMiniCluster()}
[WARNING] <https://builds.apache.org/job/HBase-0.94.28/ws/src/test/java/org/apache/hadoop/hbase/HBaseTestingUtility.java>:582:
warning - Tag @see: reference not found: {@link #shutdownMiniCluster()}
[WARNING] <https://builds.apache.org/job/HBase-0.94.28/ws/src/test/java/org/apache/hadoop/hbase/HBaseTestingUtility.java>:613:
warning - Tag @see: reference not found: {@link #shutdownMiniCluster()}
[WARNING] <https://builds.apache.org/job/HBase-0.94.28/ws/src/test/java/org/apache/hadoop/hbase/HBaseTestingUtility.java>:651:
warning - Tag @see: reference not found: {@link #startMiniCluster()}
[WARNING] <https://builds.apache.org/job/HBase-0.94.28/ws/src/test/java/org/apache/hadoop/hbase/HBaseTestingUtility.java>:719:
warning - Tag @see: reference not found: {@link #startMiniCluster(int)}
[WARNING] <https://builds.apache.org/job/HBase-0.94.28/ws/src/test/java/org/apache/hadoop/hbase/IntegrationTestDataIngestSlowDeterministic.java>:40:
warning - Tag @link: reference not found: LoadTestTool
[WARNING] <https://builds.apache.org/job/HBase-0.94.28/ws/src/test/java/org/apache/hadoop/hbase/IntegrationTestDataIngestWithChaosMonkey.java>:34:
warning - Tag @link: reference not found: LoadTestTool
[WARNING] <https://builds.apache.org/job/HBase-0.94.28/ws/src/test/java/org/apache/hadoop/hbase/HBaseCluster.java>:99:
warning - Tag @link: reference not found: HmasterInterface
[WARNING] <https://builds.apache.org/job/HBase-0.94.28/ws/src/test/java/org/apache/hadoop/hbase/HBaseCluster.java>:99:
warning - Tag @link: reference not found: HmasterInterface
[WARNING] <https://builds.apache.org/job/HBase-0.94.28/ws/src/test/java/org/apache/hadoop/hbase/TestSerialization.java>:609:
warning - Tag @link: reference not found: COLUMNS
[WARNING] <https://builds.apache.org/job/HBase-0.94.28/ws/src/test/java/org/apache/hadoop/hbase/TestSerialization.java>:620:
warning - Tag @link: reference not found: COLUMNS
[WARNING] <https://builds.apache.org/job/HBase-0.94.28/ws/src/test/java/org/apache/hadoop/hbase/TestSerialization.java>:609:
warning - Tag @link: reference not found: COLUMNS
[WARNING] <https://builds.apache.org/job/HBase-0.94.28/ws/src/test/java/org/apache/hadoop/hbase/TestSerialization.java>:620:
warning - Tag @link: reference not found: COLUMNS
[WARNING] <https://builds.apache.org/job/HBase-0.94.28/ws/src/test/java/org/apache/hadoop/hbase/coprocessor/GenericProtocol.java>:66:
warning - @return tag has no arguments.
[WARNING] <https://builds.apache.org/job/HBase-0.94.28/ws/src/test/java/org/apache/hadoop/hbase/regionserver/OOMERegionServer.java>:36:
warning - Tag @link: can't find put(regionName, Put) in org.apache.hadoop.hbase.regionserver.OOMERegionServer
[WARNING] <https://builds.apache.org/job/HBase-0.94.28/ws/src/test/java/org/apache/hadoop/hbase/regionserver/TestGetClosestAtOrBefore.java>:45:
warning - Tag @link: reference not found: TestGet
[WARNING] <https://builds.apache.org/job/HBase-0.94.28/ws/src/test/java/org/apache/hadoop/hbase/regionserver/wal/HLogUtilsForTests.java>:36:
warning - @return tag has no arguments.
[WARNING] <https://builds.apache.org/job/HBase-0.94.28/ws/src/test/java/org/apache/hadoop/hbase/regionserver/wal/TestHLogSplit.java>:1155:
warning - Tag @see:illegal character: "58" in "https://issues.apache.org/jira/browse/HBASE-4862"
[WARNING] <https://builds.apache.org/job/HBase-0.94.28/ws/src/test/java/org/apache/hadoop/hbase/regionserver/wal/TestHLogSplit.java>:1155:
warning - Tag @see:illegal character: "47" in "https://issues.apache.org/jira/browse/HBASE-4862"
[WARNING] <https://builds.apache.org/job/HBase-0.94.28/ws/src/test/java/org/apache/hadoop/hbase/regionserver/wal/TestHLogSplit.java>:1155:
warning - Tag @see:illegal character: "47" in "https://issues.apache.org/jira/browse/HBASE-4862"
[WARNING] <https://builds.apache.org/job/HBase-0.94.28/ws/src/test/java/org/apache/hadoop/hbase/regionserver/wal/TestHLogSplit.java>:1155:
warning - Tag @see:illegal character: "47" in "https://issues.apache.org/jira/browse/HBASE-4862"
[WARNING] <https://builds.apache.org/job/HBase-0.94.28/ws/src/test/java/org/apache/hadoop/hbase/regionserver/wal/TestHLogSplit.java>:1155:
warning - Tag @see:illegal character: "47" in "https://issues.apache.org/jira/browse/HBASE-4862"
[WARNING] <https://builds.apache.org/job/HBase-0.94.28/ws/src/test/java/org/apache/hadoop/hbase/regionserver/wal/TestHLogSplit.java>:1155:
warning - Tag @see:illegal character: "47" in "https://issues.apache.org/jira/browse/HBASE-4862"
[WARNING] <https://builds.apache.org/job/HBase-0.94.28/ws/src/test/java/org/apache/hadoop/hbase/regionserver/wal/TestHLogSplit.java>:1155:
warning - Tag @see:illegal character: "45" in "https://issues.apache.org/jira/browse/HBASE-4862"
[WARNING] <https://builds.apache.org/job/HBase-0.94.28/ws/src/test/java/org/apache/hadoop/hbase/regionserver/wal/TestHLogSplit.java>:165:
warning - Tag @see:illegal character: "58" in "https://issues.apache.org/jira/browse/HBASE-3020"
[WARNING] <https://builds.apache.org/job/HBase-0.94.28/ws/src/test/java/org/apache/hadoop/hbase/regionserver/wal/TestHLogSplit.java>:165:
warning - Tag @see:illegal character: "47" in "https://issues.apache.org/jira/browse/HBASE-3020"
[WARNING] <https://builds.apache.org/job/HBase-0.94.28/ws/src/test/java/org/apache/hadoop/hbase/regionserver/wal/TestHLogSplit.java>:165:
warning - Tag @see:illegal character: "47" in "https://issues.apache.org/jira/browse/HBASE-3020"
[WARNING] <https://builds.apache.org/job/HBase-0.94.28/ws/src/test/java/org/apache/hadoop/hbase/regionserver/wal/TestHLogSplit.java>:165:
warning - Tag @see:illegal character: "47" in "https://issues.apache.org/jira/browse/HBASE-3020"
[WARNING] <https://builds.apache.org/job/HBase-0.94.28/ws/src/test/java/org/apache/hadoop/hbase/regionserver/wal/TestHLogSplit.java>:165:
warning - Tag @see:illegal character: "47" in "https://issues.apache.org/jira/browse/HBASE-3020"
[WARNING] <https://builds.apache.org/job/HBase-0.94.28/ws/src/test/java/org/apache/hadoop/hbase/regionserver/wal/TestHLogSplit.java>:165:
warning - Tag @see:illegal character: "47" in "https://issues.apache.org/jira/browse/HBASE-3020"
[WARNING] <https://builds.apache.org/job/HBase-0.94.28/ws/src/test/java/org/apache/hadoop/hbase/regionserver/wal/TestHLogSplit.java>:165:
warning - Tag @see:illegal character: "45" in "https://issues.apache.org/jira/browse/HBASE-3020"
[WARNING] <https://builds.apache.org/job/HBase-0.94.28/ws/src/test/java/org/apache/hadoop/hbase/regionserver/wal/TestHLogSplit.java>:165:
warning - Tag @see: reference not found: https://issues.apache.org/jira/browse/HBASE-3020
[WARNING] <https://builds.apache.org/job/HBase-0.94.28/ws/src/test/java/org/apache/hadoop/hbase/regionserver/wal/TestHLogSplit.java>:1155:
warning - Tag @see: reference not found: https://issues.apache.org/jira/browse/HBASE-4862
[WARNING] <https://builds.apache.org/job/HBase-0.94.28/ws/src/test/java/org/apache/hadoop/hbase/regionserver/wal/TestLogRollingNoCluster.java>:41:
warning - Tag @link: can't find HLog in org.apache.hadoop.hbase.regionserver.wal.TestLogRollingNoCluster
[WARNING] <https://builds.apache.org/job/HBase-0.94.28/ws/src/test/java/org/apache/hadoop/hbase/regionserver/wal/TestWALReplay.java>:243:
warning - Tag @see:illegal character: "58" in "https://issues.apache.org/jira/browse/HBASE-2727"
[WARNING] <https://builds.apache.org/job/HBase-0.94.28/ws/src/test/java/org/apache/hadoop/hbase/regionserver/wal/TestWALReplay.java>:243:
warning - Tag @see:illegal character: "47" in "https://issues.apache.org/jira/browse/HBASE-2727"
[WARNING] <https://builds.apache.org/job/HBase-0.94.28/ws/src/test/java/org/apache/hadoop/hbase/regionserver/wal/TestWALReplay.java>:243:
warning - Tag @see:illegal character: "47" in "https://issues.apache.org/jira/browse/HBASE-2727"
[WARNING] <https://builds.apache.org/job/HBase-0.94.28/ws/src/test/java/org/apache/hadoop/hbase/regionserver/wal/TestWALReplay.java>:243:
warning - Tag @see:illegal character: "47" in "https://issues.apache.org/jira/browse/HBASE-2727"
[WARNING] <https://builds.apache.org/job/HBase-0.94.28/ws/src/test/java/org/apache/hadoop/hbase/regionserver/wal/TestWALReplay.java>:243:
warning - Tag @see:illegal character: "47" in "https://issues.apache.org/jira/browse/HBASE-2727"
[WARNING] <https://builds.apache.org/job/HBase-0.94.28/ws/src/test/java/org/apache/hadoop/hbase/regionserver/wal/TestWALReplay.java>:243:
warning - Tag @see:illegal character: "47" in "https://issues.apache.org/jira/browse/HBASE-2727"
[WARNING] <https://builds.apache.org/job/HBase-0.94.28/ws/src/test/java/org/apache/hadoop/hbase/regionserver/wal/TestWALReplay.java>:243:
warning - Tag @see:illegal character: "45" in "https://issues.apache.org/jira/browse/HBASE-2727"
[WARNING] <https://builds.apache.org/job/HBase-0.94.28/ws/src/test/java/org/apache/hadoop/hbase/regionserver/wal/TestWALReplay.java>:243:
warning - Tag @see: reference not found: https://issues.apache.org/jira/browse/HBASE-2727
[WARNING] <https://builds.apache.org/job/HBase-0.94.28/ws/src/test/java/org/apache/hadoop/hbase/mapred/TestTableInputFormat.java>:92:
warning - @return tag has no arguments.
[WARNING] <https://builds.apache.org/job/HBase-0.94.28/ws/src/test/java/org/apache/hadoop/hbase/snapshot/SnapshotTestingUtils.java>:315:
warning - @param argument "fs:" is not a parameter name.
[WARNING] <https://builds.apache.org/job/HBase-0.94.28/ws/src/test/java/org/apache/hadoop/hbase/procedure/TestProcedureMember.java>:233:
warning - Tag @link: can't find prepare in org.apache.hadoop.hbase.procedure.TestProcedureMember.EmptySubprocedure
[WARNING] <https://builds.apache.org/job/HBase-0.94.28/ws/src/test/java/org/apache/hadoop/hbase/procedure/TestProcedureMember.java>:233:
warning - Tag @link: can't find prepare in org.apache.hadoop.hbase.procedure.TestProcedureMember.EmptySubprocedure
[WARNING] <https://builds.apache.org/job/HBase-0.94.28/ws/src/test/java/org/apache/hadoop/hbase/client/HConnectionTestingUtility.java>:125:
warning - Tag @see:illegal character: "58" in "http://mockito.googlecode.com/svn/branches/1.6/javadoc/org/mockito/Mockito.html#spy(T)"
[WARNING] <https://builds.apache.org/job/HBase-0.94.28/ws/src/test/java/org/apache/hadoop/hbase/client/HConnectionTestingUtility.java>:125:
warning - Tag @see:illegal character: "47" in "http://mockito.googlecode.com/svn/branches/1.6/javadoc/org/mockito/Mockito.html#spy(T)"
[WARNING] <https://builds.apache.org/job/HBase-0.94.28/ws/src/test/java/org/apache/hadoop/hbase/client/HConnectionTestingUtility.java>:125:
warning - Tag @see:illegal character: "47" in "http://mockito.googlecode.com/svn/branches/1.6/javadoc/org/mockito/Mockito.html#spy(T)"
[WARNING] <https://builds.apache.org/job/HBase-0.94.28/ws/src/test/java/org/apache/hadoop/hbase/client/HConnectionTestingUtility.java>:125:
warning - Tag @see:illegal character: "47" in "http://mockito.googlecode.com/svn/branches/1.6/javadoc/org/mockito/Mockito.html#spy(T)"
[WARNING] <https://builds.apache.org/job/HBase-0.94.28/ws/src/test/java/org/apache/hadoop/hbase/client/HConnectionTestingUtility.java>:125:
warning - Tag @see:illegal character: "47" in "http://mockito.googlecode.com/svn/branches/1.6/javadoc/org/mockito/Mockito.html#spy(T)"
[WARNING] <https://builds.apache.org/job/HBase-0.94.28/ws/src/test/java/org/apache/hadoop/hbase/client/HConnectionTestingUtility.java>:125:
warning - Tag @see:illegal character: "47" in "http://mockito.googlecode.com/svn/branches/1.6/javadoc/org/mockito/Mockito.html#spy(T)"
[WARNING] <https://builds.apache.org/job/HBase-0.94.28/ws/src/test/java/org/apache/hadoop/hbase/client/HConnectionTestingUtility.java>:125:
warning - Tag @see:illegal character: "47" in "http://mockito.googlecode.com/svn/branches/1.6/javadoc/org/mockito/Mockito.html#spy(T)"
[WARNING] <https://builds.apache.org/job/HBase-0.94.28/ws/src/test/java/org/apache/hadoop/hbase/client/HConnectionTestingUtility.java>:125:
warning - Tag @see:illegal character: "47" in "http://mockito.googlecode.com/svn/branches/1.6/javadoc/org/mockito/Mockito.html#spy(T)"
[WARNING] <https://builds.apache.org/job/HBase-0.94.28/ws/src/test/java/org/apache/hadoop/hbase/client/HConnectionTestingUtility.java>:125:
warning - Tag @see:illegal character: "47" in "http://mockito.googlecode.com/svn/branches/1.6/javadoc/org/mockito/Mockito.html#spy(T)"
[WARNING] <https://builds.apache.org/job/HBase-0.94.28/ws/src/test/java/org/apache/hadoop/hbase/client/HConnectionTestingUtility.java>:125:
warning - Tag @see:illegal character: "47" in "http://mockito.googlecode.com/svn/branches/1.6/javadoc/org/mockito/Mockito.html#spy(T)"
[WARNING] <https://builds.apache.org/job/HBase-0.94.28/ws/src/test/java/org/apache/hadoop/hbase/client/HConnectionTestingUtility.java>:94:
warning - Parameter "implementation" is documented more than once.
[WARNING] <https://builds.apache.org/job/HBase-0.94.28/ws/src/test/java/org/apache/hadoop/hbase/client/HConnectionTestingUtility.java>:125:
warning - Tag @see: reference not found: http://mockito.googlecode.com/svn/branches/1.6/javadoc/org/mockito/Mockito.html#spy(T)
[WARNING] <https://builds.apache.org/job/HBase-0.94.28/ws/src/test/java/org/apache/hadoop/hbase/client/TestHCM.java>:287:
warning - Tag @link: reference not found: HConnectionManager.TableServers
[WARNING] <https://builds.apache.org/job/HBase-0.94.28/ws/src/test/java/org/apache/hadoop/hbase/client/TestHCM.java>:94:
warning - Tag @see:illegal character: "58" in "https://issues.apache.org/jira/browse/HBASE-2925"
[WARNING] <https://builds.apache.org/job/HBase-0.94.28/ws/src/test/java/org/apache/hadoop/hbase/client/TestHCM.java>:94:
warning - Tag @see:illegal character: "47" in "https://issues.apache.org/jira/browse/HBASE-2925"
[WARNING] <https://builds.apache.org/job/HBase-0.94.28/ws/src/test/java/org/apache/hadoop/hbase/client/TestHCM.java>:94:
warning - Tag @see:illegal character: "47" in "https://issues.apache.org/jira/browse/HBASE-2925"
[WARNING] <https://builds.apache.org/job/HBase-0.94.28/ws/src/test/java/org/apache/hadoop/hbase/client/TestHCM.java>:94:
warning - Tag @see:illegal character: "47" in "https://issues.apache.org/jira/browse/HBASE-2925"
[WARNING] <https://builds.apache.org/job/HBase-0.94.28/ws/src/test/java/org/apache/hadoop/hbase/client/TestHCM.java>:94:
warning - Tag @see:illegal character: "47" in "https://issues.apache.org/jira/browse/HBASE-2925"
[WARNING] <https://builds.apache.org/job/HBase-0.94.28/ws/src/test/java/org/apache/hadoop/hbase/client/TestHCM.java>:94:
warning - Tag @see:illegal character: "47" in "https://issues.apache.org/jira/browse/HBASE-2925"
[WARNING] <https://builds.apache.org/job/HBase-0.94.28/ws/src/test/java/org/apache/hadoop/hbase/client/TestHCM.java>:94:
warning - Tag @see:illegal character: "45" in "https://issues.apache.org/jira/browse/HBASE-2925"
[WARNING] <https://builds.apache.org/job/HBase-0.94.28/ws/src/test/java/org/apache/hadoop/hbase/client/TestHCM.java>:94:
warning - Tag @see: reference not found: https://issues.apache.org/jira/browse/HBASE-2925
[WARNING] <https://builds.apache.org/job/HBase-0.94.28/ws/src/test/java/org/apache/hadoop/hbase/client/TestHCM.java>:287:
warning - Tag @link: reference not found: HConnectionManager.TableServers
[WARNING] <https://builds.apache.org/job/HBase-0.94.28/ws/src/test/java/org/apache/hadoop/hbase/client/TestMetaMigrationRemovingHTD.java>:58:
warning - Tag @link: can't find META_VERSION in org.apache.hadoop.hbase.catalog.MetaReader
[WARNING] <https://builds.apache.org/job/HBase-0.94.28/ws/src/test/java/org/apache/hadoop/hbase/client/TestMetaMigrationRemovingHTD.java>:288:
warning - @return tag has no arguments.
[WARNING] <https://builds.apache.org/job/HBase-0.94.28/ws/src/test/java/org/apache/hadoop/hbase/client/TestMetaMigrationRemovingHTD.java>:263:
warning - @return tag has no arguments.
[WARNING] <https://builds.apache.org/job/HBase-0.94.28/ws/src/test/java/org/apache/hadoop/hbase/client/TestMultipleTimestamps.java>:46:
warning - Tag @link: reference not found: TimestampsFilter
[WARNING] <https://builds.apache.org/job/HBase-0.94.28/ws/src/test/java/org/apache/hadoop/hbase/util/MultiThreadedAction.java>:293:
warning - @return tag has no arguments.
[WARNING] <https://builds.apache.org/job/HBase-0.94.28/ws/src/test/java/org/apache/hadoop/hbase/util/MultiThreadedAction.java>:66:
warning - Tag @link: reference not found: HBaseTestingUtility#createPreSplitLoadTestTable(
[WARNING] org.apache.hadoop.hbase.Configuration, byte[], byte[], Algorithm, DataBlockEncoding)
[WARNING] <https://builds.apache.org/job/HBase-0.94.28/ws/src/test/java/org/apache/hadoop/hbase/io/hfile/TestHFileBlockCompatibility.java>:432:
warning - @param argument "dataBlockEncoderAlgo" is not a parameter name.
[WARNING] <https://builds.apache.org/job/HBase-0.94.28/ws/src/test/java/org/apache/hadoop/hbase/io/hfile/TestHFileWriterV2.java>:285:
warning - @return tag has no arguments.
[WARNING] <https://builds.apache.org/job/HBase-0.94.28/ws/src/test/java/org/apache/hadoop/hbase/IntegrationTestDataIngestSlowDeterministic.java>:40:
warning - Tag @link: reference not found: LoadTestTool
[WARNING] <https://builds.apache.org/job/HBase-0.94.28/ws/src/test/java/org/apache/hadoop/hbase/IntegrationTestDataIngestWithChaosMonkey.java>:34:
warning - Tag @link: reference not found: LoadTestTool
[WARNING] <https://builds.apache.org/job/HBase-0.94.28/ws/src/test/java/org/apache/hadoop/hbase/client/TestMultipleTimestamps.java>:46:
warning - Tag @link: reference not found: TimestampsFilter
[WARNING] <https://builds.apache.org/job/HBase-0.94.28/ws/src/test/java/org/apache/hadoop/hbase/regionserver/TestGetClosestAtOrBefore.java>:45:
warning - Tag @link: reference not found: TestGet
[WARNING] <https://builds.apache.org/job/HBase-0.94.28/ws/src/test/java/org/apache/hadoop/hbase/IntegrationTestDataIngestSlowDeterministic.java>:40:
warning - Tag @link: reference not found: LoadTestTool
[WARNING] <https://builds.apache.org/job/HBase-0.94.28/ws/src/test/java/org/apache/hadoop/hbase/IntegrationTestDataIngestWithChaosMonkey.java>:34:
warning - Tag @link: reference not found: LoadTestTool
[WARNING] <https://builds.apache.org/job/HBase-0.94.28/ws/src/test/java/org/apache/hadoop/hbase/regionserver/TestGetClosestAtOrBefore.java>:45:
warning - Tag @link: reference not found: TestGet
[WARNING] <https://builds.apache.org/job/HBase-0.94.28/ws/src/test/java/org/apache/hadoop/hbase/HBaseTestCase.java>:210:
warning - Tag @link: reference not found: COLUMNS
[WARNING] <https://builds.apache.org/job/HBase-0.94.28/ws/src/test/java/org/apache/hadoop/hbase/HBaseTestCase.java>:221:
warning - Tag @link: reference not found: COLUMNS
[WARNING] <https://builds.apache.org/job/HBase-0.94.28/ws/src/test/java/org/apache/hadoop/hbase/HBaseTestCase.java>:234:
warning - Tag @link: reference not found: COLUMNS
[WARNING] <https://builds.apache.org/job/HBase-0.94.28/ws/src/test/java/org/apache/hadoop/hbase/TestSerialization.java>:609:
warning - Tag @link: reference not found: COLUMNS
[WARNING] <https://builds.apache.org/job/HBase-0.94.28/ws/src/test/java/org/apache/hadoop/hbase/TestSerialization.java>:620:
warning - Tag @link: reference not found: COLUMNS
[WARNING] <https://builds.apache.org/job/HBase-0.94.28/ws/src/test/java/org/apache/hadoop/hbase/HBaseCluster.java>:99:
warning - Tag @link: reference not found: HmasterInterface
[WARNING] <https://builds.apache.org/job/HBase-0.94.28/ws/src/test/java/org/apache/hadoop/hbase/IntegrationTestDataIngestSlowDeterministic.java>:40:
warning - Tag @link: reference not found: LoadTestTool
[WARNING] <https://builds.apache.org/job/HBase-0.94.28/ws/src/test/java/org/apache/hadoop/hbase/IntegrationTestDataIngestWithChaosMonkey.java>:34:
warning - Tag @link: reference not found: LoadTestTool
[WARNING] <https://builds.apache.org/job/HBase-0.94.28/ws/src/test/java/org/apache/hadoop/hbase/client/TestHCM.java>:287:
warning - Tag @link: reference not found: HConnectionManager.TableServers
[WARNING] <https://builds.apache.org/job/HBase-0.94.28/ws/src/test/java/org/apache/hadoop/hbase/regionserver/TestGetClosestAtOrBefore.java>:45:
warning - Tag @link: reference not found: TestGet
[WARNING] <https://builds.apache.org/job/HBase-0.94.28/ws/src/test/java/org/apache/hadoop/hbase/client/TestMultipleTimestamps.java>:46:
warning - Tag @link: reference not found: TimestampsFilter
[INFO] Fixed Javadoc frame injection vulnerability (CVE-2013-1571) in 1 files.
[INFO] Generating "Source Xref" report    --- maven-jxr-plugin:2.3
[INFO] Generating "Test Source Xref" report    --- maven-jxr-plugin:2.3
[INFO] Generating "RAT Report" report    --- apache-rat-plugin:0.8
[INFO] No excludes
[INFO] Generating "Surefire Report" report    --- maven-surefire-report-plugin:2.7.2
[INFO] 
[INFO] --- maven-enforcer-plugin:1.0.1:enforce (enforce) @ hbase ---
[INFO] 
[INFO] --- maven-antrun-plugin:1.6:run (arc-setup) @ hbase ---
[WARNING] Parameter tasks is deprecated, use target instead
[INFO] Executing tasks

main:
[INFO] Executed tasks
[INFO] 
[INFO] --- avro-maven-plugin:1.5.3:schema (generate-avro-sources) @ hbase ---
[INFO] 
[INFO] --- avro-maven-plugin:1.5.3:protocol (generate-avro-sources) @ hbase ---
[INFO] 
[INFO] --- maven-antrun-plugin:1.6:run (generate) @ hbase ---
[INFO] Executing tasks

main:
16/01/05 06:12:19 INFO mortbay.log: Logging to org.slf4j.impl.Log4jLoggerAdapter(org.mortbay.log)
via org.mortbay.log.Slf4jLog
[INFO] Executed tasks
[INFO] 
[INFO] --- build-helper-maven-plugin:1.5:add-source (add-source) @ hbase ---
[INFO] Source directory: <https://builds.apache.org/job/HBase-0.94.28/ws/security/src/main/java>
added.
[INFO] 
[INFO] --- build-helper-maven-plugin:1.5:add-source (jspcSource-packageInfo-Avro-source) @
hbase ---
[INFO] Source directory: <https://builds.apache.org/job/HBase-0.94.28/ws/target/generated-jamon>
added.
[INFO] Source directory: <https://builds.apache.org/job/HBase-0.94.28/ws/target/generated-sources/java>
added.
[INFO] 
[INFO] --- jamon-maven-plugin:2.3.4:translate (default) @ hbase ---
[INFO] 
[INFO] --- maven-remote-resources-plugin:1.1:process (default) @ hbase ---
[INFO] 
[INFO] --- maven-resources-plugin:2.4:resources (default-resources) @ hbase ---
[INFO] Using 'UTF-8' encoding to copy filtered resources.
[INFO] Copying 1 resource
[INFO] Copying 12 resources
[INFO] Copying 3 resources
[INFO] 
[INFO] --- maven-antrun-plugin:1.6:run (default) @ hbase ---
[INFO] Executing tasks

main:
     [exec] tar: hadoop-snappy-nativelibs.tar: Cannot open: No such file or directory
     [exec] tar: Error is not recoverable: exiting now
     [exec] Result: 2
[INFO] Executed tasks
[INFO] 
[INFO] --- maven-compiler-plugin:2.5.1:compile (default-compile) @ hbase ---
[INFO] Compiling 8 source files to <https://builds.apache.org/job/HBase-0.94.28/ws/target/classes>
[INFO] 
[INFO] --- build-helper-maven-plugin:1.5:add-test-source (add-test-source) @ hbase ---
[INFO] Test Source directory: <https://builds.apache.org/job/HBase-0.94.28/ws/security/src/test/java>
added.
[INFO] 
[INFO] --- build-helper-maven-plugin:1.5:add-test-resource (add-test-resource) @ hbase ---
[INFO] 
[INFO] --- maven-resources-plugin:2.4:testResources (default-testResources) @ hbase ---
[INFO] Using 'UTF-8' encoding to copy filtered resources.
[INFO] Copying 4 resources
[INFO] Copying 3 resources
[INFO] Copying 1 resource
[INFO] 
[INFO] --- maven-compiler-plugin:2.5.1:testCompile (default-testCompile) @ hbase ---
[INFO] Compiling 493 source files to <https://builds.apache.org/job/HBase-0.94.28/ws/target/test-classes>
[INFO] 
[INFO] --- maven-surefire-plugin:2.12-TRUNK-HBASE-2:test (default-test) @ hbase ---
[INFO] Surefire report directory: <https://builds.apache.org/job/HBase-0.94.28/ws/target/surefire-reports>
[INFO] Using configured provider org.apache.maven.surefire.junitcore.JUnitCoreProvider

-------------------------------------------------------
 T E S T S
-------------------------------------------------------
Running org.apache.hadoop.hbase.ipc.TestProtocolExtension
Tests run: 1, Failures: 0, Errors: 0, Skipped: 0, Time elapsed: 0.62 sec
Running org.apache.hadoop.hbase.executor.TestExecutorService
Tests run: 1, Failures: 0, Errors: 0, Skipped: 0, Time elapsed: 2.202 sec
Running org.apache.hadoop.hbase.errorhandling.TestForeignExceptionDispatcher
Tests run: 3, Failures: 0, Errors: 0, Skipped: 0, Time elapsed: 0.03 sec
Running org.apache.hadoop.hbase.errorhandling.TestTimeoutExceptionInjector
Tests run: 4, Failures: 0, Errors: 0, Skipped: 0, Time elapsed: 0.042 sec
Running org.apache.hadoop.hbase.errorhandling.TestForeignExceptionSerialization
Tests run: 2, Failures: 0, Errors: 0, Skipped: 0, Time elapsed: 0.037 sec
Running org.apache.hadoop.hbase.coprocessor.TestCoprocessorInterface
Tests run: 2, Failures: 0, Errors: 0, Skipped: 0, Time elapsed: 4.274 sec
*** Error in `/home/jenkins/tools/java/jdk1.6.0_45-32/jre/bin/java': malloc(): memory corruption:
0x71782d20 ***
Aborted

Results :

Tests run: 13, Failures: 0, Errors: 0, Skipped: 0

[INFO] ------------------------------------------------------------------------
[INFO] BUILD FAILURE
[INFO] ------------------------------------------------------------------------
[INFO] Total time: 11:04.721s
[INFO] Finished at: Tue Jan 05 06:12:36 UTC 2016
[INFO] Final Memory: 52M/342M
[INFO] ------------------------------------------------------------------------
[ERROR] Failed to execute goal org.apache.maven.plugins:maven-surefire-plugin:2.12-TRUNK-HBASE-2:test
(default-test) on project hbase: Error occurred in starting fork, check output in log ->
[Help 1]
[ERROR] 
[ERROR] To see the full stack trace of the errors, re-run Maven with the -e switch.
[ERROR] Re-run Maven using the -X switch to enable full debug logging.
[ERROR] 
[ERROR] For more information about the errors and possible solutions, please read the following
articles:
[ERROR] [Help 1] http://cwiki.apache.org/confluence/display/MAVEN/MojoExecutionException
Build step 'Invoke top-level Maven targets' marked build as failure
Archiving artifacts
Compressed 2.73 MB of artifacts by 25.2% relative to #55
Recording test results

Mime
View raw message