hbase-builds mailing list archives

Site index · List index
Message view « Date » · « Thread »
Top « Date » · « Thread »
From Apache Jenkins Server <jenk...@builds.apache.org>
Subject Build failed in Jenkins: HBase-1.1-JDK7 #1634
Date Wed, 06 Jan 2016 23:56:19 GMT
See <https://builds.apache.org/job/HBase-1.1-JDK7/1634/changes>

Changes:

[syuanjiangdev] HBASE-13415 Procedure V2 - Use nonces for double submits from client

[syuanjiangdev] HBASE-14108 Procedure V2 - Administrative Task: provide an API to abort

[syuanjiangdev] HBASE-14107 Procedure V2 - Administrative Task: Provide an API to List

[syuanjiangdev] HBASE-14487 Procedure V2 - shell command to list all procedures (Stephen

[syuanjiangdev] HBASE-14488 Procedure V2 - shell command to abort a procedure (Stephen

[syuanjiangdev] HBASE-14432 Procedure V2 - enforce ACL on procedure admin tasks (Stephen

------------------------------------------
[...truncated 2120 lines...]
Tests run: 3, Failures: 0, Errors: 0, Skipped: 0, Time elapsed: 3.063 sec - in org.apache.hadoop.hbase.TestInfoServers
Running org.apache.hadoop.hbase.TestRegionRebalancing
Tests run: 2, Failures: 0, Errors: 0, Skipped: 0, Time elapsed: 32.914 sec - in org.apache.hadoop.hbase.TestRegionRebalancing
Running org.apache.hadoop.hbase.filter.TestMultiRowRangeFilter
Tests run: 31, Failures: 0, Errors: 0, Skipped: 0, Time elapsed: 204.696 sec - in org.apache.hadoop.hbase.wal.TestWALSplit
Tests run: 31, Failures: 0, Errors: 0, Skipped: 0, Time elapsed: 199.319 sec - in org.apache.hadoop.hbase.wal.TestWALSplitCompressed
Running org.apache.hadoop.hbase.filter.TestScanRowPrefix
Tests run: 20, Failures: 0, Errors: 0, Skipped: 0, Time elapsed: 20.28 sec - in org.apache.hadoop.hbase.filter.TestMultiRowRangeFilter
Tests run: 1, Failures: 0, Errors: 0, Skipped: 0, Time elapsed: 4.883 sec - in org.apache.hadoop.hbase.filter.TestScanRowPrefix
Running org.apache.hadoop.hbase.filter.TestFilterWrapper
Tests run: 1, Failures: 0, Errors: 0, Skipped: 0, Time elapsed: 3.54 sec - in org.apache.hadoop.hbase.filter.TestFilterWrapper
Running org.apache.hadoop.hbase.filter.TestFuzzyRowFilterEndToEnd
Running org.apache.hadoop.hbase.filter.TestFuzzyRowAndColumnRangeFilter
Running org.apache.hadoop.hbase.filter.TestColumnRangeFilter
Tests run: 1, Failures: 0, Errors: 0, Skipped: 0, Time elapsed: 4.847 sec - in org.apache.hadoop.hbase.filter.TestFuzzyRowAndColumnRangeFilter
Tests run: 1, Failures: 0, Errors: 0, Skipped: 0, Time elapsed: 10.346 sec - in org.apache.hadoop.hbase.filter.TestColumnRangeFilter
Running org.apache.hadoop.hbase.filter.TestFilterWithScanLimits
Tests run: 1, Failures: 0, Errors: 0, Skipped: 0, Time elapsed: 3.665 sec - in org.apache.hadoop.hbase.filter.TestFilterWithScanLimits
Running org.apache.hadoop.hbase.io.TestFileLink
Running org.apache.hadoop.hbase.io.hfile.TestScannerSelectionUsingTTL
Tests run: 5, Failures: 0, Errors: 0, Skipped: 0, Time elapsed: 14.117 sec - in org.apache.hadoop.hbase.io.TestFileLink
Running org.apache.hadoop.hbase.io.hfile.TestCacheConfig
Tests run: 6, Failures: 0, Errors: 0, Skipped: 0, Time elapsed: 1.862 sec - in org.apache.hadoop.hbase.io.hfile.TestCacheConfig
Running org.apache.hadoop.hbase.io.hfile.TestHFileSeek
Tests run: 1, Failures: 0, Errors: 0, Skipped: 0, Time elapsed: 2.284 sec - in org.apache.hadoop.hbase.io.hfile.TestHFileSeek
Running org.apache.hadoop.hbase.io.hfile.TestSeekBeforeWithInlineBlocks
Tests run: 1, Failures: 0, Errors: 0, Skipped: 0, Time elapsed: 13.795 sec - in org.apache.hadoop.hbase.io.hfile.TestSeekBeforeWithInlineBlocks
Tests run: 51, Failures: 0, Errors: 1, Skipped: 1, Time elapsed: 350.667 sec <<<
FAILURE! - in org.apache.hadoop.hbase.util.TestHBaseFsck
testQuarantineMissingHFile(org.apache.hadoop.hbase.util.TestHBaseFsck)  Time elapsed: 7.266
sec  <<< ERROR!
org.apache.hadoop.hbase.TableNotDisabledException: testQuarantineMissingHFile
	at sun.reflect.NativeConstructorAccessorImpl.newInstance0(Native Method)
	at sun.reflect.NativeConstructorAccessorImpl.newInstance(NativeConstructorAccessorImpl.java:57)
	at sun.reflect.DelegatingConstructorAccessorImpl.newInstance(DelegatingConstructorAccessorImpl.java:45)
	at java.lang.reflect.Constructor.newInstance(Constructor.java:526)
	at org.apache.hadoop.ipc.RemoteException.instantiateException(RemoteException.java:106)
	at org.apache.hadoop.ipc.RemoteException.unwrapRemoteException(RemoteException.java:95)
	at org.apache.hadoop.hbase.util.ForeignExceptionUtil.toIOException(ForeignExceptionUtil.java:45)
	at org.apache.hadoop.hbase.client.HBaseAdmin$ProcedureFuture.convertResult(HBaseAdmin.java:4352)
	at org.apache.hadoop.hbase.client.HBaseAdmin$ProcedureFuture.waitProcedureResult(HBaseAdmin.java:4310)
	at org.apache.hadoop.hbase.client.HBaseAdmin$ProcedureFuture.get(HBaseAdmin.java:4244)
	at org.apache.hadoop.hbase.client.HBaseAdmin.deleteTable(HBaseAdmin.java:867)
	at org.apache.hadoop.hbase.util.TestHBaseFsck.deleteTable(TestHBaseFsck.java:2811)
	at org.apache.hadoop.hbase.util.TestHBaseFsck.cleanupTable(TestHBaseFsck.java:475)
	at org.apache.hadoop.hbase.util.TestHBaseFsck.doQuarantineTest(TestHBaseFsck.java:2143)
	at org.apache.hadoop.hbase.util.TestHBaseFsck.testQuarantineMissingHFile(TestHBaseFsck.java:2172)
Caused by: org.apache.hadoop.ipc.RemoteException: testQuarantineMissingHFile
	at org.apache.hadoop.hbase.master.HMaster.checkTableModifiable(HMaster.java:2027)
	at org.apache.hadoop.hbase.master.procedure.DeleteTableProcedure.prepareDelete(DeleteTableProcedure.java:256)
	at org.apache.hadoop.hbase.master.procedure.DeleteTableProcedure.executeFromState(DeleteTableProcedure.java:102)
	at org.apache.hadoop.hbase.master.procedure.DeleteTableProcedure.executeFromState(DeleteTableProcedure.java:59)
	at org.apache.hadoop.hbase.procedure2.StateMachineProcedure.execute(StateMachineProcedure.java:107)
	at org.apache.hadoop.hbase.procedure2.Procedure.doExecute(Procedure.java:427)
	at org.apache.hadoop.hbase.procedure2.ProcedureExecutor.execProcedure(ProcedureExecutor.java:999)
	at org.apache.hadoop.hbase.procedure2.ProcedureExecutor.execLoop(ProcedureExecutor.java:803)
	at org.apache.hadoop.hbase.procedure2.ProcedureExecutor.execLoop(ProcedureExecutor.java:756)
	at org.apache.hadoop.hbase.procedure2.ProcedureExecutor.access$200(ProcedureExecutor.java:75)
	at org.apache.hadoop.hbase.procedure2.ProcedureExecutor$1.run(ProcedureExecutor.java:441)

Running org.apache.hadoop.hbase.io.hfile.TestForceCacheImportantBlocks
Tests run: 1, Failures: 0, Errors: 1, Skipped: 0, Time elapsed: 360.923 sec <<< FAILURE!
- in org.apache.hadoop.hbase.util.TestHBaseFsck
testQuarantineMissingHFile(org.apache.hadoop.hbase.util.TestHBaseFsck)  Time elapsed: 5.914
sec  <<< ERROR!
org.apache.hadoop.hbase.TableNotDisabledException: testQuarantineMissingHFile
	at sun.reflect.NativeConstructorAccessorImpl.newInstance0(Native Method)
	at sun.reflect.NativeConstructorAccessorImpl.newInstance(NativeConstructorAccessorImpl.java:57)
	at sun.reflect.DelegatingConstructorAccessorImpl.newInstance(DelegatingConstructorAccessorImpl.java:45)
	at java.lang.reflect.Constructor.newInstance(Constructor.java:526)
	at org.apache.hadoop.ipc.RemoteException.instantiateException(RemoteException.java:106)
	at org.apache.hadoop.ipc.RemoteException.unwrapRemoteException(RemoteException.java:95)
	at org.apache.hadoop.hbase.util.ForeignExceptionUtil.toIOException(ForeignExceptionUtil.java:45)
	at org.apache.hadoop.hbase.client.HBaseAdmin$ProcedureFuture.convertResult(HBaseAdmin.java:4352)
	at org.apache.hadoop.hbase.client.HBaseAdmin$ProcedureFuture.waitProcedureResult(HBaseAdmin.java:4310)
	at org.apache.hadoop.hbase.client.HBaseAdmin$ProcedureFuture.get(HBaseAdmin.java:4244)
	at org.apache.hadoop.hbase.client.HBaseAdmin.deleteTable(HBaseAdmin.java:867)
	at org.apache.hadoop.hbase.util.TestHBaseFsck.deleteTable(TestHBaseFsck.java:2811)
	at org.apache.hadoop.hbase.util.TestHBaseFsck.cleanupTable(TestHBaseFsck.java:475)
	at org.apache.hadoop.hbase.util.TestHBaseFsck.doQuarantineTest(TestHBaseFsck.java:2143)
	at org.apache.hadoop.hbase.util.TestHBaseFsck.testQuarantineMissingHFile(TestHBaseFsck.java:2172)
Caused by: org.apache.hadoop.ipc.RemoteException: testQuarantineMissingHFile
	at org.apache.hadoop.hbase.master.HMaster.checkTableModifiable(HMaster.java:2027)
	at org.apache.hadoop.hbase.master.procedure.DeleteTableProcedure.prepareDelete(DeleteTableProcedure.java:256)
	at org.apache.hadoop.hbase.master.procedure.DeleteTableProcedure.executeFromState(DeleteTableProcedure.java:102)
	at org.apache.hadoop.hbase.master.procedure.DeleteTableProcedure.executeFromState(DeleteTableProcedure.java:59)
	at org.apache.hadoop.hbase.procedure2.StateMachineProcedure.execute(StateMachineProcedure.java:107)
	at org.apache.hadoop.hbase.procedure2.Procedure.doExecute(Procedure.java:427)
	at org.apache.hadoop.hbase.procedure2.ProcedureExecutor.execProcedure(ProcedureExecutor.java:999)
	at org.apache.hadoop.hbase.procedure2.ProcedureExecutor.execLoop(ProcedureExecutor.java:803)
	at org.apache.hadoop.hbase.procedure2.ProcedureExecutor.execLoop(ProcedureExecutor.java:756)
	at org.apache.hadoop.hbase.procedure2.ProcedureExecutor.access$200(ProcedureExecutor.java:75)
	at org.apache.hadoop.hbase.procedure2.ProcedureExecutor$1.run(ProcedureExecutor.java:441)

Tests run: 1, Failures: 0, Errors: 0, Skipped: 0, Time elapsed: 371.532 sec - in org.apache.hadoop.hbase.util.TestHBaseFsck
Running org.apache.hadoop.hbase.io.hfile.TestCacheOnWrite
Tests run: 6, Failures: 0, Errors: 0, Skipped: 0, Time elapsed: 63.703 sec - in org.apache.hadoop.hbase.io.hfile.TestScannerSelectionUsingTTL
Running org.apache.hadoop.hbase.io.hfile.TestHFileBlock
Tests run: 4, Failures: 0, Errors: 0, Skipped: 0, Time elapsed: 46.457 sec - in org.apache.hadoop.hbase.io.hfile.TestForceCacheImportantBlocks
Running org.apache.hadoop.hbase.io.hfile.TestHFileBlockIndex
Tests run: 10, Failures: 0, Errors: 0, Skipped: 0, Time elapsed: 14.75 sec - in org.apache.hadoop.hbase.io.hfile.TestHFileBlockIndex
Running org.apache.hadoop.hbase.io.encoding.TestLoadAndSwitchEncodeOnDisk
Tests run: 1, Failures: 0, Errors: 0, Skipped: 0, Time elapsed: 34.256 sec - in org.apache.hadoop.hbase.io.encoding.TestLoadAndSwitchEncodeOnDisk
Running org.apache.hadoop.hbase.io.encoding.TestBufferedDataBlockEncoder
Tests run: 28, Failures: 0, Errors: 0, Skipped: 0, Time elapsed: 94.323 sec - in org.apache.hadoop.hbase.io.hfile.TestHFileBlock
Running org.apache.hadoop.hbase.io.encoding.TestEncodedSeekers
Tests run: 1, Failures: 0, Errors: 0, Skipped: 0, Time elapsed: 16.716 sec - in org.apache.hadoop.hbase.io.encoding.TestBufferedDataBlockEncoder
Running org.apache.hadoop.hbase.io.encoding.TestDataBlockEncoders
Tests run: 3, Failures: 0, Errors: 0, Skipped: 0, Time elapsed: 212.174 sec - in org.apache.hadoop.hbase.filter.TestFuzzyRowFilterEndToEnd
Running org.apache.hadoop.hbase.io.encoding.TestChangingEncoding
Tests run: 72, Failures: 0, Errors: 0, Skipped: 0, Time elapsed: 162.152 sec - in org.apache.hadoop.hbase.io.hfile.TestCacheOnWrite
Running org.apache.hadoop.hbase.TestClusterBootOrder
Tests run: 2, Failures: 0, Errors: 0, Skipped: 0, Time elapsed: 29.021 sec - in org.apache.hadoop.hbase.TestClusterBootOrder
Tests run: 20, Failures: 0, Errors: 0, Skipped: 0, Time elapsed: 141.56 sec - in org.apache.hadoop.hbase.io.encoding.TestEncodedSeekers
Tests run: 3, Failures: 0, Errors: 0, Skipped: 0, Time elapsed: 143.651 sec - in org.apache.hadoop.hbase.io.encoding.TestChangingEncoding
Tests run: 28, Failures: 0, Errors: 0, Skipped: 0, Time elapsed: 235.466 sec - in org.apache.hadoop.hbase.io.encoding.TestDataBlockEncoders

Results :

Failed tests: 
org.apache.hadoop.hbase.regionserver.wal.TestDurability.testIncrementWithReturnResultsSetToFalse(org.apache.hadoop.hbase.regionserver.wal.TestDurability)
  Run 1: TestDurability.testIncrementWithReturnResultsSetToFalse:215 expected null, but was:<keyvalues={row1/family:col1/1452119767881/Put/vlen=8/seqid=4}>
  Run 2: TestDurability.testIncrementWithReturnResultsSetToFalse:215 expected null, but was:<keyvalues={row1/family:col1/1452119769201/Put/vlen=8/seqid=4}>
  Run 3: TestDurability.testIncrementWithReturnResultsSetToFalse:215 expected null, but was:<keyvalues={row1/family:col1/1452119770730/Put/vlen=8/seqid=4}>

Flaked tests: 
org.apache.hadoop.hbase.util.TestHBaseFsck.testQuarantineMissingHFile(org.apache.hadoop.hbase.util.TestHBaseFsck)
  Run 1: TestHBaseFsck.testQuarantineMissingHFile:2172->doQuarantineTest:2143->cleanupTable:475->deleteTable:2811
» TableNotDisabled
  Run 2: TestHBaseFsck.testQuarantineMissingHFile:2172->doQuarantineTest:2143->cleanupTable:475->deleteTable:2811
» TableNotDisabled
  Run 3: PASS


Tests run: 2484, Failures: 1, Errors: 0, Skipped: 21, Flakes: 1

[INFO] ------------------------------------------------------------------------
[INFO] Reactor Summary:
[INFO] 
[INFO] Apache HBase ...................................... SUCCESS [3.817s]
[INFO] Apache HBase - Checkstyle ......................... SUCCESS [0.842s]
[INFO] Apache HBase - Resource Bundle .................... SUCCESS [0.310s]
[INFO] Apache HBase - Annotations ........................ SUCCESS [1.521s]
[INFO] Apache HBase - Protocol ........................... SUCCESS [14.178s]
[INFO] Apache HBase - Common ............................. SUCCESS [1:33.162s]
[INFO] Apache HBase - Procedure .......................... SUCCESS [2:44.202s]
[INFO] Apache HBase - Client ............................. SUCCESS [1:27.432s]
[INFO] Apache HBase - Hadoop Compatibility ............... SUCCESS [7.595s]
[INFO] Apache HBase - Hadoop Two Compatibility ........... SUCCESS [7.595s]
[INFO] Apache HBase - Prefix Tree ........................ SUCCESS [10.338s]
[INFO] Apache HBase - Server ............................. FAILURE [1:43:00.192s]
[INFO] Apache HBase - Testing Util ....................... SKIPPED
[INFO] Apache HBase - Thrift ............................. SKIPPED
[INFO] Apache HBase - Rest ............................... SKIPPED
[INFO] Apache HBase - Shell .............................. SKIPPED
[INFO] Apache HBase - Integration Tests .................. SKIPPED
[INFO] Apache HBase - Examples ........................... SKIPPED
[INFO] Apache HBase - Assembly ........................... SKIPPED
[INFO] Apache HBase - Shaded ............................. SKIPPED
[INFO] Apache HBase - Shaded - Client .................... SKIPPED
[INFO] Apache HBase - Shaded - Server .................... SKIPPED
[INFO] ------------------------------------------------------------------------
[INFO] BUILD FAILURE
[INFO] ------------------------------------------------------------------------
[INFO] Total time: 1:49:33.317s
[INFO] Finished at: Wed Jan 06 23:53:19 UTC 2016
[INFO] Final Memory: 419M/651M
[INFO] ------------------------------------------------------------------------
[ERROR] Failed to execute goal org.apache.maven.plugins:maven-surefire-plugin:2.18.1:test
(secondPartTestsExecution) on project hbase-server: There was a timeout or other error in
the fork -> [Help 1]
[ERROR] 
[ERROR] To see the full stack trace of the errors, re-run Maven with the -e switch.
[ERROR] Re-run Maven using the -X switch to enable full debug logging.
[ERROR] 
[ERROR] For more information about the errors and possible solutions, please read the following
articles:
[ERROR] [Help 1] http://cwiki.apache.org/confluence/display/MAVEN/MojoFailureException
[ERROR] 
[ERROR] After correcting the problems, you can resume the build with the command
[ERROR]   mvn <goals> -rf :hbase-server
Build step 'Invoke top-level Maven targets' marked build as failure
Performing Post build task...
Match found for :.* : True
Logical operation result is TRUE
Running script  : # Post-build task script. TODO: Check this in and have all builds reference
check-in.
pwd && ls
# NOTE!!!! The below code has been copied and pasted from ./dev-tools/run-test.sh
# Do not change here without syncing there and vice-versa.
ZOMBIE_TESTS_COUNT=`jps -v | grep surefirebooter | grep -e '-Dhbase.test' | wc -l`
if [[ $ZOMBIE_TESTS_COUNT != 0 ]] ; then
 echo "Suspicious java process found - waiting 30s to see if there are just slow to stop"
 sleep 30
 ZOMBIE_TESTS_COUNT=`jps -v | grep surefirebooter | grep -e '-Dhbase.test' | wc -l`
 if [[ $ZOMBIE_TESTS_COUNT != 0 ]] ; then
   echo " {color:red}There appear to be $ZOMBIE_TESTS_COUNT zombie tests{color}, they should
have been killed by surefire but survived"
   jps -v | grep surefirebooter | grep -e '-Dhbase.test'
   jps -v | grep surefirebooter | grep -e '-Dhbase.test' | cut -d ' ' -f 1 | xargs -n 1 jstack
   # Exit with error
   exit 1
 else
   echo "We're ok: there is no zombie test, but some tests took some time to stop"
 fi
else
  echo "We're ok: there is no zombie test"
fi
[HBase-1.1-JDK7] $ /bin/bash -xe /tmp/hudson8184263315757848049.sh
+ pwd
<https://builds.apache.org/job/HBase-1.1-JDK7/ws/>
+ ls
bin
CHANGES.txt
conf
dev-support
hbase-annotations
hbase-assembly
hbase-checkstyle
hbase-client
hbase-common
hbase-examples
hbase-hadoop2-compat
hbase-hadoop-compat
hbase-it
hbase-native-client
hbase-prefix-tree
hbase-procedure
hbase-protocol
hbase-resource-bundle
hbase-rest
hbase-server
hbase-shaded
hbase-shell
hbase-testing-util
hbase-thrift
LICENSE.txt
NOTICE.txt
pom.xml
README.txt
src
target
++ jps -v
++ grep surefirebooter
++ wc -l
++ grep -e -Dhbase.test
+ ZOMBIE_TESTS_COUNT=0
+ [[ 0 != 0 ]]
+ echo 'We'\''re ok: there is no zombie test'
We're ok: there is no zombie test
POST BUILD TASK : SUCCESS
END OF POST BUILD TASK : 0
Archiving artifacts
Recording test results
Updating HBASE-14488
Updating HBASE-14487
Updating HBASE-14107
Updating HBASE-14108
Updating HBASE-14432
Updating HBASE-13415

Mime
View raw message