hbase-builds mailing list archives

Site index · List index
Message view « Date » · « Thread »
Top « Date » · « Thread »
From Apache Jenkins Server <jenk...@builds.apache.org>
Subject Build failed in Jenkins: HBase-1.2-IT » IntegrationTestBigLinkedList,latest1.8,Hadoop #365
Date Thu, 24 Dec 2015 19:59:16 GMT
See <https://builds.apache.org/job/HBase-1.2-IT/it.test=IntegrationTestBigLinkedList,jdk=latest1.8,label=Hadoop/365/changes>

Changes:

[tedyu] HBASE-14717 enable_table_replication command should only create

------------------------------------------
[...truncated 2328 lines...]
     bool UseGCOverheadLimit                        = true                               
{product}
     bool UseGCTaskAffinity                         = false                              
{product}
     bool UseHeavyMonitors                          = false                              
{product}
     bool UseHugeTLBFS                              = false                              
{product}
     bool UseInlineCaches                           = true                               
{product}
     bool UseInterpreter                            = true                               
{product}
     bool UseJumpTables                             = true                               
{C2 product}
     bool UseLWPSynchronization                     = true                               
{product}
     bool UseLargePages                             = false                              
{pd product}
     bool UseLargePagesInMetaspace                  = false                              
{product}
     bool UseLargePagesIndividualAllocation         = false                              
{pd product}
     bool UseLinuxPosixThreadCPUClocks              = true                               
{product}
     bool UseLockedTracing                          = false                              
{product}
     bool UseLoopCounter                            = true                               
{product}
     bool UseLoopInvariantCodeMotion                = true                               
{C1 product}
     bool UseLoopPredicate                          = true                               
{C2 product}
     bool UseMathExactIntrinsics                    = true                               
{C2 product}
     bool UseMaximumCompactionOnSystemGC            = true                               
{product}
     bool UseMembar                                 = false                              
{pd product}
     bool UseMultiplyToLenIntrinsic                 = true                               
{C2 product}
     bool UseNUMA                                   = false                              
{product}
     bool UseNUMAInterleaving                       = false                              
{product}
     bool UseNewLongLShift                          = false                              
{ARCH product}
     bool UseOSErrorReporting                       = false                              
{pd product}
     bool UseOldInlining                            = true                               
{C2 product}
     bool UseOnStackReplacement                     = true                               
{pd product}
     bool UseOnlyInlinedBimorphic                   = true                               
{C2 product}
     bool UseOprofile                               = false                              
{product}
     bool UseOptoBiasInlining                       = true                               
{C2 product}
     bool UsePSAdaptiveSurvivorSizePolicy           = true                               
{product}
     bool UseParNewGC                               = false                              
{product}
     bool UseParallelGC                            := true                               
{product}
     bool UseParallelOldGC                          = true                               
{product}
     bool UsePerfData                               = true                               
{product}
     bool UsePopCountInstruction                    = true                               
{product}
     bool UseRDPCForConstantTableBase               = false                              
{C2 product}
     bool UseRTMDeopt                               = false                              
{ARCH product}
     bool UseRTMLocking                             = false                              
{ARCH product}
     bool UseSHA                                    = false                              
{product}
     bool UseSHA1Intrinsics                         = false                              
{product}
     bool UseSHA256Intrinsics                       = false                              
{product}
     bool UseSHA512Intrinsics                       = false                              
{product}
     bool UseSHM                                    = false                              
{product}
     intx UseSSE                                    = 4                                  
{product}
     bool UseSSE42Intrinsics                        = true                               
{product}
     bool UseSerialGC                               = false                              
{product}
     bool UseSharedSpaces                           = false                              
{product}
     bool UseSignalChaining                         = true                               
{product}
     bool UseStoreImmI16                            = false                              
{ARCH product}
     bool UseStringDeduplication                    = false                              
{product}
     bool UseSuperWord                              = true                               
{C2 product}
     bool UseTLAB                                   = true                               
{pd product}
     bool UseThreadPriorities                       = true                               
{pd product}
     bool UseTransparentHugePages                   = false                              
{product}
     bool UseTypeProfile                            = true                               
{product}
     bool UseTypeSpeculation                        = true                               
{C2 product}
     bool UseUnalignedLoadStores                    = true                               
{ARCH product}
     bool UseVMInterruptibleIO                      = false                              
{product}
     bool UseXMMForArrayCopy                        = true                               
{product}
     bool UseXmmI2D                                 = false                              
{ARCH product}
     bool UseXmmI2F                                 = false                              
{ARCH product}
     bool UseXmmLoadAndClearUpper                   = true                               
{ARCH product}
     bool UseXmmRegToRegMoveAll                     = true                               
{ARCH product}
     bool VMThreadHintNoPreempt                     = false                              
{product}
     intx VMThreadPriority                          = -1                                 
{product}
     intx VMThreadStackSize                         = 1024                               
{pd product}
     intx ValueMapInitialSize                       = 11                                 
{C1 product}
     intx ValueMapMaxLoopSize                       = 8                                  
{C1 product}
     intx ValueSearchLimit                          = 1000                               
{C2 product}
     bool VerifyMergedCPBytecodes                   = true                               
{product}
     bool VerifySharedSpaces                        = false                              
{product}
     intx WorkAroundNPTLTimedWaitHang               = 1                                  
{product}
    uintx YoungGenerationSizeIncrement              = 20                                 
{product}
    uintx YoungGenerationSizeSupplement             = 80                                 
{product}
    uintx YoungGenerationSizeSupplementDecay        = 8                                  
{product}
    uintx YoungPLABSize                             = 4096                               
{product}
     bool ZeroTLAB                                  = false                              
{product}
     intx hashCode                                  = 5                                  
{product}
Running org.apache.hadoop.hbase.test.IntegrationTestBigLinkedList
SUREFIRE-859: [GC (Allocation Failure)  193536K->67266K(741888K), 0.1790075 secs]
SUREFIRE-859: [GC (Metadata GC Threshold)  109633K->43125K(935424K), 0.0263639 secs]
SUREFIRE-859: [Full GC (Metadata GC Threshold)  43125K->8201K(706048K), 0.0488482 secs]
SUREFIRE-859: [GC (Allocation Failure)  395273K->106554K(706048K), 0.2269075 secs]
SUREFIRE-859: [GC (Metadata GC Threshold)  118037K->106873K(1019392K), 0.0920454 secs]
SUREFIRE-859: [Full GC (Metadata GC Threshold)  106873K->95014K(1167872K), 0.1118406 secs]
SUREFIRE-859: [GC (Metadata GC Threshold)  727861K->141900K(1167872K), 0.0694416 secs]
SUREFIRE-859: [Full GC (Metadata GC Threshold)  141900K->137163K(1221632K), 0.2222772 secs]
SUREFIRE-859: [GC (Allocation Failure)  837579K->173394K(1785856K), 0.0492254 secs]
SUREFIRE-859: [GC (Allocation Failure)  1363738K->300907K(1780224K), 0.2840630 secs]
SUREFIRE-859: [GC (Allocation Failure)  1491307K->447484K(1550848K), 0.1877732 secs]
SUREFIRE-859: [GC (Allocation Failure)  1402876K->569737K(1664000K), 0.0883609 secs]
SUREFIRE-859: [GC (Allocation Failure)  1525129K->745128K(1443328K), 0.6533124 secs]
SUREFIRE-859: [Full GC (Ergonomics)  745128K->413699K(1799680K), 0.5180245 secs]
SUREFIRE-859: [GC (Allocation Failure)  1105923K->628928K(1792512K), 0.0653858 secs]
SUREFIRE-859: [GC (Allocation Failure)  1321152K->807244K(1925120K), 0.1307056 secs]
SUREFIRE-859: [GC (Allocation Failure)  1485644K->895992K(1672704K), 0.5574479 secs]
SUREFIRE-859: [Full GC (Ergonomics)  895992K->641777K(1997312K), 0.5242554 secs]
SUREFIRE-859: [GC (Allocation Failure)  1320177K->846138K(2226176K), 0.1832922 secs]
SUREFIRE-859: [GC (Allocation Failure)  1520954K->924729K(2229760K), 0.2837151 secs]
SUREFIRE-859: [GC (Allocation Failure)  1599545K->1019573K(2244096K), 0.5137027 secs]
SUREFIRE-859: [GC (Allocation Failure)  1743029K->1199283K(2246144K), 0.4011364 secs]
SUREFIRE-859: [Full GC (Ergonomics)  1199283K->929697K(2597376K), 0.9685300 secs]
SUREFIRE-859: [GC (Allocation Failure)  1653103K->1058771K(2629632K), 0.1264667 secs]
SUREFIRE-859: [GC (Allocation Failure)  1844170K->1126434K(2631168K), 0.2077860 secs]
SUREFIRE-859: [GC (Allocation Failure)  1911842K->1196465K(2668032K), 0.1103690 secs]
SUREFIRE-859: [GC (Allocation Failure)  2027441K->1209530K(2669568K), 0.2858018 secs]
SUREFIRE-859: [GC (Allocation Failure)  2040506K->1270729K(2669568K), 0.0615526 secs]
SUREFIRE-859: [GC (Allocation Failure)  2109897K->1356125K(2673664K), 0.4470150 secs]
SUREFIRE-859: [GC (Allocation Failure)  2195293K->1524095K(2664960K), 0.3575660 secs]
SUREFIRE-859: [Full GC (Ergonomics)  1524095K->401453K(2137088K), 0.5612442 secs]
SUREFIRE-859: [GC (Allocation Failure)  1264685K->576598K(2142208K), 0.1675074 secs]
SUREFIRE-859: [GC (Allocation Failure)  1439830K->682043K(2178560K), 0.1452734 secs]
SUREFIRE-859: [GC (Allocation Failure)  1571387K->769648K(2046976K), 0.2567059 secs]
SUREFIRE-859: [GC (Allocation Failure)  1658992K->889447K(2162176K), 0.1827354 secs]
SUREFIRE-859: [GC (Allocation Failure)  1778791K->1072398K(2162688K), 0.2166237 secs]
SUREFIRE-859: [Full GC (Ergonomics)  1072398K->771415K(2607616K), 1.2337344 secs]
SUREFIRE-859: [GC (Allocation Failure)  1660759K->962860K(2613248K), 0.1377664 secs]
SUREFIRE-859: [GC (Allocation Failure)  1863977K->1008299K(2627072K), 0.2121474 secs]
SUREFIRE-859: [GC (Allocation Failure)  1909401K->1010372K(2622976K), 0.2291380 secs]
SUREFIRE-859: [GC (Allocation Failure)  1915588K->1009569K(2410496K), 0.0590581 secs]
SUREFIRE-859: [GC (Allocation Failure)  1914779K->999404K(2622464K), 0.0927669 secs]
SUREFIRE-859: [GC (Allocation Failure)  1895404K->1015036K(2406400K), 0.0998019 secs]
SUREFIRE-859: [GC (Allocation Failure)  1911036K->1019065K(2628608K), 0.0960905 secs]
SUREFIRE-859: [GC (Allocation Failure)  1922745K->1021138K(2420224K), 0.0805533 secs]
SUREFIRE-859: [GC (Allocation Failure)  1924818K->1028803K(2630144K), 0.0926220 secs]

Results :

Tests run: 0, Failures: 0, Errors: 0, Skipped: 0

[WARNING] File encoding has not been set, using platform encoding ISO-8859-1, i.e. build is
platform dependent! The file encoding for reports output files should be provided by the POM
property ${project.reporting.outputEncoding}.
[INFO] 
[INFO] --- maven-failsafe-plugin:2.18.1:verify (verify) @ hbase-it ---
[INFO] Failsafe report directory: <https://builds.apache.org/job/HBase-1.2-IT/it.test=IntegrationTestBigLinkedList,jdk=latest1.8,label=Hadoop/ws/hbase-it/target/failsafe-reports>
[WARNING] File encoding has not been set, using platform encoding ISO-8859-1, i.e. build is
platform dependent! The file encoding for reports output files should be provided by the POM
property ${project.reporting.outputEncoding}.
[INFO] ------------------------------------------------------------------------
[INFO] Reactor Summary:
[INFO] 
[INFO] Apache HBase ...................................... SUCCESS [3.365s]
[INFO] Apache HBase - Checkstyle ......................... SUCCESS [1.108s]
[INFO] Apache HBase - Resource Bundle .................... SUCCESS [0.431s]
[INFO] Apache HBase - Annotations ........................ SUCCESS [1.778s]
[INFO] Apache HBase - Protocol ........................... SUCCESS [17.134s]
[INFO] Apache HBase - Common ............................. SUCCESS [9.860s]
[INFO] Apache HBase - Procedure .......................... SUCCESS [1.911s]
[INFO] Apache HBase - Client ............................. SUCCESS [7.033s]
[INFO] Apache HBase - Hadoop Compatibility ............... SUCCESS [0.459s]
[INFO] Apache HBase - Hadoop Two Compatibility ........... SUCCESS [1.372s]
[INFO] Apache HBase - Prefix Tree ........................ SUCCESS [1.451s]
[INFO] Apache HBase - Server ............................. SUCCESS [38.881s]
[INFO] Apache HBase - Testing Util ....................... SUCCESS [1.596s]
[INFO] Apache HBase - Thrift ............................. SUCCESS [7.270s]
[INFO] Apache HBase - Rest ............................... SUCCESS [3.241s]
[INFO] Apache HBase - Shell .............................. SUCCESS [0.979s]
[INFO] Apache HBase - Integration Tests .................. FAILURE [30:03.271s]
[INFO] Apache HBase - Examples ........................... SKIPPED
[INFO] Apache HBase - External Block Cache ............... SKIPPED
[INFO] Apache HBase - Assembly ........................... SKIPPED
[INFO] Apache HBase - Shaded ............................. SKIPPED
[INFO] Apache HBase - Shaded - Client .................... SKIPPED
[INFO] Apache HBase - Shaded - Server .................... SKIPPED
[INFO] ------------------------------------------------------------------------
[INFO] BUILD FAILURE
[INFO] ------------------------------------------------------------------------
[INFO] Total time: 31:42.836s
[INFO] Finished at: Thu Dec 24 19:59:14 UTC 2015
[INFO] Final Memory: 181M/3065M
[INFO] ------------------------------------------------------------------------
[ERROR] Failed to execute goal org.apache.maven.plugins:maven-failsafe-plugin:2.18.1:verify
(verify) on project hbase-it: There was a timeout or other error in the fork -> [Help 1]
[ERROR] 
[ERROR] To see the full stack trace of the errors, re-run Maven with the -e switch.
[ERROR] Re-run Maven using the -X switch to enable full debug logging.
[ERROR] 
[ERROR] For more information about the errors and possible solutions, please read the following
articles:
[ERROR] [Help 1] http://cwiki.apache.org/confluence/display/MAVEN/MojoFailureException
[ERROR] 
[ERROR] After correcting the problems, you can resume the build with the command
[ERROR]   mvn <goals> -rf :hbase-it
Build step 'Invoke top-level Maven targets' marked build as failure
Performing Post build task...
Match found for :.* : True
Logical operation result is TRUE
Running script  : # Post-build task script. TODO: Check this in and have all builds reference
check-in.
pwd && ls
# NOTE!!!! The below code has been copied and pasted from ./dev-tools/run-test.sh
# Do not change here without syncing there and vice-versa.
ZOMBIE_TESTS_COUNT=`jps -v | grep surefirebooter | grep -e '-Dhbase.test' | wc -l`
if [[ $ZOMBIE_TESTS_COUNT != 0 ]] ; then
 echo "Suspicious java process found - waiting 30s to see if there are just slow to stop"
 sleep 30
 ZOMBIE_TESTS_COUNT=`jps -v | grep surefirebooter | grep -e '-Dhbase.test' | wc -l`
 if [[ $ZOMBIE_TESTS_COUNT != 0 ]] ; then
   echo " {color:red}There appear to be $ZOMBIE_TESTS_COUNT zombie tests{color}, they should
have been killed by surefire but survived"
   jps -v | grep surefirebooter | grep -e '-Dhbase.test'
   jps -v | grep surefirebooter | grep -e '-Dhbase.test' | cut -d ' ' -f 1 | xargs -n 1 jstack
   # Exit with error
   exit 1
 else
   echo "We're ok: there is no zombie test, but some tests took some time to stop"
 fi
else
  echo "We're ok: there is no zombie test"
fi
[Hadoop] $ /bin/bash -xe /tmp/hudson2136394936866721441.sh
+ pwd
<https://builds.apache.org/job/HBase-1.2-IT/it.test=IntegrationTestBigLinkedList,jdk=latest1.8,label=Hadoop/ws/>
+ ls
bin
CHANGES.txt
conf
dev-support
hbase-annotations
hbase-assembly
hbase-checkstyle
hbase-client
hbase-common
hbase-examples
hbase-external-blockcache
hbase-hadoop2-compat
hbase-hadoop-compat
hbase-it
hbase-native-client
hbase-prefix-tree
hbase-procedure
hbase-protocol
hbase-resource-bundle
hbase-rest
hbase-server
hbase-shaded
hbase-shell
hbase-testing-util
hbase-thrift
LICENSE.txt
NOTICE.txt
pom.xml
README.txt
src
target
++ jps -v
++ grep surefirebooter
++ grep -e -Dhbase.test
++ wc -l
+ ZOMBIE_TESTS_COUNT=0
+ [[ 0 != 0 ]]
+ echo 'We'\''re ok: there is no zombie test'
We're ok: there is no zombie test
POST BUILD TASK : SUCCESS
END OF POST BUILD TASK : 0
Archiving artifacts

Mime
View raw message