hbase-builds mailing list archives

Site index · List index
Message view « Date » · « Thread »
Top « Date » · « Thread »
From Apache Jenkins Server <jenk...@builds.apache.org>
Subject Build failed in Jenkins: HBase-1.3-IT » IntegrationTestBigLinkedList,latest1.7,Hadoop #356
Date Sat, 05 Dec 2015 02:21:33 GMT
See <https://builds.apache.org/job/HBase-1.3-IT/it.test=IntegrationTestBigLinkedList,jdk=latest1.7,label=Hadoop/356/changes>

Changes:

[eclark] HBASE-14922 Delayed flush doesn't work causing flush storms.

------------------------------------------
[...truncated 48779 lines...]
SUREFIRE-859: [GC 1531616K->134376K(1912832K), 0.0108140 secs]
SUREFIRE-859: [GC 1531624K->134400K(1912832K), 0.0085460 secs]
SUREFIRE-859: [GC 1531648K->134392K(1912832K), 0.0201420 secs]
SUREFIRE-859: [GC 1531640K->134416K(1912832K), 0.0095300 secs]
SUREFIRE-859: [GC 1531664K->134464K(1912832K), 0.0180650 secs]
SUREFIRE-859: [GC 1531712K->134552K(1912832K), 0.0481260 secs]
SUREFIRE-859: [GC 1531800K->134512K(1912832K), 0.0102190 secs]
SUREFIRE-859: [GC 1531760K->134560K(1912832K), 0.0152580 secs]
SUREFIRE-859: [GC 1531808K->134616K(1912832K), 0.0091700 secs]
SUREFIRE-859: [GC 1531864K->134624K(1912832K), 0.0084930 secs]
SUREFIRE-859: [GC 1531872K->134696K(1912832K), 0.0062430 secs]
SUREFIRE-859: [GC 1531944K->134696K(1912832K), 0.0072860 secs]
SUREFIRE-859: [GC 1531944K->134656K(1912832K), 0.0151940 secs]
SUREFIRE-859: [GC 1531904K->134744K(1912832K), 0.0055570 secs]
SUREFIRE-859: [GC 1531992K->134712K(1912832K), 0.0156140 secs]
SUREFIRE-859: [GC 1531960K->134728K(1912832K), 0.0204200 secs]
SUREFIRE-859: [GC 1531976K->134816K(1912832K), 0.0198710 secs]
SUREFIRE-859: [GC 1532064K->134880K(1912832K), 0.0088040 secs]
SUREFIRE-859: [GC 1532128K->134968K(1912832K), 0.0064270 secs]
SUREFIRE-859: [GC 1532216K->135016K(1912832K), 0.0135050 secs]
SUREFIRE-859: [GC 1532264K->134976K(1912832K), 0.0145870 secs]
SUREFIRE-859: [GC 1532224K->134968K(1912832K), 0.0339350 secs]
SUREFIRE-859: [GC 1532216K->135024K(1912832K), 0.0125850 secs]
SUREFIRE-859: [GC 1532272K->135080K(1912832K), 0.0217630 secs]
SUREFIRE-859: [GC 1532328K->135176K(1912832K), 0.0076050 secs]
SUREFIRE-859: [GC 1532424K->135176K(1912832K), 0.0053000 secs]
SUREFIRE-859: [GC 1532424K->135336K(1912832K), 0.0169940 secs]
SUREFIRE-859: [GC 1532584K->135368K(1912832K), 0.0066910 secs]
SUREFIRE-859: [GC 1532616K->135384K(1912832K), 0.0099960 secs]
SUREFIRE-859: [GC 1532632K->135520K(1912832K), 0.0100140 secs]
SUREFIRE-859: [GC 1532768K->135408K(1912832K), 0.0081290 secs]
SUREFIRE-859: [GC 1532656K->135376K(1912832K), 0.0070520 secs]
SUREFIRE-859: [GC 1532624K->135432K(1912832K), 0.0059750 secs]
SUREFIRE-859: [GC 1532680K->135352K(1912832K), 0.0277560 secs]
SUREFIRE-859: [GC 1532600K->135544K(1912832K), 0.0144650 secs]
SUREFIRE-859: [GC 1532792K->135544K(1912832K), 0.0100350 secs]
SUREFIRE-859: [GC 1532792K->135576K(1912832K), 0.0059990 secs]
SUREFIRE-859: [GC 1532824K->135528K(1912832K), 0.0154570 secs]
SUREFIRE-859: [GC 1532776K->135624K(1912832K), 0.0128260 secs]
SUREFIRE-859: [GC 1532872K->135600K(1912832K), 0.0124730 secs]
SUREFIRE-859: [GC 1532848K->135608K(1912832K), 0.0239030 secs]
SUREFIRE-859: [GC 1532856K->135656K(1912832K), 0.0081520 secs]
SUREFIRE-859: [GC 1532904K->135656K(1912832K), 0.0167850 secs]
SUREFIRE-859: [GC 1532904K->135648K(1912832K), 0.0130250 secs]
SUREFIRE-859: [GC 1532896K->135816K(1912832K), 0.0106390 secs]
SUREFIRE-859: [GC 1533064K->135712K(1912832K), 0.0142160 secs]
SUREFIRE-859: [GC 1532960K->135808K(1912832K), 0.0065940 secs]
SUREFIRE-859: [GC 1533056K->135912K(1912832K), 0.0052980 secs]
SUREFIRE-859: [GC 1533160K->135960K(1912832K), 0.0070480 secs]
SUREFIRE-859: [GC 1533208K->135872K(1912832K), 0.0077870 secs]
SUREFIRE-859: [GC 1533120K->135880K(1912832K), 0.0213520 secs]
SUREFIRE-859: [GC 1533128K->135904K(1912832K), 0.0080110 secs]
SUREFIRE-859: [GC 1533152K->136080K(1912832K), 0.0207590 secs]
SUREFIRE-859: [GC 1533328K->136024K(1912832K), 0.0074420 secs]
SUREFIRE-859: [GC 1533272K->136024K(1912832K), 0.0132950 secs]
SUREFIRE-859: [GC 1533272K->136008K(1912832K), 0.0206610 secs]
SUREFIRE-859: [GC 1533256K->136136K(1912832K), 0.0074140 secs]
SUREFIRE-859: [GC 1533384K->136256K(1912832K), 0.0129100 secs]
SUREFIRE-859: [GC 1533504K->136296K(1912832K), 0.0075130 secs]
SUREFIRE-859: [GC 1533544K->136376K(1912832K), 0.0182940 secs]
SUREFIRE-859: [GC 1533624K->136336K(1912832K), 0.0105530 secs]
SUREFIRE-859: [GC 1533584K->136424K(1912832K), 0.0078230 secs]
SUREFIRE-859: [GC 1533672K->136480K(1912832K), 0.0189150 secs]
SUREFIRE-859: [GC 1533728K->136626K(1912832K), 0.0059700 secs]
SUREFIRE-859: [GC 1533874K->136850K(1912832K), 0.0076080 secs]
SUREFIRE-859: [GC 1534098K->136738K(1912832K), 0.0150830 secs]
SUREFIRE-859: [GC 1533986K->136906K(1912832K), 0.0062260 secs]
SUREFIRE-859: [GC 1534154K->136818K(1851904K), 0.0092550 secs]
SUREFIRE-859: [GC 1473138K->137002K(1912832K), 0.0177660 secs]
SUREFIRE-859: [GC 1534250K->136954K(1912832K), 0.0112130 secs]
SUREFIRE-859: [GC 1534202K->137050K(1851904K), 0.0071270 secs]
SUREFIRE-859: [GC 1473370K->137226K(1912832K), 0.0143690 secs]
SUREFIRE-859: [GC 1534474K->137114K(1912832K), 0.0094470 secs]
SUREFIRE-859: [GC 1534362K->137194K(1912832K), 0.0154810 secs]
SUREFIRE-859: [GC 1534442K->137237K(1851904K), 0.0136940 secs]
SUREFIRE-859: [GC 1473557K->137277K(1912832K), 0.0234670 secs]
SUREFIRE-859: [GC 1534525K->137349K(1912832K), 0.0073550 secs]
SUREFIRE-859: [GC 1534597K->137533K(1912832K), 0.0086810 secs]
SUREFIRE-859: [GC 1534781K->137605K(1912832K), 0.0141690 secs]
SUREFIRE-859: [GC 1534853K->137637K(1851904K), 0.0051780 secs]
SUREFIRE-859: [GC 1473957K->137613K(1912832K), 0.0402300 secs]
SUREFIRE-859: [GC 1534861K->137741K(1912832K), 0.0073830 secs]
SUREFIRE-859: [GC 1534989K->137693K(1912832K), 0.0138430 secs]
SUREFIRE-859: [GC 1534941K->137765K(1912832K), 0.0187090 secs]
SUREFIRE-859: [GC 1535013K->137885K(1912832K), 0.0102290 secs]
SUREFIRE-859: [GC 1535133K->137847K(1912832K), 0.0186710 secs]
SUREFIRE-859: [GC 1535095K->138007K(1912832K), 0.0094050 secs]
2015-12-05 01:51:16\2C439 ERROR [asf906.gq1.ygridcore.net\2C40691\2C1449280096536_ChoreService_640597]
server.NIOServerCnxnFactory$1(44): Thread Thread[asf906.gq1.ygridcore.net\2C40691\2C1449280096536_ChoreService_640597\2C5\2Cmain]
died\0Ajava.lang.IllegalArgumentException\0A\09at java.util.concurrent.ThreadLocalRandom.nextLong(ThreadLocalRandom.java:190)\0A\09at
org.apache.hadoop.hbase.JitterScheduledThreadPoolExecutorImpl$JitteredRunnableScheduledFuture.getDelay(JitterScheduledThreadPoolExecutorImpl.java:81)\0A\09at
java.util.concurrent.ScheduledThreadPoolExecutor$DelayedWorkQueue.take(ScheduledThreadPoolExecutor.java:1081)\0A\09at
java.util.concurrent.ScheduledThreadPoolExecutor$DelayedWorkQueue.take(ScheduledThreadPoolExecutor.java:807)\0A\09at
java.util.concurrent.ThreadPoolExecutor.getTask(ThreadPoolExecutor.java:1068)\0A\09at java.util.concurrent.ThreadPoolExecutor.runWorker(ThreadPoolExecutor.java:1130)\0A\09at
java.util.concurrent.ThreadPoolExecutor$Worker.run(ThreadPoolExecutor.java:615)\0A\09at java.lang.Thread.run(Thread.java:745)\0A
SUREFIRE-859: [GC 1474327K->138043K(1912832K), 0.0175280 secs]
SUREFIRE-859: [GC 1535291K->138339K(1851904K), 0.0063540 secs]
SUREFIRE-859: [GC 1474659K->138187K(1794048K), 0.0116580 secs]
SUREFIRE-859: [GC 1416651K->138251K(1912832K), 0.0189460 secs]
SUREFIRE-859: [GC 1535499K->138123K(1851904K), 0.0109780 secs]
SUREFIRE-859: [GC 1474443K->138323K(1912832K), 0.0221020 secs]
SUREFIRE-859: [GC 1535571K->138171K(1912832K), 0.0224240 secs]
SUREFIRE-859: [GC 1535419K->138459K(1912832K), 0.0073120 secs]
SUREFIRE-859: [GC 1535707K->138499K(1851904K), 0.0092490 secs]
SUREFIRE-859: [GC 1474819K->138515K(1794048K), 0.0092780 secs]
SUREFIRE-859: [GC 1416979K->138491K(1738752K), 0.0145340 secs]
SUREFIRE-859: [GC 1361659K->138675K(1686016K), 0.0109040 secs]
SUREFIRE-859: [GC 1309107K->138539K(1635840K), 0.0084710 secs]
SUREFIRE-859: [GC 1258795K->138643K(1588224K), 0.0115340 secs]
SUREFIRE-859: [GC 1211283K->138659K(1543168K), 0.0190760 secs]
Tests run: 1, Failures: 0, Errors: 1, Skipped: 0, Time elapsed: 207.787 sec <<< FAILURE!
- in org.apache.hadoop.hbase.test.IntegrationTestBigLinkedList
testContinuousIngest(org.apache.hadoop.hbase.test.IntegrationTestBigLinkedList)  Time elapsed:
207.65 sec  <<< ERROR!
java.io.IOException: Shutting down
	at org.apache.hadoop.hbase.util.JVMClusterUtil.startup(JVMClusterUtil.java:225)
	at org.apache.hadoop.hbase.LocalHBaseCluster.startup(LocalHBaseCluster.java:447)
	at org.apache.hadoop.hbase.MiniHBaseCluster.init(MiniHBaseCluster.java:225)
	at org.apache.hadoop.hbase.MiniHBaseCluster.<init>(MiniHBaseCluster.java:94)
	at org.apache.hadoop.hbase.HBaseTestingUtility.startMiniHBaseCluster(HBaseTestingUtility.java:1056)
	at org.apache.hadoop.hbase.HBaseTestingUtility.startMiniCluster(HBaseTestingUtility.java:1016)
	at org.apache.hadoop.hbase.HBaseTestingUtility.startMiniCluster(HBaseTestingUtility.java:888)
	at org.apache.hadoop.hbase.HBaseTestingUtility.startMiniCluster(HBaseTestingUtility.java:870)
	at org.apache.hadoop.hbase.HBaseTestingUtility.startMiniCluster(HBaseTestingUtility.java:857)
	at org.apache.hadoop.hbase.IntegrationTestingUtility.initializeCluster(IntegrationTestingUtility.java:78)
	at org.apache.hadoop.hbase.test.IntegrationTestBigLinkedList.setUpCluster(IntegrationTestBigLinkedList.java:1550)


Results :

Tests in error: 
  IntegrationTestBigLinkedList>IntegrationTestBase.setUp:133->setUpCluster:1550 » IO

Tests run: 1, Failures: 0, Errors: 1, Skipped: 0

[WARNING] File encoding has not been set, using platform encoding UTF-8, i.e. build is platform
dependent! The file encoding for reports output files should be provided by the POM property
${project.reporting.outputEncoding}.
[INFO] 
[INFO] --- maven-failsafe-plugin:2.18.1:verify (verify) @ hbase-it ---
[INFO] Failsafe report directory: <https://builds.apache.org/job/HBase-1.3-IT/it.test=IntegrationTestBigLinkedList,jdk=latest1.7,label=Hadoop/ws/hbase-it/target/failsafe-reports>
[WARNING] File encoding has not been set, using platform encoding UTF-8, i.e. build is platform
dependent! The file encoding for reports output files should be provided by the POM property
${project.reporting.outputEncoding}.
[INFO] ------------------------------------------------------------------------
[INFO] Reactor Summary:
[INFO] 
[INFO] Apache HBase ...................................... SUCCESS [1:21.115s]
[INFO] Apache HBase - Checkstyle ......................... SUCCESS [6.650s]
[INFO] Apache HBase - Resource Bundle .................... SUCCESS [0.296s]
[INFO] Apache HBase - Annotations ........................ SUCCESS [1.287s]
[INFO] Apache HBase - Protocol ........................... SUCCESS [21.500s]
[INFO] Apache HBase - Common ............................. SUCCESS [54.547s]
[INFO] Apache HBase - Procedure .......................... SUCCESS [1.659s]
[INFO] Apache HBase - Client ............................. SUCCESS [10.656s]
[INFO] Apache HBase - Hadoop Compatibility ............... SUCCESS [1.397s]
[INFO] Apache HBase - Hadoop Two Compatibility ........... SUCCESS [3.228s]
[INFO] Apache HBase - Prefix Tree ........................ SUCCESS [1.371s]
[INFO] Apache HBase - Server ............................. SUCCESS [1:20.335s]
[INFO] Apache HBase - Testing Util ....................... SUCCESS [2.557s]
[INFO] Apache HBase - Thrift ............................. SUCCESS [8.436s]
[INFO] Apache HBase - Rest ............................... SUCCESS [3.428s]
[INFO] Apache HBase - Shell .............................. SUCCESS [5.293s]
[INFO] Apache HBase - Integration Tests .................. FAILURE [28:03.809s]
[INFO] Apache HBase - Examples ........................... SKIPPED
[INFO] Apache HBase - External Block Cache ............... SKIPPED
[INFO] Apache HBase - Assembly ........................... SKIPPED
[INFO] Apache HBase - Shaded ............................. SKIPPED
[INFO] Apache HBase - Shaded - Client .................... SKIPPED
[INFO] Apache HBase - Shaded - Server .................... SKIPPED
[INFO] ------------------------------------------------------------------------
[INFO] BUILD FAILURE
[INFO] ------------------------------------------------------------------------
[INFO] Total time: 33:12.022s
[INFO] Finished at: Sat Dec 05 02:16:11 UTC 2015
[INFO] Final Memory: 128M/1000M
[INFO] ------------------------------------------------------------------------
[ERROR] Failed to execute goal org.apache.maven.plugins:maven-failsafe-plugin:2.18.1:verify
(verify) on project hbase-it: There are test failures.
[ERROR] 
[ERROR] Please refer to <https://builds.apache.org/job/HBase-1.3-IT/it.test=IntegrationTestBigLinkedList,jdk=latest1.7,label=Hadoop/ws/hbase-it/target/failsafe-reports>
for the individual test results.
[ERROR] -> [Help 1]
[ERROR] 
[ERROR] To see the full stack trace of the errors, re-run Maven with the -e switch.
[ERROR] Re-run Maven using the -X switch to enable full debug logging.
[ERROR] 
[ERROR] For more information about the errors and possible solutions, please read the following
articles:
[ERROR] [Help 1] http://cwiki.apache.org/confluence/display/MAVEN/MojoFailureException
[ERROR] 
[ERROR] After correcting the problems, you can resume the build with the command
[ERROR]   mvn <goals> -rf :hbase-it
Build step 'Invoke top-level Maven targets' marked build as failure
Performing Post build task...
Match found for :.* : True
Logical operation result is TRUE
Running script  : # Post-build task script. TODO: Check this in and have all builds reference
check-in.
pwd && ls
# NOTE!!!! The below code has been copied and pasted from ./dev-tools/run-test.sh
# Do not change here without syncing there and vice-versa.
ZOMBIE_TESTS_COUNT=`jps -v | grep surefirebooter | grep -e '-Dhbase.test' | wc -l`
if [[ $ZOMBIE_TESTS_COUNT != 0 ]] ; then
 echo "Suspicious java process found - waiting 30s to see if there are just slow to stop"
 sleep 30
 ZOMBIE_TESTS_COUNT=`jps -v | grep surefirebooter | grep -e '-Dhbase.test' | wc -l`
 if [[ $ZOMBIE_TESTS_COUNT != 0 ]] ; then
   echo " {color:red}There appear to be $ZOMBIE_TESTS_COUNT zombie tests{color}, they should
have been killed by surefire but survived"
   jps -v | grep surefirebooter | grep -e '-Dhbase.test'
   jps -v | grep surefirebooter | grep -e '-Dhbase.test' | cut -d ' ' -f 1 | xargs -n 1 jstack
   # Exit with error
   exit 1
 else
   echo "We're ok: there is no zombie test, but some tests took some time to stop"
 fi
else
  echo "We're ok: there is no zombie test"
fi
[Hadoop] $ /bin/bash -xe /tmp/hudson3757168631952778905.sh
+ pwd
<https://builds.apache.org/job/HBase-1.3-IT/it.test=IntegrationTestBigLinkedList,jdk=latest1.7,label=Hadoop/ws/>
+ ls
bin
CHANGES.txt
conf
dev-support
hbase-annotations
hbase-assembly
hbase-checkstyle
hbase-client
hbase-common
hbase-examples
hbase-external-blockcache
hbase-hadoop2-compat
hbase-hadoop-compat
hbase-it
hbase-native-client
hbase-prefix-tree
hbase-procedure
hbase-protocol
hbase-resource-bundle
hbase-rest
hbase-server
hbase-shaded
hbase-shell
hbase-spark
hbase-testing-util
hbase-thrift
LICENSE.txt
NOTICE.txt
pom.xml
README.txt
src
target
++ jps -v
++ grep -e -Dhbase.test
++ grep surefirebooter
++ wc -l
+ ZOMBIE_TESTS_COUNT=0
+ [[ 0 != 0 ]]
+ echo 'We'\''re ok: there is no zombie test'
We're ok: there is no zombie test
POST BUILD TASK : SUCCESS
END OF POST BUILD TASK : 0
Archiving artifacts

Mime
View raw message