hbase-builds mailing list archives

Site index · List index
Message view « Date » · « Thread »
Top « Date » · « Thread »
From Apache Jenkins Server <jenk...@builds.apache.org>
Subject Build failed in Jenkins: HBase-1.3 » latest1.8,Hadoop #458
Date Tue, 22 Dec 2015 07:30:59 GMT
See <https://builds.apache.org/job/HBase-1.3/jdk=latest1.8,label=Hadoop/458/changes>

Changes:

[chenheng] HBASE-14684 Try to remove all MiniMapReduceCluster in unit tests

------------------------------------------
[...truncated 46872 lines...]
  Run 1: TestFromClientSide.testGetClosestRowBefore:4314 null
  Run 2: TestFromClientSide.testGetClosestRowBefore:4314 null
  Run 3: TestFromClientSide.testGetClosestRowBefore:4314 null

org.apache.hadoop.hbase.client.TestFromClientSideWithCoprocessor.testGetClosestRowBefore(org.apache.hadoop.hbase.client.TestFromClientSideWithCoprocessor)
  Run 1: TestFromClientSideWithCoprocessor>TestFromClientSide.testGetClosestRowBefore:4314
null
  Run 2: TestFromClientSideWithCoprocessor>TestFromClientSide.testGetClosestRowBefore:4314
null
  Run 3: TestFromClientSideWithCoprocessor>TestFromClientSide.testGetClosestRowBefore:4314
null

Tests in error: 
org.apache.hadoop.hbase.mapred.TestTableSnapshotInputFormat.testInitTableSnapshotMapperJobConfig(org.apache.hadoop.hbase.mapred.TestTableSnapshotInputFormat)
  Run 1: TestTableSnapshotInputFormat.testInitTableSnapshotMapperJobConfig:108 » IllegalArgument
  Run 2: TestTableSnapshotInputFormat.testInitTableSnapshotMapperJobConfig:108 » IllegalArgument
  Run 3: TestTableSnapshotInputFormat.testInitTableSnapshotMapperJobConfig:108 » IllegalArgument

org.apache.hadoop.hbase.mapred.TestTableSnapshotInputFormat.testRestoreSnapshotDoesNotCreateBackRefLinks(org.apache.hadoop.hbase.mapred.TestTableSnapshotInputFormat)
  Run 1: TestTableSnapshotInputFormat>TableSnapshotInputFormatTestBase.testRestoreSnapshotDoesNotCreateBackRefLinks:127->testRestoreSnapshotDoesNotCreateBackRefLinksInit:154
» IllegalArgument
  Run 2: TestTableSnapshotInputFormat>TableSnapshotInputFormatTestBase.testRestoreSnapshotDoesNotCreateBackRefLinks:127->testRestoreSnapshotDoesNotCreateBackRefLinksInit:154
» IllegalArgument
  Run 3: TestTableSnapshotInputFormat>TableSnapshotInputFormatTestBase.testRestoreSnapshotDoesNotCreateBackRefLinks:127->testRestoreSnapshotDoesNotCreateBackRefLinksInit:154
» IllegalArgument

org.apache.hadoop.hbase.mapred.TestTableSnapshotInputFormat.testWithMapReduceAndOfflineHBaseMultiRegion(org.apache.hadoop.hbase.mapred.TestTableSnapshotInputFormat)
  Run 1: TestTableSnapshotInputFormat.testWithMapReduceAndOfflineHBaseMultiRegion:147->TableSnapshotInputFormatTestBase.testWithMapReduce:165->testWithMapReduceImpl:224->doTestWithMapReduce:248
» IllegalArgument
  Run 2: TestTableSnapshotInputFormat.testWithMapReduceAndOfflineHBaseMultiRegion:147->TableSnapshotInputFormatTestBase.testWithMapReduce:165->testWithMapReduceImpl:224->doTestWithMapReduce:248
» IllegalArgument
  Run 3: TestTableSnapshotInputFormat.testWithMapReduceAndOfflineHBaseMultiRegion:147->TableSnapshotInputFormatTestBase.testWithMapReduce:165->testWithMapReduceImpl:224->doTestWithMapReduce:248
» IllegalArgument

org.apache.hadoop.hbase.mapred.TestTableSnapshotInputFormat.testWithMapReduceMultiRegion(org.apache.hadoop.hbase.mapred.TestTableSnapshotInputFormat)
  Run 1: TestTableSnapshotInputFormat.testWithMapReduceMultiRegion:140->TableSnapshotInputFormatTestBase.testWithMapReduce:165->testWithMapReduceImpl:224->doTestWithMapReduce:248
» IllegalArgument
  Run 2: TestTableSnapshotInputFormat.testWithMapReduceMultiRegion:140->TableSnapshotInputFormatTestBase.testWithMapReduce:165->testWithMapReduceImpl:224->doTestWithMapReduce:248
» IllegalArgument
  Run 3: TestTableSnapshotInputFormat.testWithMapReduceMultiRegion:140->TableSnapshotInputFormatTestBase.testWithMapReduce:165->testWithMapReduceImpl:224->doTestWithMapReduce:248
» IllegalArgument

org.apache.hadoop.hbase.mapred.TestTableSnapshotInputFormat.testWithMapReduceSingleRegion(org.apache.hadoop.hbase.mapred.TestTableSnapshotInputFormat)
  Run 1: TestTableSnapshotInputFormat>TableSnapshotInputFormatTestBase.testWithMapReduceSingleRegion:101->TableSnapshotInputFormatTestBase.testWithMapReduce:165->testWithMapReduceImpl:224->doTestWithMapReduce:248
» IllegalArgument
  Run 2: TestTableSnapshotInputFormat>TableSnapshotInputFormatTestBase.testWithMapReduceSingleRegion:101->TableSnapshotInputFormatTestBase.testWithMapReduce:165->testWithMapReduceImpl:224->doTestWithMapReduce:248
» IllegalArgument
  Run 3: TestTableSnapshotInputFormat>TableSnapshotInputFormatTestBase.testWithMapReduceSingleRegion:101->TableSnapshotInputFormatTestBase.testWithMapReduce:165->testWithMapReduceImpl:224->doTestWithMapReduce:248
» IllegalArgument

org.apache.hadoop.hbase.mapred.TestTableSnapshotInputFormat.testWithMockedMapReduceMultiRegion(org.apache.hadoop.hbase.mapred.TestTableSnapshotInputFormat)
  Run 1: TestTableSnapshotInputFormat.testWithMockedMapReduceMultiRegion:134->testWithMockedMapReduce:171
» IllegalArgument
  Run 2: TestTableSnapshotInputFormat.testWithMockedMapReduceMultiRegion:134->testWithMockedMapReduce:171
» IllegalArgument
  Run 3: TestTableSnapshotInputFormat.testWithMockedMapReduceMultiRegion:134->testWithMockedMapReduce:171
» IllegalArgument

org.apache.hadoop.hbase.mapred.TestTableSnapshotInputFormat.testWithMockedMapReduceSingleRegion(org.apache.hadoop.hbase.mapred.TestTableSnapshotInputFormat)
  Run 1: TestTableSnapshotInputFormat>TableSnapshotInputFormatTestBase.testWithMockedMapReduceSingleRegion:91->testWithMockedMapReduce:171
» IllegalArgument
  Run 2: TestTableSnapshotInputFormat>TableSnapshotInputFormatTestBase.testWithMockedMapReduceSingleRegion:91->testWithMockedMapReduce:171
» IllegalArgument
  Run 3: TestTableSnapshotInputFormat>TableSnapshotInputFormatTestBase.testWithMockedMapReduceSingleRegion:91->testWithMockedMapReduce:171
» IllegalArgument

org.apache.hadoop.hbase.mapreduce.TestMultiTableInputFormat.testScanEmptyToAPP(org.apache.hadoop.hbase.mapreduce.TestMultiTableInputFormat)
  Run 1: TestMultiTableInputFormat.testScanEmptyToAPP:184->testScan:245 » FileAlreadyExists
  Run 2: TestMultiTableInputFormat.testScanEmptyToAPP:184->testScan:245 » FileAlreadyExists
  Run 3: TestMultiTableInputFormat.testScanEmptyToAPP:184->testScan:245 » FileAlreadyExists

org.apache.hadoop.hbase.mapreduce.TestMultiTableInputFormat.testScanEmptyToEmpty(org.apache.hadoop.hbase.mapreduce.TestMultiTableInputFormat)
  Run 1: TestMultiTableInputFormat.testScanEmptyToEmpty:178->testScan:245 » FileAlreadyExists
  Run 2: TestMultiTableInputFormat.testScanEmptyToEmpty:178->testScan:245 » FileAlreadyExists
  Run 3: TestMultiTableInputFormat.testScanEmptyToEmpty:178->testScan:245 » FileAlreadyExists

org.apache.hadoop.hbase.mapreduce.TestMultiTableInputFormat.testScanOBBToOPP(org.apache.hadoop.hbase.mapreduce.TestMultiTableInputFormat)
  Run 1: TestMultiTableInputFormat.testScanOBBToOPP:190->testScan:245 » FileAlreadyExists
  Run 2: TestMultiTableInputFormat.testScanOBBToOPP:190->testScan:245 » FileAlreadyExists
  Run 3: TestMultiTableInputFormat.testScanOBBToOPP:190->testScan:245 » FileAlreadyExists

org.apache.hadoop.hbase.mapreduce.TestMultiTableInputFormat.testScanYZYToEmpty(org.apache.hadoop.hbase.mapreduce.TestMultiTableInputFormat)
  Run 1: TestMultiTableInputFormat.testScanYZYToEmpty:196->testScan:245 » FileAlreadyExists
  Run 2: TestMultiTableInputFormat.testScanYZYToEmpty:196->testScan:245 » FileAlreadyExists
  Run 3: TestMultiTableInputFormat.testScanYZYToEmpty:196->testScan:245 » FileAlreadyExists

org.apache.hadoop.hbase.mapreduce.TestMultiTableSnapshotInputFormat.testScanEmptyToAPP(org.apache.hadoop.hbase.mapreduce.TestMultiTableSnapshotInputFormat)
  Run 1: TestMultiTableSnapshotInputFormat>MultiTableInputFormatTestBase.testScanEmptyToAPP:208->MultiTableInputFormatTestBase.testScan:261->MultiTableInputFormatTestBase.runJob:273
» FileAlreadyExists
  Run 2: TestMultiTableSnapshotInputFormat>MultiTableInputFormatTestBase.testScanEmptyToAPP:208->MultiTableInputFormatTestBase.testScan:261->MultiTableInputFormatTestBase.runJob:273
» FileAlreadyExists
  Run 3: TestMultiTableSnapshotInputFormat>MultiTableInputFormatTestBase.testScanEmptyToAPP:208->MultiTableInputFormatTestBase.testScan:261->MultiTableInputFormatTestBase.runJob:273
» FileAlreadyExists

org.apache.hadoop.hbase.mapreduce.TestMultiTableSnapshotInputFormat.testScanEmptyToEmpty(org.apache.hadoop.hbase.mapreduce.TestMultiTableSnapshotInputFormat)
  Run 1: TestMultiTableSnapshotInputFormat>MultiTableInputFormatTestBase.testScanEmptyToEmpty:202->MultiTableInputFormatTestBase.testScan:261->MultiTableInputFormatTestBase.runJob:273
» FileAlreadyExists
  Run 2: TestMultiTableSnapshotInputFormat>MultiTableInputFormatTestBase.testScanEmptyToEmpty:202->MultiTableInputFormatTestBase.testScan:261->MultiTableInputFormatTestBase.runJob:273
» FileAlreadyExists
  Run 3: TestMultiTableSnapshotInputFormat>MultiTableInputFormatTestBase.testScanEmptyToEmpty:202->MultiTableInputFormatTestBase.testScan:261->MultiTableInputFormatTestBase.runJob:273
» FileAlreadyExists

org.apache.hadoop.hbase.mapreduce.TestMultiTableSnapshotInputFormat.testScanOBBToOPP(org.apache.hadoop.hbase.mapreduce.TestMultiTableSnapshotInputFormat)
  Run 1: TestMultiTableSnapshotInputFormat>MultiTableInputFormatTestBase.testScanOBBToOPP:214->MultiTableInputFormatTestBase.testScan:261->MultiTableInputFormatTestBase.runJob:273
» FileAlreadyExists
  Run 2: TestMultiTableSnapshotInputFormat>MultiTableInputFormatTestBase.testScanOBBToOPP:214->MultiTableInputFormatTestBase.testScan:261->MultiTableInputFormatTestBase.runJob:273
» FileAlreadyExists
  Run 3: TestMultiTableSnapshotInputFormat>MultiTableInputFormatTestBase.testScanOBBToOPP:214->MultiTableInputFormatTestBase.testScan:261->MultiTableInputFormatTestBase.runJob:273
» FileAlreadyExists

org.apache.hadoop.hbase.mapreduce.TestMultiTableSnapshotInputFormat.testScanYZYToEmpty(org.apache.hadoop.hbase.mapreduce.TestMultiTableSnapshotInputFormat)
  Run 1: TestMultiTableSnapshotInputFormat>MultiTableInputFormatTestBase.testScanYZYToEmpty:220->MultiTableInputFormatTestBase.testScan:261->MultiTableInputFormatTestBase.runJob:273
» FileAlreadyExists
  Run 2: TestMultiTableSnapshotInputFormat>MultiTableInputFormatTestBase.testScanYZYToEmpty:220->MultiTableInputFormatTestBase.testScan:261->MultiTableInputFormatTestBase.runJob:273
» FileAlreadyExists
  Run 3: TestMultiTableSnapshotInputFormat>MultiTableInputFormatTestBase.testScanYZYToEmpty:220->MultiTableInputFormatTestBase.testScan:261->MultiTableInputFormatTestBase.runJob:273
» FileAlreadyExists

org.apache.hadoop.hbase.mapreduce.TestTableSnapshotInputFormat.testInitTableSnapshotMapperJobConfig(org.apache.hadoop.hbase.mapreduce.TestTableSnapshotInputFormat)
  Run 1: TestTableSnapshotInputFormat.testInitTableSnapshotMapperJobConfig:160 » IllegalArgument
  Run 2: TestTableSnapshotInputFormat.testInitTableSnapshotMapperJobConfig:160 » IllegalArgument
  Run 3: TestTableSnapshotInputFormat.testInitTableSnapshotMapperJobConfig:160 » IllegalArgument

org.apache.hadoop.hbase.mapreduce.TestTableSnapshotInputFormat.testRestoreSnapshotDoesNotCreateBackRefLinks(org.apache.hadoop.hbase.mapreduce.TestTableSnapshotInputFormat)
  Run 1: TestTableSnapshotInputFormat>TableSnapshotInputFormatTestBase.testRestoreSnapshotDoesNotCreateBackRefLinks:127->testRestoreSnapshotDoesNotCreateBackRefLinksInit:184
» IllegalArgument
  Run 2: TestTableSnapshotInputFormat>TableSnapshotInputFormatTestBase.testRestoreSnapshotDoesNotCreateBackRefLinks:127->testRestoreSnapshotDoesNotCreateBackRefLinksInit:184
» IllegalArgument
  Run 3: TestTableSnapshotInputFormat>TableSnapshotInputFormatTestBase.testRestoreSnapshotDoesNotCreateBackRefLinks:127->testRestoreSnapshotDoesNotCreateBackRefLinksInit:184
» IllegalArgument

org.apache.hadoop.hbase.mapreduce.TestTableSnapshotInputFormat.testWithMapReduceAndOfflineHBaseMultiRegion(org.apache.hadoop.hbase.mapreduce.TestTableSnapshotInputFormat)
  Run 1: TestTableSnapshotInputFormat>TableSnapshotInputFormatTestBase.testWithMapReduceAndOfflineHBaseMultiRegion:112->TableSnapshotInputFormatTestBase.testWithMapReduce:165->testWithMapReduceImpl:256->doTestWithMapReduce:281
» IllegalArgument
  Run 2: TestTableSnapshotInputFormat>TableSnapshotInputFormatTestBase.testWithMapReduceAndOfflineHBaseMultiRegion:112->TableSnapshotInputFormatTestBase.testWithMapReduce:165->testWithMapReduceImpl:256->doTestWithMapReduce:281
» IllegalArgument
  Run 3: TestTableSnapshotInputFormat>TableSnapshotInputFormatTestBase.testWithMapReduceAndOfflineHBaseMultiRegion:112->TableSnapshotInputFormatTestBase.testWithMapReduce:165->testWithMapReduceImpl:256->doTestWithMapReduce:281
» IllegalArgument

org.apache.hadoop.hbase.mapreduce.TestTableSnapshotInputFormat.testWithMapReduceMultiRegion(org.apache.hadoop.hbase.mapreduce.TestTableSnapshotInputFormat)
  Run 1: TestTableSnapshotInputFormat>TableSnapshotInputFormatTestBase.testWithMapReduceMultiRegion:106->TableSnapshotInputFormatTestBase.testWithMapReduce:165->testWithMapReduceImpl:256->doTestWithMapReduce:281
» IllegalArgument
  Run 2: TestTableSnapshotInputFormat>TableSnapshotInputFormatTestBase.testWithMapReduceMultiRegion:106->TableSnapshotInputFormatTestBase.testWithMapReduce:165->testWithMapReduceImpl:256->doTestWithMapReduce:281
» IllegalArgument
  Run 3: TestTableSnapshotInputFormat>TableSnapshotInputFormatTestBase.testWithMapReduceMultiRegion:106->TableSnapshotInputFormatTestBase.testWithMapReduce:165->testWithMapReduceImpl:256->doTestWithMapReduce:281
» IllegalArgument

org.apache.hadoop.hbase.mapreduce.TestTableSnapshotInputFormat.testWithMapReduceSingleRegion(org.apache.hadoop.hbase.mapreduce.TestTableSnapshotInputFormat)
  Run 1: TestTableSnapshotInputFormat>TableSnapshotInputFormatTestBase.testWithMapReduceSingleRegion:101->TableSnapshotInputFormatTestBase.testWithMapReduce:165->testWithMapReduceImpl:256->doTestWithMapReduce:281
» IllegalArgument
  Run 2: TestTableSnapshotInputFormat>TableSnapshotInputFormatTestBase.testWithMapReduceSingleRegion:101->TableSnapshotInputFormatTestBase.testWithMapReduce:165->testWithMapReduceImpl:256->doTestWithMapReduce:281
» IllegalArgument
  Run 3: TestTableSnapshotInputFormat>TableSnapshotInputFormatTestBase.testWithMapReduceSingleRegion:101->TableSnapshotInputFormatTestBase.testWithMapReduce:165->testWithMapReduceImpl:256->doTestWithMapReduce:281
» IllegalArgument

org.apache.hadoop.hbase.mapreduce.TestTableSnapshotInputFormat.testWithMockedMapReduceMultiRegion(org.apache.hadoop.hbase.mapreduce.TestTableSnapshotInputFormat)
  Run 1: TestTableSnapshotInputFormat>TableSnapshotInputFormatTestBase.testWithMockedMapReduceMultiRegion:96->testWithMockedMapReduce:202
» IllegalArgument
  Run 2: TestTableSnapshotInputFormat>TableSnapshotInputFormatTestBase.testWithMockedMapReduceMultiRegion:96->testWithMockedMapReduce:202
» IllegalArgument
  Run 3: TestTableSnapshotInputFormat>TableSnapshotInputFormatTestBase.testWithMockedMapReduceMultiRegion:96->testWithMockedMapReduce:202
» IllegalArgument

org.apache.hadoop.hbase.mapreduce.TestTableSnapshotInputFormat.testWithMockedMapReduceSingleRegion(org.apache.hadoop.hbase.mapreduce.TestTableSnapshotInputFormat)
  Run 1: TestTableSnapshotInputFormat>TableSnapshotInputFormatTestBase.testWithMockedMapReduceSingleRegion:91->testWithMockedMapReduce:202
» IllegalArgument
  Run 2: TestTableSnapshotInputFormat>TableSnapshotInputFormatTestBase.testWithMockedMapReduceSingleRegion:91->testWithMockedMapReduce:202
» IllegalArgument
  Run 3: TestTableSnapshotInputFormat>TableSnapshotInputFormatTestBase.testWithMockedMapReduceSingleRegion:91->testWithMockedMapReduce:202
» IllegalArgument

org.apache.hadoop.hbase.replication.multiwal.TestReplicationSyncUpToolWithMultipleWAL.org.apache.hadoop.hbase.replication.multiwal.TestReplicationSyncUpToolWithMultipleWAL
  Run 1: TestReplicationSyncUpToolWithMultipleWAL.setUpBeforeClass:32->TestReplicationBase.setUpBeforeClass:146
» IO
  Run 2: TestReplicationSyncUpToolWithMultipleWAL>TestReplicationBase.tearDownAfterClass:163
» NullPointer


Tests run: 2366, Failures: 2, Errors: 23, Skipped: 38

[INFO] ------------------------------------------------------------------------
[INFO] Reactor Summary:
[INFO] 
[INFO] Apache HBase ...................................... SUCCESS [1:03.122s]
[INFO] Apache HBase - Checkstyle ......................... SUCCESS [7.867s]
[INFO] Apache HBase - Resource Bundle .................... SUCCESS [0.490s]
[INFO] Apache HBase - Annotations ........................ SUCCESS [3.003s]
[INFO] Apache HBase - Protocol ........................... SUCCESS [40.997s]
[INFO] Apache HBase - Common ............................. SUCCESS [4:05.365s]
[INFO] Apache HBase - Procedure .......................... SUCCESS [4:34.481s]
[INFO] Apache HBase - Client ............................. SUCCESS [2:11.531s]
[INFO] Apache HBase - Hadoop Compatibility ............... SUCCESS [13.301s]
[INFO] Apache HBase - Hadoop Two Compatibility ........... SUCCESS [20.806s]
[INFO] Apache HBase - Prefix Tree ........................ SUCCESS [26.288s]
[INFO] Apache HBase - Server ............................. FAILURE [2:48:59.030s]
[INFO] Apache HBase - Testing Util ....................... SKIPPED
[INFO] Apache HBase - Thrift ............................. SKIPPED
[INFO] Apache HBase - Rest ............................... SKIPPED
[INFO] Apache HBase - Shell .............................. SKIPPED
[INFO] Apache HBase - Integration Tests .................. SKIPPED
[INFO] Apache HBase - Examples ........................... SKIPPED
[INFO] Apache HBase - External Block Cache ............... SKIPPED
[INFO] Apache HBase - Assembly ........................... SKIPPED
[INFO] Apache HBase - Shaded ............................. SKIPPED
[INFO] Apache HBase - Shaded - Client .................... SKIPPED
[INFO] Apache HBase - Shaded - Server .................... SKIPPED
[INFO] ------------------------------------------------------------------------
[INFO] BUILD FAILURE
[INFO] ------------------------------------------------------------------------
[INFO] Total time: 3:03:08.345s
[INFO] Finished at: Tue Dec 22 07:25:01 UTC 2015
[INFO] Final Memory: 492M/2888M
[INFO] ------------------------------------------------------------------------
[ERROR] Failed to execute goal org.apache.maven.plugins:maven-surefire-plugin:2.18.1:test
(secondPartTestsExecution) on project hbase-server: ExecutionException: java.lang.RuntimeException:
There was an error in the forked process
[ERROR] java.lang.ArrayIndexOutOfBoundsException: 1
[ERROR] at org.apache.maven.surefire.common.junit4.JUnit4ProviderUtil.generateFailingTests(JUnit4ProviderUtil.java:64)
[ERROR] at org.apache.maven.surefire.junitcore.JUnitCoreProvider.invoke(JUnitCoreProvider.java:151)
[ERROR] at org.apache.maven.surefire.booter.ForkedBooter.invokeProviderInSameClassLoader(ForkedBooter.java:203)
[ERROR] at org.apache.maven.surefire.booter.ForkedBooter.runSuitesInProcess(ForkedBooter.java:155)
[ERROR] at org.apache.maven.surefire.booter.ForkedBooter.main(ForkedBooter.java:103)
[ERROR] -> [Help 1]
[ERROR] 
[ERROR] To see the full stack trace of the errors, re-run Maven with the -e switch.
[ERROR] Re-run Maven using the -X switch to enable full debug logging.
[ERROR] 
[ERROR] For more information about the errors and possible solutions, please read the following
articles:
[ERROR] [Help 1] http://cwiki.apache.org/confluence/display/MAVEN/MojoFailureException
[ERROR] 
[ERROR] After correcting the problems, you can resume the build with the command
[ERROR]   mvn <goals> -rf :hbase-server
Build step 'Invoke top-level Maven targets' marked build as failure
Performing Post build task...
Match found for :.* : True
Logical operation result is TRUE
Running script  : # Post-build task script. TODO: Check this in and have all builds reference
check-in.
pwd && ls
# NOTE!!!! The below code has been copied and pasted from ./dev-tools/run-test.sh
# Do not change here without syncing there and vice-versa.
ZOMBIE_TESTS_COUNT=`jps -v | grep surefirebooter | grep -e '-Dhbase.test' | wc -l`
if [[ $ZOMBIE_TESTS_COUNT != 0 ]] ; then
 echo "Suspicious java process found - waiting 30s to see if there are just slow to stop"
 sleep 30
 ZOMBIE_TESTS_COUNT=`jps -v | grep surefirebooter | grep -e '-Dhbase.test' | wc -l`
 if [[ $ZOMBIE_TESTS_COUNT != 0 ]] ; then
   echo " {color:red}There appear to be $ZOMBIE_TESTS_COUNT zombie tests{color}, they should
have been killed by surefire but survived"
   jps -v | grep surefirebooter | grep -e '-Dhbase.test'
   jps -v | grep surefirebooter | grep -e '-Dhbase.test' | cut -d ' ' -f 1 | xargs -n 1 jstack
   # Exit with error
   exit 1
 else
   echo "We're ok: there is no zombie test, but some tests took some time to stop"
 fi
else
  echo "We're ok: there is no zombie test"
fi
[Hadoop] $ /bin/bash -xe /tmp/hudson3739392607289051382.sh
+ pwd
<https://builds.apache.org/job/HBase-1.3/jdk=latest1.8,label=Hadoop/ws/>
+ ls
bin
CHANGES.txt
conf
dev-support
hbase-annotations
hbase-assembly
hbase-checkstyle
hbase-client
hbase-common
hbase-examples
hbase-external-blockcache
hbase-hadoop2-compat
hbase-hadoop-compat
hbase-it
hbase-native-client
hbase-prefix-tree
hbase-procedure
hbase-protocol
hbase-resource-bundle
hbase-rest
hbase-server
hbase-shaded
hbase-shell
hbase-testing-util
hbase-thrift
LICENSE.txt
NOTICE.txt
pom.xml
README.txt
src
target
++ wc -l
++ grep -e -Dhbase.test
++ grep surefirebooter
++ jps -v
+ ZOMBIE_TESTS_COUNT=0
+ [[ 0 != 0 ]]
+ echo 'We'\''re ok: there is no zombie test'
We're ok: there is no zombie test
POST BUILD TASK : SUCCESS
END OF POST BUILD TASK : 0
Archiving artifacts
Recording test results

Mime
View raw message