hbase-builds mailing list archives

Site index · List index
Message view « Date » · « Thread »
Top « Date » · « Thread »
From Apache Jenkins Server <jenk...@builds.apache.org>
Subject Build failed in Jenkins: HBase-1.3-IT » IntegrationTestBigLinkedList,latest1.8,Hadoop #363
Date Thu, 10 Dec 2015 04:05:05 GMT
See <https://builds.apache.org/job/HBase-1.3-IT/it.test=IntegrationTestBigLinkedList,jdk=latest1.8,label=Hadoop/363/changes>

Changes:

[eclark] HBASE-14942 Allow turning off BoundedByteBufferPool

[eclark] HBASE-14851 Add test showing how to use per put TTL from thrift

[Gary Helmling] HBASE-14866 VerifyReplication and ReplicationAdmin should use full peer

------------------------------------------
[...truncated 2315 lines...]
     bool UseCountTrailingZerosInstruction          = false                              
{ARCH product}
     bool UseCounterDecay                           = true                               
{product}
     bool UseDivMod                                 = true                               
{C2 product}
     bool UseDynamicNumberOfGCThreads               = false                              
{product}
     bool UseFPUForSpilling                         = true                               
{C2 product}
     bool UseFastAccessorMethods                    = false                              
{product}
     bool UseFastEmptyMethods                       = false                              
{product}
     bool UseFastJNIAccessors                       = true                               
{product}
     bool UseFastStosb                              = false                              
{ARCH product}
     bool UseG1GC                                   = false                              
{product}
     bool UseGCLogFileRotation                      = false                              
{product}
     bool UseGCOverheadLimit                        = true                               
{product}
     bool UseGCTaskAffinity                         = false                              
{product}
     bool UseHeavyMonitors                          = false                              
{product}
     bool UseHugeTLBFS                              = false                              
{product}
     bool UseInlineCaches                           = true                               
{product}
     bool UseInterpreter                            = true                               
{product}
     bool UseJumpTables                             = true                               
{C2 product}
     bool UseLWPSynchronization                     = true                               
{product}
     bool UseLargePages                             = false                              
{pd product}
     bool UseLargePagesInMetaspace                  = false                              
{product}
     bool UseLargePagesIndividualAllocation         = false                              
{pd product}
     bool UseLinuxPosixThreadCPUClocks              = true                               
{product}
     bool UseLockedTracing                          = false                              
{product}
     bool UseLoopCounter                            = true                               
{product}
     bool UseLoopInvariantCodeMotion                = true                               
{C1 product}
     bool UseLoopPredicate                          = true                               
{C2 product}
     bool UseMathExactIntrinsics                    = true                               
{C2 product}
     bool UseMaximumCompactionOnSystemGC            = true                               
{product}
     bool UseMembar                                 = false                              
{pd product}
     bool UseMultiplyToLenIntrinsic                 = true                               
{C2 product}
     bool UseNUMA                                   = false                              
{product}
     bool UseNUMAInterleaving                       = false                              
{product}
     bool UseNewLongLShift                          = false                              
{ARCH product}
     bool UseOSErrorReporting                       = false                              
{pd product}
     bool UseOldInlining                            = true                               
{C2 product}
     bool UseOnStackReplacement                     = true                               
{pd product}
     bool UseOnlyInlinedBimorphic                   = true                               
{C2 product}
     bool UseOprofile                               = false                              
{product}
     bool UseOptoBiasInlining                       = true                               
{C2 product}
     bool UsePSAdaptiveSurvivorSizePolicy           = true                               
{product}
     bool UseParNewGC                               = false                              
{product}
     bool UseParallelGC                            := true                               
{product}
     bool UseParallelOldGC                          = true                               
{product}
     bool UsePerfData                               = true                               
{product}
     bool UsePopCountInstruction                    = true                               
{product}
     bool UseRDPCForConstantTableBase               = false                              
{C2 product}
     bool UseRTMDeopt                               = false                              
{ARCH product}
     bool UseRTMLocking                             = false                              
{ARCH product}
     bool UseSHA                                    = false                              
{product}
     bool UseSHA1Intrinsics                         = false                              
{product}
     bool UseSHA256Intrinsics                       = false                              
{product}
     bool UseSHA512Intrinsics                       = false                              
{product}
     bool UseSHM                                    = false                              
{product}
     intx UseSSE                                    = 4                                  
{product}
     bool UseSSE42Intrinsics                        = true                               
{product}
     bool UseSerialGC                               = false                              
{product}
     bool UseSharedSpaces                           = false                              
{product}
     bool UseSignalChaining                         = true                               
{product}
     bool UseStoreImmI16                            = false                              
{ARCH product}
     bool UseStringDeduplication                    = false                              
{product}
     bool UseSuperWord                              = true                               
{C2 product}
     bool UseTLAB                                   = true                               
{pd product}
     bool UseThreadPriorities                       = true                               
{pd product}
     bool UseTransparentHugePages                   = false                              
{product}
     bool UseTypeProfile                            = true                               
{product}
     bool UseTypeSpeculation                        = true                               
{C2 product}
     bool UseUnalignedLoadStores                    = true                               
{ARCH product}
     bool UseVMInterruptibleIO                      = false                              
{product}
     bool UseXMMForArrayCopy                        = true                               
{product}
     bool UseXmmI2D                                 = false                              
{ARCH product}
     bool UseXmmI2F                                 = false                              
{ARCH product}
     bool UseXmmLoadAndClearUpper                   = true                               
{ARCH product}
     bool UseXmmRegToRegMoveAll                     = true                               
{ARCH product}
     bool VMThreadHintNoPreempt                     = false                              
{product}
     intx VMThreadPriority                          = -1                                 
{product}
     intx VMThreadStackSize                         = 1024                               
{pd product}
     intx ValueMapInitialSize                       = 11                                 
{C1 product}
     intx ValueMapMaxLoopSize                       = 8                                  
{C1 product}
     intx ValueSearchLimit                          = 1000                               
{C2 product}
     bool VerifyMergedCPBytecodes                   = true                               
{product}
     bool VerifySharedSpaces                        = false                              
{product}
     intx WorkAroundNPTLTimedWaitHang               = 1                                  
{product}
    uintx YoungGenerationSizeIncrement              = 20                                 
{product}
    uintx YoungGenerationSizeSupplement             = 80                                 
{product}
    uintx YoungGenerationSizeSupplementDecay        = 8                                  
{product}
    uintx YoungPLABSize                             = 4096                               
{product}
     bool ZeroTLAB                                  = false                              
{product}
     intx hashCode                                  = 5                                  
{product}
Running org.apache.hadoop.hbase.test.IntegrationTestBigLinkedList
SUREFIRE-859: [GC (Allocation Failure)  193536K->67177K(741888K), 0.2079085 secs]
SUREFIRE-859: [GC (Metadata GC Threshold)  108072K->43267K(935424K), 0.0165015 secs]
SUREFIRE-859: [Full GC (Metadata GC Threshold)  43267K->8262K(702464K), 0.0421139 secs]
SUREFIRE-859: [GC (Allocation Failure)  388933K->87709K(702464K), 0.1338686 secs]
SUREFIRE-859: [GC (Metadata GC Threshold)  151355K->106564K(1019904K), 0.0651085 secs]
SUREFIRE-859: [Full GC (Metadata GC Threshold)  106564K->93906K(1189376K), 0.1376789 secs]
SUREFIRE-859: [GC (Metadata GC Threshold)  708608K->140676K(1189376K), 0.0528099 secs]
SUREFIRE-859: [Full GC (Metadata GC Threshold)  140676K->137045K(1291264K), 0.2186171 secs]
SUREFIRE-859: [GC (Allocation Failure)  841557K->173614K(1720320K), 0.0604345 secs]
SUREFIRE-859: [GC (Allocation Failure)  1293870K->292775K(1759744K), 0.0844935 secs]
SUREFIRE-859: [GC (Allocation Failure)  1413031K->440886K(1686528K), 0.2519979 secs]
SUREFIRE-859: [GC (Allocation Failure)  1439286K->621114K(1752576K), 0.2047973 secs]
SUREFIRE-859: [GC (Allocation Failure)  1619514K->781646K(1468928K), 0.3259159 secs]
SUREFIRE-859: [Full GC (Ergonomics)  781646K->561852K(2034688K), 0.7082339 secs]
SUREFIRE-859: [GC (Allocation Failure)  1247932K->685627K(2190848K), 0.0676845 secs]
SUREFIRE-859: [GC (Allocation Failure)  1371707K->804131K(2136576K), 0.2470414 secs]
SUREFIRE-859: [GC (Allocation Failure)  1510691K->878430K(2173952K), 0.2760910 secs]
SUREFIRE-859: [GC (Allocation Failure)  1583995K->1068128K(2208256K), 0.4058839 secs]
SUREFIRE-859: [GC (Allocation Failure)  1840736K->1330258K(2224128K), 0.1603356 secs]
SUREFIRE-859: [Full GC (Ergonomics)  1330258K->945789K(2728960K), 0.9144477 secs]
SUREFIRE-859: [GC (Allocation Failure)  1718397K->1103116K(2738176K), 0.1146922 secs]
SUREFIRE-859: [GC (Allocation Failure)  1885964K->1206782K(2738688K), 0.1170511 secs]
SUREFIRE-859: [GC (Allocation Failure)  1989620K->1285542K(2745344K), 0.1276256 secs]
SUREFIRE-859: [GC (Allocation Failure)  2083750K->1352687K(2743808K), 0.2186833 secs]
SUREFIRE-859: [GC (Allocation Failure)  2150895K->1464220K(2738688K), 0.1239251 secs]
SUREFIRE-859: [GC (Allocation Failure)  2281372K->1641478K(2746880K), 0.2492113 secs]
SUREFIRE-859: [Full GC (Ergonomics)  1641478K->415907K(2263040K), 0.6759568 secs]
SUREFIRE-859: [GC (Allocation Failure)  1233026K->486725K(2278912K), 0.0664773 secs]
SUREFIRE-859: [GC (Allocation Failure)  1331013K->537470K(2284544K), 0.0560191 secs]
SUREFIRE-859: [GC (Allocation Failure)  1381758K->535727K(2293760K), 0.0373011 secs]
SUREFIRE-859: [GC (Allocation Failure)  1386671K->538002K(2028032K), 0.0331230 secs]
SUREFIRE-859: [GC (Allocation Failure)  1388946K->556198K(2300416K), 0.1268511 secs]
SUREFIRE-859: [GC (Allocation Failure)  1415786K->557389K(2056192K), 0.0512426 secs]
SUREFIRE-859: [GC (Allocation Failure)  1417037K->559272K(2298368K), 0.0719864 secs]

Results :

Tests run: 0, Failures: 0, Errors: 0, Skipped: 0

[WARNING] File encoding has not been set, using platform encoding UTF-8, i.e. build is platform
dependent! The file encoding for reports output files should be provided by the POM property
${project.reporting.outputEncoding}.
[INFO] 
[INFO] --- maven-failsafe-plugin:2.18.1:verify (verify) @ hbase-it ---
[INFO] Failsafe report directory: <https://builds.apache.org/job/HBase-1.3-IT/it.test=IntegrationTestBigLinkedList,jdk=latest1.8,label=Hadoop/ws/hbase-it/target/failsafe-reports>
[WARNING] File encoding has not been set, using platform encoding UTF-8, i.e. build is platform
dependent! The file encoding for reports output files should be provided by the POM property
${project.reporting.outputEncoding}.
[INFO] ------------------------------------------------------------------------
[INFO] Reactor Summary:
[INFO] 
[INFO] Apache HBase ...................................... SUCCESS [4.607s]
[INFO] Apache HBase - Checkstyle ......................... SUCCESS [1.478s]
[INFO] Apache HBase - Resource Bundle .................... SUCCESS [0.427s]
[INFO] Apache HBase - Annotations ........................ SUCCESS [1.692s]
[INFO] Apache HBase - Protocol ........................... SUCCESS [16.894s]
[INFO] Apache HBase - Common ............................. SUCCESS [13.665s]
[INFO] Apache HBase - Procedure .......................... SUCCESS [2.100s]
[INFO] Apache HBase - Client ............................. SUCCESS [8.316s]
[INFO] Apache HBase - Hadoop Compatibility ............... SUCCESS [0.564s]
[INFO] Apache HBase - Hadoop Two Compatibility ........... SUCCESS [1.389s]
[INFO] Apache HBase - Prefix Tree ........................ SUCCESS [1.508s]
[INFO] Apache HBase - Server ............................. SUCCESS [41.590s]
[INFO] Apache HBase - Testing Util ....................... SUCCESS [1.981s]
[INFO] Apache HBase - Thrift ............................. SUCCESS [6.717s]
[INFO] Apache HBase - Rest ............................... SUCCESS [3.544s]
[INFO] Apache HBase - Shell .............................. SUCCESS [1.146s]
[INFO] Apache HBase - Integration Tests .................. FAILURE [30:03.842s]
[INFO] Apache HBase - Examples ........................... SKIPPED
[INFO] Apache HBase - External Block Cache ............... SKIPPED
[INFO] Apache HBase - Assembly ........................... SKIPPED
[INFO] Apache HBase - Shaded ............................. SKIPPED
[INFO] Apache HBase - Shaded - Client .................... SKIPPED
[INFO] Apache HBase - Shaded - Server .................... SKIPPED
[INFO] ------------------------------------------------------------------------
[INFO] BUILD FAILURE
[INFO] ------------------------------------------------------------------------
[INFO] Total time: 31:53.655s
[INFO] Finished at: Thu Dec 10 04:04:59 UTC 2015
[INFO] Final Memory: 176M/2875M
[INFO] ------------------------------------------------------------------------
[ERROR] Failed to execute goal org.apache.maven.plugins:maven-failsafe-plugin:2.18.1:verify
(verify) on project hbase-it: There was a timeout or other error in the fork -> [Help 1]
[ERROR] 
[ERROR] To see the full stack trace of the errors, re-run Maven with the -e switch.
[ERROR] Re-run Maven using the -X switch to enable full debug logging.
[ERROR] 
[ERROR] For more information about the errors and possible solutions, please read the following
articles:
[ERROR] [Help 1] http://cwiki.apache.org/confluence/display/MAVEN/MojoFailureException
[ERROR] 
[ERROR] After correcting the problems, you can resume the build with the command
[ERROR]   mvn <goals> -rf :hbase-it
Build step 'Invoke top-level Maven targets' marked build as failure
Performing Post build task...
Match found for :.* : True
Logical operation result is TRUE
Running script  : # Post-build task script. TODO: Check this in and have all builds reference
check-in.
pwd && ls
# NOTE!!!! The below code has been copied and pasted from ./dev-tools/run-test.sh
# Do not change here without syncing there and vice-versa.
ZOMBIE_TESTS_COUNT=`jps -v | grep surefirebooter | grep -e '-Dhbase.test' | wc -l`
if [[ $ZOMBIE_TESTS_COUNT != 0 ]] ; then
 echo "Suspicious java process found - waiting 30s to see if there are just slow to stop"
 sleep 30
 ZOMBIE_TESTS_COUNT=`jps -v | grep surefirebooter | grep -e '-Dhbase.test' | wc -l`
 if [[ $ZOMBIE_TESTS_COUNT != 0 ]] ; then
   echo " {color:red}There appear to be $ZOMBIE_TESTS_COUNT zombie tests{color}, they should
have been killed by surefire but survived"
   jps -v | grep surefirebooter | grep -e '-Dhbase.test'
   jps -v | grep surefirebooter | grep -e '-Dhbase.test' | cut -d ' ' -f 1 | xargs -n 1 jstack
   # Exit with error
   exit 1
 else
   echo "We're ok: there is no zombie test, but some tests took some time to stop"
 fi
else
  echo "We're ok: there is no zombie test"
fi
[Hadoop] $ /bin/bash -xe /tmp/hudson2392218630410255755.sh
+ pwd
<https://builds.apache.org/job/HBase-1.3-IT/it.test=IntegrationTestBigLinkedList,jdk=latest1.8,label=Hadoop/ws/>
+ ls
bin
CHANGES.txt
conf
dev-support
hbase-annotations
hbase-assembly
hbase-checkstyle
hbase-client
hbase-common
hbase-examples
hbase-external-blockcache
hbase-hadoop2-compat
hbase-hadoop-compat
hbase-it
hbase-native-client
hbase-prefix-tree
hbase-procedure
hbase-protocol
hbase-resource-bundle
hbase-rest
hbase-server
hbase-shaded
hbase-shell
hbase-spark
hbase-testing-util
hbase-thrift
LICENSE.txt
NOTICE.txt
pom.xml
README.txt
src
target
++ jps -v
++ grep surefirebooter
++ grep -e -Dhbase.test
++ wc -l
+ ZOMBIE_TESTS_COUNT=0
+ [[ 0 != 0 ]]
+ echo 'We'\''re ok: there is no zombie test'
We're ok: there is no zombie test
POST BUILD TASK : SUCCESS
END OF POST BUILD TASK : 0
Archiving artifacts

Mime
View raw message