hbase-builds mailing list archives

Site index · List index
Message view « Date » · « Thread »
Top « Date » · « Thread »
From Apache Jenkins Server <jenk...@builds.apache.org>
Subject Build failed in Jenkins: HBase-1.3-IT » IntegrationTestBigLinkedList,latest1.8,Hadoop #356
Date Sat, 05 Dec 2015 02:15:09 GMT
See <https://builds.apache.org/job/HBase-1.3-IT/it.test=IntegrationTestBigLinkedList,jdk=latest1.8,label=Hadoop/356/changes>

Changes:

[eclark] HBASE-14922 Delayed flush doesn't work causing flush storms.

------------------------------------------
[...truncated 2372 lines...]
     bool UseSignalChaining                         = true                               
{product}
     bool UseStoreImmI16                            = false                              
{ARCH product}
     bool UseStringDeduplication                    = false                              
{product}
     bool UseSuperWord                              = true                               
{C2 product}
     bool UseTLAB                                   = true                               
{pd product}
     bool UseThreadPriorities                       = true                               
{pd product}
     bool UseTransparentHugePages                   = false                              
{product}
     bool UseTypeProfile                            = true                               
{product}
     bool UseTypeSpeculation                        = true                               
{C2 product}
     bool UseUnalignedLoadStores                    = true                               
{ARCH product}
     bool UseVMInterruptibleIO                      = false                              
{product}
     bool UseXMMForArrayCopy                        = true                               
{product}
     bool UseXmmI2D                                 = false                              
{ARCH product}
     bool UseXmmI2F                                 = false                              
{ARCH product}
     bool UseXmmLoadAndClearUpper                   = true                               
{ARCH product}
     bool UseXmmRegToRegMoveAll                     = true                               
{ARCH product}
     bool VMThreadHintNoPreempt                     = false                              
{product}
     intx VMThreadPriority                          = -1                                 
{product}
     intx VMThreadStackSize                         = 1024                               
{pd product}
     intx ValueMapInitialSize                       = 11                                 
{C1 product}
     intx ValueMapMaxLoopSize                       = 8                                  
{C1 product}
     intx ValueSearchLimit                          = 1000                               
{C2 product}
     bool VerifyMergedCPBytecodes                   = true                               
{product}
     bool VerifySharedSpaces                        = false                              
{product}
     intx WorkAroundNPTLTimedWaitHang               = 1                                  
{product}
    uintx YoungGenerationSizeIncrement              = 20                                 
{product}
    uintx YoungGenerationSizeSupplement             = 80                                 
{product}
    uintx YoungGenerationSizeSupplementDecay        = 8                                  
{product}
    uintx YoungPLABSize                             = 4096                               
{product}
     bool ZeroTLAB                                  = false                              
{product}
     intx hashCode                                  = 5                                  
{product}
Running org.apache.hadoop.hbase.test.IntegrationTestBigLinkedList
SUREFIRE-859: [GC (Allocation Failure)  193536K->67180K(741888K), 0.2085987 secs]
SUREFIRE-859: [GC (Metadata GC Threshold)  107613K->43102K(935424K), 0.0277305 secs]
SUREFIRE-859: [Full GC (Metadata GC Threshold)  43102K->8246K(708608K), 0.0607151 secs]
SUREFIRE-859: [GC (Allocation Failure)  395318K->106644K(708608K), 1.1790039 secs]
SUREFIRE-859: [GC (Metadata GC Threshold)  119561K->106847K(1056256K), 0.1674938 secs]
SUREFIRE-859: [Full GC (Metadata GC Threshold)  106847K->92067K(1209856K), 0.3181440 secs]
SUREFIRE-859: [GC (Allocation Failure)  826787K->115261K(1209856K), 0.0463339 secs]
SUREFIRE-859: [GC (Allocation Failure)  849981K->100045K(1729024K), 0.0297631 secs]
SUREFIRE-859: [GC (Allocation Failure)  1273549K->99564K(1624064K), 0.0919315 secs]
SUREFIRE-859: [GC (Allocation Failure)  1273068K->99439K(1728512K), 0.0215440 secs]
SUREFIRE-859: [GC (Allocation Failure)  1276527K->99346K(1724928K), 0.0519155 secs]
SUREFIRE-859: [GC (Allocation Failure)  1276434K->99210K(1732608K), 0.0220015 secs]
SUREFIRE-859: [GC (Allocation Failure)  1286026K->99442K(1730048K), 0.0518191 secs]
SUREFIRE-859: [GC (Allocation Failure)  1286258K->99434K(1736704K), 0.0548515 secs]
SUREFIRE-859: [GC (Allocation Failure)  1297514K->99658K(1734656K), 0.0564908 secs]
SUREFIRE-859: [GC (Allocation Failure)  1297738K->99634K(1743360K), 0.0170232 secs]
SUREFIRE-859: [GC (Allocation Failure)  1311538K->99570K(1740800K), 0.0140429 secs]
SUREFIRE-859: [GC (Allocation Failure)  1311474K->99730K(1750528K), 0.0212371 secs]
SUREFIRE-859: [GC (Allocation Failure)  1326994K->99634K(1747968K), 0.0240264 secs]
SUREFIRE-859: [GC (Allocation Failure)  1326898K->99802K(1758720K), 0.0163948 secs]
SUREFIRE-859: [GC (Allocation Failure)  1343450K->99834K(1756160K), 0.0166593 secs]
SUREFIRE-859: [GC (Allocation Failure)  1343482K->99778K(1766912K), 0.0234626 secs]
SUREFIRE-859: [GC (Allocation Failure)  1359810K->99882K(1764352K), 0.0259457 secs]
SUREFIRE-859: [GC (Allocation Failure)  1359914K->99986K(1775616K), 0.0140737 secs]
SUREFIRE-859: [GC (Allocation Failure)  1375890K->99954K(1773056K), 0.0210564 secs]
SUREFIRE-859: [GC (Allocation Failure)  1375858K->100090K(1783296K), 0.1671420 secs]
SUREFIRE-859: [GC (Allocation Failure)  1389818K->100058K(1780224K), 0.0112697 secs]
SUREFIRE-859: [GC (Allocation Failure)  1389786K->100026K(1789952K), 0.0554622 secs]
SUREFIRE-859: [GC (Allocation Failure)  1402554K->100026K(1786880K), 0.0397128 secs]
SUREFIRE-859: [GC (Allocation Failure)  1402554K->100130K(1795584K), 0.0250881 secs]
SUREFIRE-859: [GC (Allocation Failure)  1414434K->100246K(1793024K), 0.0826202 secs]
SUREFIRE-859: [GC (Allocation Failure)  1414550K->100294K(1801728K), 0.0154279 secs]
SUREFIRE-859: [GC (Allocation Failure)  1425862K->100246K(1799680K), 0.0124567 secs]
SUREFIRE-859: [GC (Allocation Failure)  1425814K->100374K(1806848K), 0.0138579 secs]
SUREFIRE-859: [GC (Allocation Failure)  1435670K->100430K(1804800K), 0.0128488 secs]
SUREFIRE-859: [GC (Allocation Failure)  1435726K->100486K(1811968K), 0.0227922 secs]
SUREFIRE-859: [GC (Allocation Failure)  1444998K->100422K(1810432K), 0.0473163 secs]
SUREFIRE-859: [GC (Allocation Failure)  1444934K->100494K(1816064K), 0.0215050 secs]
SUREFIRE-859: [GC (Allocation Failure)  1452174K->100598K(1814528K), 0.0232274 secs]
SUREFIRE-859: [GC (Allocation Failure)  1452278K->100574K(1819136K), 0.0291136 secs]
SUREFIRE-859: [GC (Allocation Failure)  1458398K->100638K(1817600K), 0.0131817 secs]
SUREFIRE-859: [GC (Allocation Failure)  1458462K->100590K(1822208K), 0.0292974 secs]
SUREFIRE-859: [GC (Allocation Failure)  1464046K->100598K(1821184K), 0.0701114 secs]
2015-12-05 01:53:01\2C329 ERROR [asf900.gq1.ygridcore.net\2C41811\2C1449280261016_ChoreService_225587]
server.NIOServerCnxnFactory$1(44): Thread Thread[asf900.gq1.ygridcore.net\2C41811\2C1449280261016_ChoreService_225587\2C5\2Cmain]
died\0Ajava.lang.IllegalArgumentException: bound must be greater than origin\0A\09at java.util.concurrent.ThreadLocalRandom.nextLong(ThreadLocalRandom.java:430)\0A\09at
org.apache.hadoop.hbase.JitterScheduledThreadPoolExecutorImpl$JitteredRunnableScheduledFuture.getDelay(JitterScheduledThreadPoolExecutorImpl.java:81)\0A\09at
java.util.concurrent.ScheduledThreadPoolExecutor$DelayedWorkQueue.take(ScheduledThreadPoolExecutor.java:1083)\0A\09at
java.util.concurrent.ScheduledThreadPoolExecutor$DelayedWorkQueue.take(ScheduledThreadPoolExecutor.java:809)\0A\09at
java.util.concurrent.ThreadPoolExecutor.getTask(ThreadPoolExecutor.java:1067)\0A\09at java.util.concurrent.ThreadPoolExecutor.runWorker(ThreadPoolExecutor.java:1127)\0A\09at
java.util.concurrent.ThreadPoolExecutor$Worker.run(ThreadPoolExecutor.java:617)\0A\09at java.lang.Thread.run(Thread.java:745)\0A
SUREFIRE-859: [GC (Allocation Failure)  1468734K->100734K(1823744K), 0.0751542 secs]
SUREFIRE-859: [GC (Allocation Failure)  1468798K->100830K(1826816K), 0.0118051 secs]
2015-12-05 01:53:10\2C018 ERROR [asf900.gq1.ygridcore.net\2C41811\2C1449280261016_ChoreService_242874]
server.NIOServerCnxnFactory$1(44): Thread Thread[asf900.gq1.ygridcore.net\2C41811\2C1449280261016_ChoreService_242874\2C5\2Cmain]
died\0Ajava.lang.IllegalArgumentException: bound must be greater than origin\0A\09at java.util.concurrent.ThreadLocalRandom.nextLong(ThreadLocalRandom.java:430)\0A\09at
org.apache.hadoop.hbase.JitterScheduledThreadPoolExecutorImpl$JitteredRunnableScheduledFuture.getDelay(JitterScheduledThreadPoolExecutorImpl.java:81)\0A\09at
java.util.concurrent.ScheduledThreadPoolExecutor$DelayedWorkQueue.take(ScheduledThreadPoolExecutor.java:1083)\0A\09at
java.util.concurrent.ScheduledThreadPoolExecutor$DelayedWorkQueue.take(ScheduledThreadPoolExecutor.java:809)\0A\09at
java.util.concurrent.ThreadPoolExecutor.getTask(ThreadPoolExecutor.java:1067)\0A\09at java.util.concurrent.ThreadPoolExecutor.runWorker(ThreadPoolExecutor.java:1127)\0A\09at
java.util.concurrent.ThreadPoolExecutor$Worker.run(ThreadPoolExecutor.java:617)\0A\09at java.lang.Thread.run(Thread.java:745)\0A
SUREFIRE-859: [GC (Allocation Failure)  1472950K->101030K(1828864K), 0.2007033 secs]
SUREFIRE-859: [GC (Allocation Failure)  1477286K->100942K(1828352K), 0.0156467 secs]
SUREFIRE-859: [GC (Allocation Failure)  1477198K->101070K(1830400K), 0.0388189 secs]
SUREFIRE-859: [GC (Allocation Failure)  1480910K->100974K(1830400K), 0.0498024 secs]
SUREFIRE-859: [GC (Allocation Failure)  1480814K->101006K(1832448K), 0.0513459 secs]
SUREFIRE-859: [GC (Allocation Failure)  1483918K->101054K(1832448K), 0.0809142 secs]
SUREFIRE-859: [GC (Allocation Failure)  1483966K->101086K(1833472K), 0.0240348 secs]
SUREFIRE-859: [GC (Allocation Failure)  1486046K->101142K(1833472K), 0.0202051 secs]
SUREFIRE-859: [GC (Allocation Failure)  1486102K->101222K(1833984K), 0.0125333 secs]
SUREFIRE-859: [GC (Allocation Failure)  1487718K->101246K(1834496K), 0.0137652 secs]
SUREFIRE-859: [GC (Allocation Failure)  1487742K->101206K(1834496K), 0.0419202 secs]
SUREFIRE-859: [GC (Allocation Failure)  1489238K->101206K(1835008K), 0.0590521 secs]
SUREFIRE-859: [GC (Allocation Failure)  1489238K->101294K(1835520K), 0.0293637 secs]
SUREFIRE-859: [GC (Allocation Failure)  1490862K->101302K(1836032K), 0.0132159 secs]
SUREFIRE-859: [GC (Allocation Failure)  1490870K->101342K(1836032K), 0.0369237 secs]
SUREFIRE-859: [GC (Allocation Failure)  1491934K->101438K(1836544K), 0.0230030 secs]
SUREFIRE-859: [GC (Allocation Failure)  1492030K->101462K(1837568K), 0.0149488 secs]
SUREFIRE-859: [GC (Allocation Failure)  1493078K->101374K(1835008K), 0.0393686 secs]
SUREFIRE-859: [GC (Allocation Failure)  1492990K->101638K(1837056K), 0.0173692 secs]
2015-12-05 01:54:10\2C613 ERROR [asf900.gq1.ygridcore.net\2C41811\2C1449280261016_ChoreService_360494]
server.NIOServerCnxnFactory$1(44): Thread Thread[asf900.gq1.ygridcore.net\2C41811\2C1449280261016_ChoreService_360494\2C5\2Cmain]
died\0Ajava.lang.IllegalArgumentException: bound must be greater than origin\0A\09at java.util.concurrent.ThreadLocalRandom.nextLong(ThreadLocalRandom.java:430)\0A\09at
org.apache.hadoop.hbase.JitterScheduledThreadPoolExecutorImpl$JitteredRunnableScheduledFuture.getDelay(JitterScheduledThreadPoolExecutorImpl.java:81)\0A\09at
java.util.concurrent.ScheduledThreadPoolExecutor$DelayedWorkQueue.take(ScheduledThreadPoolExecutor.java:1083)\0A\09at
java.util.concurrent.ScheduledThreadPoolExecutor$DelayedWorkQueue.take(ScheduledThreadPoolExecutor.java:809)\0A\09at
java.util.concurrent.ThreadPoolExecutor.getTask(ThreadPoolExecutor.java:1067)\0A\09at java.util.concurrent.ThreadPoolExecutor.runWorker(ThreadPoolExecutor.java:1127)\0A\09at
java.util.concurrent.ThreadPoolExecutor$Worker.run(ThreadPoolExecutor.java:617)\0A\09at java.lang.Thread.run(Thread.java:745)\0A
SUREFIRE-859: [GC (Allocation Failure)  1493118K->101598K(1837056K), 0.2143609 secs]
SUREFIRE-859: [GC (Allocation Failure)  1494238K->101638K(1837568K), 0.0135277 secs]
SUREFIRE-859: [GC (Allocation Failure)  1494278K->101606K(1838592K), 0.0193974 secs]
SUREFIRE-859: [GC (Allocation Failure)  1495270K->101854K(1838592K), 0.0158999 secs]
Tests run: 1, Failures: 0, Errors: 1, Skipped: 0, Time elapsed: 211.702 sec <<< FAILURE!
- in org.apache.hadoop.hbase.test.IntegrationTestBigLinkedList
testContinuousIngest(org.apache.hadoop.hbase.test.IntegrationTestBigLinkedList)  Time elapsed:
211.487 sec  <<< ERROR!
java.io.IOException: Shutting down
	at org.apache.hadoop.hbase.util.JVMClusterUtil.startup(JVMClusterUtil.java:225)
	at org.apache.hadoop.hbase.LocalHBaseCluster.startup(LocalHBaseCluster.java:447)
	at org.apache.hadoop.hbase.MiniHBaseCluster.init(MiniHBaseCluster.java:225)
	at org.apache.hadoop.hbase.MiniHBaseCluster.<init>(MiniHBaseCluster.java:94)
	at org.apache.hadoop.hbase.HBaseTestingUtility.startMiniHBaseCluster(HBaseTestingUtility.java:1056)
	at org.apache.hadoop.hbase.HBaseTestingUtility.startMiniCluster(HBaseTestingUtility.java:1016)
	at org.apache.hadoop.hbase.HBaseTestingUtility.startMiniCluster(HBaseTestingUtility.java:888)
	at org.apache.hadoop.hbase.HBaseTestingUtility.startMiniCluster(HBaseTestingUtility.java:870)
	at org.apache.hadoop.hbase.HBaseTestingUtility.startMiniCluster(HBaseTestingUtility.java:857)
	at org.apache.hadoop.hbase.IntegrationTestingUtility.initializeCluster(IntegrationTestingUtility.java:78)
	at org.apache.hadoop.hbase.test.IntegrationTestBigLinkedList.setUpCluster(IntegrationTestBigLinkedList.java:1550)


Results :

Tests in error: 
  IntegrationTestBigLinkedList>IntegrationTestBase.setUp:133->setUpCluster:1550 » IO

Tests run: 1, Failures: 0, Errors: 1, Skipped: 0

[WARNING] File encoding has not been set, using platform encoding ISO-8859-1, i.e. build is
platform dependent! The file encoding for reports output files should be provided by the POM
property ${project.reporting.outputEncoding}.
[INFO] 
[INFO] --- maven-failsafe-plugin:2.18.1:verify (verify) @ hbase-it ---
[INFO] Failsafe report directory: <https://builds.apache.org/job/HBase-1.3-IT/it.test=IntegrationTestBigLinkedList,jdk=latest1.8,label=Hadoop/ws/hbase-it/target/failsafe-reports>
[WARNING] File encoding has not been set, using platform encoding ISO-8859-1, i.e. build is
platform dependent! The file encoding for reports output files should be provided by the POM
property ${project.reporting.outputEncoding}.
[INFO] ------------------------------------------------------------------------
[INFO] Reactor Summary:
[INFO] 
[INFO] Apache HBase ...................................... SUCCESS [4.873s]
[INFO] Apache HBase - Checkstyle ......................... SUCCESS [1.542s]
[INFO] Apache HBase - Resource Bundle .................... SUCCESS [0.391s]
[INFO] Apache HBase - Annotations ........................ SUCCESS [2.189s]
[INFO] Apache HBase - Protocol ........................... SUCCESS [24.408s]
[INFO] Apache HBase - Common ............................. SUCCESS [12.987s]
[INFO] Apache HBase - Procedure .......................... SUCCESS [2.460s]
[INFO] Apache HBase - Client ............................. SUCCESS [9.086s]
[INFO] Apache HBase - Hadoop Compatibility ............... SUCCESS [0.426s]
[INFO] Apache HBase - Hadoop Two Compatibility ........... SUCCESS [1.755s]
[INFO] Apache HBase - Prefix Tree ........................ SUCCESS [1.895s]
[INFO] Apache HBase - Server ............................. SUCCESS [50.416s]
[INFO] Apache HBase - Testing Util ....................... SUCCESS [2.484s]
[INFO] Apache HBase - Thrift ............................. SUCCESS [9.608s]
[INFO] Apache HBase - Rest ............................... SUCCESS [4.675s]
[INFO] Apache HBase - Shell .............................. SUCCESS [1.434s]
[INFO] Apache HBase - Integration Tests .................. FAILURE [20:58.644s]
[INFO] Apache HBase - Examples ........................... SKIPPED
[INFO] Apache HBase - External Block Cache ............... SKIPPED
[INFO] Apache HBase - Assembly ........................... SKIPPED
[INFO] Apache HBase - Shaded ............................. SKIPPED
[INFO] Apache HBase - Shaded - Client .................... SKIPPED
[INFO] Apache HBase - Shaded - Server .................... SKIPPED
[INFO] ------------------------------------------------------------------------
[INFO] BUILD FAILURE
[INFO] ------------------------------------------------------------------------
[INFO] Total time: 23:12.001s
[INFO] Finished at: Sat Dec 05 02:11:46 UTC 2015
[INFO] Final Memory: 152M/3529M
[INFO] ------------------------------------------------------------------------
[ERROR] Failed to execute goal org.apache.maven.plugins:maven-failsafe-plugin:2.18.1:verify
(verify) on project hbase-it: There are test failures.
[ERROR] 
[ERROR] Please refer to <https://builds.apache.org/job/HBase-1.3-IT/it.test=IntegrationTestBigLinkedList,jdk=latest1.8,label=Hadoop/ws/hbase-it/target/failsafe-reports>
for the individual test results.
[ERROR] -> [Help 1]
[ERROR] 
[ERROR] To see the full stack trace of the errors, re-run Maven with the -e switch.
[ERROR] Re-run Maven using the -X switch to enable full debug logging.
[ERROR] 
[ERROR] For more information about the errors and possible solutions, please read the following
articles:
[ERROR] [Help 1] http://cwiki.apache.org/confluence/display/MAVEN/MojoFailureException
[ERROR] 
[ERROR] After correcting the problems, you can resume the build with the command
[ERROR]   mvn <goals> -rf :hbase-it
Build step 'Invoke top-level Maven targets' marked build as failure
Performing Post build task...
Match found for :.* : True
Logical operation result is TRUE
Running script  : # Post-build task script. TODO: Check this in and have all builds reference
check-in.
pwd && ls
# NOTE!!!! The below code has been copied and pasted from ./dev-tools/run-test.sh
# Do not change here without syncing there and vice-versa.
ZOMBIE_TESTS_COUNT=`jps -v | grep surefirebooter | grep -e '-Dhbase.test' | wc -l`
if [[ $ZOMBIE_TESTS_COUNT != 0 ]] ; then
 echo "Suspicious java process found - waiting 30s to see if there are just slow to stop"
 sleep 30
 ZOMBIE_TESTS_COUNT=`jps -v | grep surefirebooter | grep -e '-Dhbase.test' | wc -l`
 if [[ $ZOMBIE_TESTS_COUNT != 0 ]] ; then
   echo " {color:red}There appear to be $ZOMBIE_TESTS_COUNT zombie tests{color}, they should
have been killed by surefire but survived"
   jps -v | grep surefirebooter | grep -e '-Dhbase.test'
   jps -v | grep surefirebooter | grep -e '-Dhbase.test' | cut -d ' ' -f 1 | xargs -n 1 jstack
   # Exit with error
   exit 1
 else
   echo "We're ok: there is no zombie test, but some tests took some time to stop"
 fi
else
  echo "We're ok: there is no zombie test"
fi
[Hadoop] $ /bin/bash -xe /tmp/hudson9078046573893946114.sh
+ pwd
<https://builds.apache.org/job/HBase-1.3-IT/it.test=IntegrationTestBigLinkedList,jdk=latest1.8,label=Hadoop/ws/>
+ ls
bin
CHANGES.txt
conf
dev-support
hbase-annotations
hbase-assembly
hbase-checkstyle
hbase-client
hbase-common
hbase-examples
hbase-external-blockcache
hbase-hadoop2-compat
hbase-hadoop-compat
hbase-it
hbase-native-client
hbase-prefix-tree
hbase-procedure
hbase-protocol
hbase-resource-bundle
hbase-rest
hbase-server
hbase-shaded
hbase-shell
hbase-spark
hbase-testing-util
hbase-thrift
LICENSE.txt
NOTICE.txt
pom.xml
README.txt
src
target
++ jps -v
++ grep surefirebooter
++ grep -e -Dhbase.test
++ wc -l
+ ZOMBIE_TESTS_COUNT=0
+ [[ 0 != 0 ]]
+ echo 'We'\''re ok: there is no zombie test'
We're ok: there is no zombie test
POST BUILD TASK : SUCCESS
END OF POST BUILD TASK : 0
Archiving artifacts

Mime
View raw message