hbase-builds mailing list archives

Site index · List index
Message view « Date » · « Thread »
Top « Date » · « Thread »
From Apache Jenkins Server <jenk...@builds.apache.org>
Subject Build failed in Jenkins: HBase-1.3-IT » IntegrationTestBigLinkedList,latest1.7,Hadoop #353
Date Fri, 04 Dec 2015 03:22:25 GMT
See <https://builds.apache.org/job/HBase-1.3-IT/it.test=IntegrationTestBigLinkedList,jdk=latest1.7,label=Hadoop/353/changes>

Changes:

[tedyu] HBASE-14905 VerifyReplication does not honour versions option (Vishal

------------------------------------------
[...truncated 49109 lines...]
     bool UseFPUForSpilling                         = false           {C2 product}       

     bool UseFastAccessorMethods                    = false           {product}          

     bool UseFastEmptyMethods                       = false           {product}          

     bool UseFastJNIAccessors                       = true            {product}          

     bool UseFastStosb                              = false           {ARCH product}     

     bool UseG1GC                                   = false           {product}          

     bool UseGCLogFileRotation                      = false           {product}          

     bool UseGCOverheadLimit                        = true            {product}          

     bool UseGCTaskAffinity                         = false           {product}          

     bool UseHeavyMonitors                          = false           {product}          

     bool UseHugeTLBFS                              = false           {product}          

     bool UseInlineCaches                           = true            {product}          

     bool UseInterpreter                            = true            {product}          

     bool UseJumpTables                             = true            {C2 product}       

     bool UseLWPSynchronization                     = true            {product}          

     bool UseLargePages                             = false           {pd product}       

     bool UseLargePagesIndividualAllocation         = false           {pd product}       

     bool UseLinuxPosixThreadCPUClocks              = true            {product}          

     bool UseLockedTracing                          = false           {product}          

     bool UseLoopCounter                            = true            {product}          

     bool UseLoopPredicate                          = true            {C2 product}       

     bool UseMaximumCompactionOnSystemGC            = true            {product}          

     bool UseMembar                                 = false           {pd product}       

     bool UseNUMA                                   = false           {product}          

     bool UseNUMAInterleaving                       = false           {product}          

     bool UseNewLongLShift                          = false           {ARCH product}     

     bool UseOSErrorReporting                       = false           {pd product}       

     bool UseOldInlining                            = true            {C2 product}       

     bool UseOnStackReplacement                     = true            {pd product}       

     bool UseOnlyInlinedBimorphic                   = true            {C2 product}       

     bool UseOprofile                               = false           {product}          

     bool UseOptoBiasInlining                       = true            {C2 product}       

     bool UsePPCLWSYNC                              = true            {product}          

     bool UsePSAdaptiveSurvivorSizePolicy           = true            {product}          

     bool UseParNewGC                               = false           {product}          

     bool UseParallelGC                            := true            {product}          

     bool UseParallelOldGC                          = true            {product}          

     bool UsePerfData                               = true            {product}          

     bool UsePopCountInstruction                    = true            {product}          

     bool UseRDPCForConstantTableBase               = false           {C2 product}       

     bool UseSHM                                    = false           {product}          

     intx UseSSE                                    = 4               {product}          

     bool UseSSE42Intrinsics                        = true            {product}          

     bool UseSerialGC                               = false           {product}          

     bool UseSharedSpaces                           = false           {product}          

     bool UseSignalChaining                         = true            {product}          

     bool UseSplitVerifier                          = true            {product}          

     bool UseStoreImmI16                            = false           {ARCH product}     

     bool UseStringCache                            = false           {product}          

     bool UseSuperWord                              = true            {C2 product}       

     bool UseTLAB                                   = true            {pd product}       

     bool UseThreadPriorities                       = true            {pd product}       

     bool UseTransparentHugePages                   = false           {product}          

     bool UseTypeProfile                            = true            {product}          

     bool UseUnalignedLoadStores                    = true            {ARCH product}     

     bool UseVMInterruptibleIO                      = false           {product}          

     bool UseVectoredExceptions                     = false           {pd product}       

     bool UseXMMForArrayCopy                        = true            {product}          

     bool UseXmmI2D                                 = false           {ARCH product}     

     bool UseXmmI2F                                 = false           {ARCH product}     

     bool UseXmmLoadAndClearUpper                   = true            {ARCH product}     

     bool UseXmmRegToRegMoveAll                     = true            {ARCH product}     

     bool VMThreadHintNoPreempt                     = false           {product}          

     intx VMThreadPriority                          = -1              {product}          

     intx VMThreadStackSize                         = 1024            {pd product}       

     intx ValueMapInitialSize                       = 11              {C1 product}       

     intx ValueMapMaxLoopSize                       = 8               {C1 product}       

     intx ValueSearchLimit                          = 1000            {C2 product}       

     bool VerifyMergedCPBytecodes                   = true            {product}          

     intx WorkAroundNPTLTimedWaitHang               = 1               {product}          

    uintx YoungGenerationSizeIncrement              = 20              {product}          

    uintx YoungGenerationSizeSupplement             = 80              {product}          

    uintx YoungGenerationSizeSupplementDecay        = 8               {product}          

    uintx YoungPLABSize                             = 4096            {product}          

     bool ZeroTLAB                                  = false           {product}          

     intx hashCode                                  = 0               {product}          

Running org.apache.hadoop.hbase.test.IntegrationTestBigLinkedList
SUREFIRE-859: [GC 194048K->14420K(740864K), 0.0216460 secs]
SUREFIRE-859: [GC 208468K->70082K(740864K), 0.1167190 secs]
SUREFIRE-859: [GC 264130K->112505K(740864K), 0.0695590 secs]
SUREFIRE-859: [GC 306553K->133058K(934912K), 0.0817430 secs]
SUREFIRE-859: [GC 521154K->165344K(934912K), 0.0849620 secs]
SUREFIRE-859: [GC 553440K->184163K(1372160K), 0.0728440 secs]
SUREFIRE-859: [GC 960355K->260746K(1376768K), 0.1143880 secs]
SUREFIRE-859: [GC 1035917K->383656K(1681920K), 0.1570740 secs]
SUREFIRE-859: [GC 1432744K->521340K(1738752K), 0.1944620 secs]
SUREFIRE-859: [GC 1570428K->682608K(1471488K), 0.1759430 secs]
SUREFIRE-859: [Full GC 682608K->529048K(1835008K), 0.8649210 secs]
SUREFIRE-859: [GC 1310872K->646152K(1968640K), 0.0950440 secs]
SUREFIRE-859: [GC 1427976K->767398K(1924608K), 0.1487180 secs]
SUREFIRE-859: [GC 1564582K->927965K(1954304K), 0.1666490 secs]
SUREFIRE-859: [Full GC 927965K->768449K(2337280K), 0.5419880 secs]
SUREFIRE-859: [GC 1565633K->1005623K(2331648K), 0.0960700 secs]
SUREFIRE-859: [GC 1800145K->1042866K(2358272K), 0.1552660 secs]
SUREFIRE-859: [GC 1838002K->1223031K(2332160K), 0.1598740 secs]
SUREFIRE-859: [Full GC 1223031K->1003916K(2714624K), 0.8724880 secs]
SUREFIRE-859: [GC 1812814K->1086070K(2734080K), 0.0476520 secs]
SUREFIRE-859: [GC 1895030K->1147166K(2736128K), 0.0763420 secs]
SUREFIRE-859: [GC 1988894K->1203373K(2751488K), 0.0644360 secs]
SUREFIRE-859: [GC 2045101K->1292140K(2681856K), 0.1020960 secs]
SUREFIRE-859: [GC 2052460K->1344012K(2723328K), 0.1625770 secs]
SUREFIRE-859: [GC 2104332K->1524764K(2592768K), 0.1670400 secs]
SUREFIRE-859: [GC 2155036K->1617573K(2551296K), 0.1617300 secs]
SUREFIRE-859: [GC 2247845K->1794726K(2554880K), 0.1567230 secs]
SUREFIRE-859: [GC 2306214K->1857904K(2629632K), 0.2169560 secs]
SUREFIRE-859: [Full GC 1857904K->692869K(2435584K), 1.0083840 secs]
SUREFIRE-859: [GC 1204357K->833621K(2394112K), 0.0500150 secs]
SUREFIRE-859: [GC 1365077K->901098K(2424832K), 0.0811960 secs]
SUREFIRE-859: [GC 1432554K->1085515K(2422272K), 0.0847660 secs]
SUREFIRE-859: [GC 1660491K->1168962K(2445312K), 0.1363630 secs]
SUREFIRE-859: [GC 1743938K->1326374K(2456576K), 0.1430060 secs]
SUREFIRE-859: [GC 1954598K->1283284K(2477568K), 0.1078120 secs]
SUREFIRE-859: [Full GC 1283284K->900266K(2776064K), 1.1557920 secs]
SUREFIRE-859: [GC 1528490K->917613K(2797568K), 0.0258200 secs]
SUREFIRE-859: [GC 1560173K->921182K(2799616K), 0.0318910 secs]
SUREFIRE-859: [GC 1563742K->920997K(2789376K), 0.0326390 secs]
SUREFIRE-859: [GC 1565605K->918250K(2794496K), 0.0291490 secs]
SUREFIRE-859: [GC 1562858K->923321K(2788352K), 0.0298750 secs]
SUREFIRE-859: [GC 1587385K->920393K(2796544K), 0.0494240 secs]
SUREFIRE-859: [GC 1584457K->926695K(2788352K), 0.0322300 secs]
SUREFIRE-859: [GC 1623527K->937377K(2804736K), 0.0367130 secs]
SUREFIRE-859: [GC 1634209K->931257K(2827264K), 0.0575230 secs]
SUREFIRE-859: [GC 1669561K->932368K(2816512K), 0.0308020 secs]
SUREFIRE-859: [GC 1670672K->938122K(2799616K), 0.0413370 secs]

Results :

Tests run: 0, Failures: 0, Errors: 0, Skipped: 0

[WARNING] File encoding has not been set, using platform encoding ISO-8859-1, i.e. build is
platform dependent! The file encoding for reports output files should be provided by the POM
property ${project.reporting.outputEncoding}.
[INFO] 
[INFO] --- maven-failsafe-plugin:2.18.1:verify (verify) @ hbase-it ---
[INFO] Failsafe report directory: <https://builds.apache.org/job/HBase-1.3-IT/it.test=IntegrationTestBigLinkedList,jdk=latest1.7,label=Hadoop/ws/hbase-it/target/failsafe-reports>
[WARNING] File encoding has not been set, using platform encoding ISO-8859-1, i.e. build is
platform dependent! The file encoding for reports output files should be provided by the POM
property ${project.reporting.outputEncoding}.
[INFO] ------------------------------------------------------------------------
[INFO] Reactor Summary:
[INFO] 
[INFO] Apache HBase ...................................... SUCCESS [2:06.086s]
[INFO] Apache HBase - Checkstyle ......................... SUCCESS [10.618s]
[INFO] Apache HBase - Resource Bundle .................... SUCCESS [0.386s]
[INFO] Apache HBase - Annotations ........................ SUCCESS [1.515s]
[INFO] Apache HBase - Protocol ........................... SUCCESS [24.066s]
[INFO] Apache HBase - Common ............................. SUCCESS [1:24.761s]
[INFO] Apache HBase - Procedure .......................... SUCCESS [2.003s]
[INFO] Apache HBase - Client ............................. SUCCESS [13.784s]
[INFO] Apache HBase - Hadoop Compatibility ............... SUCCESS [2.797s]
[INFO] Apache HBase - Hadoop Two Compatibility ........... SUCCESS [5.315s]
[INFO] Apache HBase - Prefix Tree ........................ SUCCESS [1.895s]
[INFO] Apache HBase - Server ............................. SUCCESS [2:43.057s]
[INFO] Apache HBase - Testing Util ....................... SUCCESS [3.109s]
[INFO] Apache HBase - Thrift ............................. SUCCESS [11.007s]
[INFO] Apache HBase - Rest ............................... SUCCESS [3.507s]
[INFO] Apache HBase - Shell .............................. SUCCESS [19.027s]
[INFO] Apache HBase - Integration Tests .................. FAILURE [30:04.231s]
[INFO] Apache HBase - Examples ........................... SKIPPED
[INFO] Apache HBase - External Block Cache ............... SKIPPED
[INFO] Apache HBase - Assembly ........................... SKIPPED
[INFO] Apache HBase - Shaded ............................. SKIPPED
[INFO] Apache HBase - Shaded - Client .................... SKIPPED
[INFO] Apache HBase - Shaded - Server .................... SKIPPED
[INFO] ------------------------------------------------------------------------
[INFO] BUILD FAILURE
[INFO] ------------------------------------------------------------------------
[INFO] Total time: 38:31.219s
[INFO] Finished at: Fri Dec 04 03:22:22 UTC 2015
[INFO] Final Memory: 136M/1053M
[INFO] ------------------------------------------------------------------------
[ERROR] Failed to execute goal org.apache.maven.plugins:maven-failsafe-plugin:2.18.1:verify
(verify) on project hbase-it: There was a timeout or other error in the fork -> [Help 1]
[ERROR] 
[ERROR] To see the full stack trace of the errors, re-run Maven with the -e switch.
[ERROR] Re-run Maven using the -X switch to enable full debug logging.
[ERROR] 
[ERROR] For more information about the errors and possible solutions, please read the following
articles:
[ERROR] [Help 1] http://cwiki.apache.org/confluence/display/MAVEN/MojoFailureException
[ERROR] 
[ERROR] After correcting the problems, you can resume the build with the command
[ERROR]   mvn <goals> -rf :hbase-it
Build step 'Invoke top-level Maven targets' marked build as failure
Performing Post build task...
Match found for :.* : True
Logical operation result is TRUE
Running script  : # Post-build task script. TODO: Check this in and have all builds reference
check-in.
pwd && ls
# NOTE!!!! The below code has been copied and pasted from ./dev-tools/run-test.sh
# Do not change here without syncing there and vice-versa.
ZOMBIE_TESTS_COUNT=`jps -v | grep surefirebooter | grep -e '-Dhbase.test' | wc -l`
if [[ $ZOMBIE_TESTS_COUNT != 0 ]] ; then
 echo "Suspicious java process found - waiting 30s to see if there are just slow to stop"
 sleep 30
 ZOMBIE_TESTS_COUNT=`jps -v | grep surefirebooter | grep -e '-Dhbase.test' | wc -l`
 if [[ $ZOMBIE_TESTS_COUNT != 0 ]] ; then
   echo " {color:red}There appear to be $ZOMBIE_TESTS_COUNT zombie tests{color}, they should
have been killed by surefire but survived"
   jps -v | grep surefirebooter | grep -e '-Dhbase.test'
   jps -v | grep surefirebooter | grep -e '-Dhbase.test' | cut -d ' ' -f 1 | xargs -n 1 jstack
   # Exit with error
   exit 1
 else
   echo "We're ok: there is no zombie test, but some tests took some time to stop"
 fi
else
  echo "We're ok: there is no zombie test"
fi
[Hadoop] $ /bin/bash -xe /tmp/hudson8523516451376050393.sh
+ pwd
<https://builds.apache.org/job/HBase-1.3-IT/it.test=IntegrationTestBigLinkedList,jdk=latest1.7,label=Hadoop/ws/>
+ ls
bin
CHANGES.txt
conf
dev-support
hbase-annotations
hbase-assembly
hbase-checkstyle
hbase-client
hbase-common
hbase-examples
hbase-external-blockcache
hbase-hadoop2-compat
hbase-hadoop-compat
hbase-it
hbase-native-client
hbase-prefix-tree
hbase-procedure
hbase-protocol
hbase-resource-bundle
hbase-rest
hbase-server
hbase-shaded
hbase-shell
hbase-spark
hbase-testing-util
hbase-thrift
LICENSE.txt
NOTICE.txt
pom.xml
README.txt
src
target
++ jps -v
++ grep surefirebooter
++ wc -l
++ grep -e -Dhbase.test
+ ZOMBIE_TESTS_COUNT=0
+ [[ 0 != 0 ]]
+ echo 'We'\''re ok: there is no zombie test'
We're ok: there is no zombie test
POST BUILD TASK : SUCCESS
END OF POST BUILD TASK : 0
Archiving artifacts

Mime
View raw message