hbase-builds mailing list archives

Site index · List index
Message view « Date » · « Thread »
Top « Date » · « Thread »
From Apache Jenkins Server <jenk...@builds.apache.org>
Subject Build failed in Jenkins: HBase-1.1-JDK8 #1715
Date Thu, 24 Dec 2015 07:12:58 GMT
See <https://builds.apache.org/job/HBase-1.1-JDK8/1715/changes>

Changes:

[stack] Revert "HBASE-15018 Inconsistent way of handling TimeoutException in

[anoopsamjohn] HBASE-14940 Make our unsafe based ops more safe.

------------------------------------------
[...truncated 2902 lines...]
	at java.lang.Thread.run(Thread.java:745)

Tests run: 1, Failures: 0, Errors: 0, Skipped: 0, Time elapsed: 416.435 sec - in org.apache.hadoop.hbase.mapreduce.TestLoadIncrementalHFilesUseSecurityEndPoint
Java HotSpot(TM) 64-Bit Server VM warning: ignoring option MaxPermSize=256m; support was removed
in 8.0
Running org.apache.hadoop.hbase.mapreduce.TestSecureLoadIncrementalHFilesSplitRecovery
Tests run: 11, Failures: 0, Errors: 0, Skipped: 0, Time elapsed: 353.008 sec - in org.apache.hadoop.hbase.mapreduce.TestImportTsv
Java HotSpot(TM) 64-Bit Server VM warning: ignoring option MaxPermSize=256m; support was removed
in 8.0
Running org.apache.hadoop.hbase.mapreduce.TestTableSnapshotInputFormat
Tests run: 5, Failures: 0, Errors: 0, Skipped: 0, Time elapsed: 36.059 sec - in org.apache.hadoop.hbase.mapreduce.TestSecureLoadIncrementalHFilesSplitRecovery
Java HotSpot(TM) 64-Bit Server VM warning: ignoring option MaxPermSize=256m; support was removed
in 8.0
Running org.apache.hadoop.hbase.mapreduce.TestHFileOutputFormat
Tests run: 16, Failures: 0, Errors: 0, Skipped: 0, Time elapsed: 365.858 sec - in org.apache.hadoop.hbase.mapreduce.TestSecureLoadIncrementalHFiles
Java HotSpot(TM) 64-Bit Server VM warning: ignoring option MaxPermSize=256m; support was removed
in 8.0
Tests run: 2, Failures: 0, Errors: 0, Skipped: 0, Time elapsed: 163.583 sec - in org.apache.hadoop.hbase.mapreduce.TestTableMapReduce
Java HotSpot(TM) 64-Bit Server VM warning: ignoring option MaxPermSize=256m; support was removed
in 8.0
Running org.apache.hadoop.hbase.mapreduce.TestHLogRecordReader
Tests run: 2, Failures: 0, Errors: 0, Skipped: 0, Time elapsed: 3.254 sec - in org.apache.hadoop.hbase.mapreduce.TestHLogRecordReader
Java HotSpot(TM) 64-Bit Server VM warning: ignoring option MaxPermSize=256m; support was removed
in 8.0
Java HotSpot(TM) 64-Bit Server VM warning: ignoring option MaxPermSize=256m; support was removed
in 8.0
Running org.apache.hadoop.hbase.regionserver.TestCompactionWithCoprocessor
Running org.apache.hadoop.hbase.mapreduce.TestHRegionPartitioner
Tests run: 7, Failures: 0, Errors: 0, Skipped: 0, Time elapsed: 214.423 sec - in org.apache.hadoop.hbase.mapreduce.TestCellCounter
Tests run: 1, Failures: 0, Errors: 0, Skipped: 0, Time elapsed: 6.253 sec - in org.apache.hadoop.hbase.mapreduce.TestHRegionPartitioner
Java HotSpot(TM) 64-Bit Server VM warning: ignoring option MaxPermSize=256m; support was removed
in 8.0
Java HotSpot(TM) 64-Bit Server VM warning: ignoring option MaxPermSize=256m; support was removed
in 8.0
Java HotSpot(TM) 64-Bit Server VM warning: ignoring option MaxPermSize=256m; support was removed
in 8.0
Java HotSpot(TM) 64-Bit Server VM warning: ignoring option MaxPermSize=256m; support was removed
in 8.0
Java HotSpot(TM) 64-Bit Server VM warning: ignoring option MaxPermSize=256m; support was removed
in 8.0
Java HotSpot(TM) 64-Bit Server VM warning: ignoring option MaxPermSize=256m; support was removed
in 8.0
Java HotSpot(TM) 64-Bit Server VM warning: ignoring option MaxPermSize=256m; support was removed
in 8.0
Tests run: 5, Failures: 0, Errors: 0, Skipped: 0, Time elapsed: 25.47 sec - in org.apache.hadoop.hbase.regionserver.TestCompactionWithCoprocessor
Java HotSpot(TM) 64-Bit Server VM warning: ignoring option MaxPermSize=256m; support was removed
in 8.0
Running org.apache.hadoop.hbase.regionserver.TestStore
Running org.apache.hadoop.hbase.regionserver.TestSplitTransactionOnCluster
Running org.apache.hadoop.hbase.regionserver.TestScannerRetriableFailure
Tests run: 18, Failures: 0, Errors: 0, Skipped: 0, Time elapsed: 13.691 sec - in org.apache.hadoop.hbase.regionserver.TestStore
Java HotSpot(TM) 64-Bit Server VM warning: ignoring option MaxPermSize=256m; support was removed
in 8.0
Running org.apache.hadoop.hbase.regionserver.wal.TestLogRollPeriod
Tests run: 1, Failures: 0, Errors: 0, Skipped: 0, Time elapsed: 37.815 sec - in org.apache.hadoop.hbase.regionserver.TestScannerRetriableFailure
Java HotSpot(TM) 64-Bit Server VM warning: ignoring option MaxPermSize=256m; support was removed
in 8.0
Java HotSpot(TM) 64-Bit Server VM warning: ignoring option MaxPermSize=256m; support was removed
in 8.0
Java HotSpot(TM) 64-Bit Server VM warning: ignoring option MaxPermSize=256m; support was removed
in 8.0
Java HotSpot(TM) 64-Bit Server VM warning: ignoring option MaxPermSize=256m; support was removed
in 8.0
Java HotSpot(TM) 64-Bit Server VM warning: ignoring option MaxPermSize=256m; support was removed
in 8.0
Running org.apache.hadoop.hbase.regionserver.wal.TestProtobufLog
Tests run: 1, Failures: 0, Errors: 0, Skipped: 0, Time elapsed: 1.805 sec - in org.apache.hadoop.hbase.regionserver.wal.TestProtobufLog
Java HotSpot(TM) 64-Bit Server VM warning: ignoring option MaxPermSize=256m; support was removed
in 8.0
Running org.apache.hadoop.hbase.regionserver.wal.TestSecureWALReplay
Tests run: 2, Failures: 0, Errors: 0, Skipped: 0, Time elapsed: 72.718 sec - in org.apache.hadoop.hbase.regionserver.wal.TestLogRollPeriod
Java HotSpot(TM) 64-Bit Server VM warning: ignoring option MaxPermSize=256m; support was removed
in 8.0
Running org.apache.hadoop.hbase.regionserver.wal.TestLogRollAbort
Tests run: 9, Failures: 0, Errors: 0, Skipped: 0, Time elapsed: 45.409 sec - in org.apache.hadoop.hbase.regionserver.wal.TestSecureWALReplay
Java HotSpot(TM) 64-Bit Server VM warning: ignoring option MaxPermSize=256m; support was removed
in 8.0
Java HotSpot(TM) 64-Bit Server VM warning: ignoring option MaxPermSize=256m; support was removed
in 8.0
Running org.apache.hadoop.hbase.regionserver.wal.TestFSHLog
Tests run: 7, Failures: 0, Errors: 0, Skipped: 0, Time elapsed: 5.547 sec - in org.apache.hadoop.hbase.regionserver.wal.TestFSHLog
Java HotSpot(TM) 64-Bit Server VM warning: ignoring option MaxPermSize=256m; support was removed
in 8.0
Running org.apache.hadoop.hbase.regionserver.wal.TestReadOldRootAndMetaEdits
Tests run: 1, Failures: 0, Errors: 0, Skipped: 0, Time elapsed: 0 sec - in org.apache.hadoop.hbase.regionserver.wal.TestReadOldRootAndMetaEdits
Java HotSpot(TM) 64-Bit Server VM warning: ignoring option MaxPermSize=256m; support was removed
in 8.0
Tests run: 2, Failures: 0, Errors: 0, Skipped: 0, Time elapsed: 32.293 sec - in org.apache.hadoop.hbase.regionserver.wal.TestLogRollAbort
Java HotSpot(TM) 64-Bit Server VM warning: ignoring option MaxPermSize=256m; support was removed
in 8.0
Java HotSpot(TM) 64-Bit Server VM warning: ignoring option MaxPermSize=256m; support was removed
in 8.0
Running org.apache.hadoop.hbase.regionserver.wal.TestDurability
Tests run: 3, Failures: 0, Errors: 0, Skipped: 0, Time elapsed: 4.116 sec - in org.apache.hadoop.hbase.regionserver.wal.TestDurability
Java HotSpot(TM) 64-Bit Server VM warning: ignoring option MaxPermSize=256m; support was removed
in 8.0
Java HotSpot(TM) 64-Bit Server VM warning: ignoring option MaxPermSize=256m; support was removed
in 8.0
Running org.apache.hadoop.hbase.regionserver.wal.TestWALReplay
Running org.apache.hadoop.hbase.regionserver.wal.TestLogRolling
Tests run: 17, Failures: 0, Errors: 0, Skipped: 0, Time elapsed: 185.228 sec - in org.apache.hadoop.hbase.regionserver.TestSplitTransactionOnCluster
Java HotSpot(TM) 64-Bit Server VM warning: ignoring option MaxPermSize=256m; support was removed
in 8.0
Tests run: 9, Failures: 0, Errors: 0, Skipped: 0, Time elapsed: 45.377 sec - in org.apache.hadoop.hbase.regionserver.wal.TestWALReplay
Java HotSpot(TM) 64-Bit Server VM warning: ignoring option MaxPermSize=256m; support was removed
in 8.0
Running org.apache.hadoop.hbase.regionserver.TestCacheOnWriteInSchema
Tests run: 3, Failures: 0, Errors: 0, Skipped: 0, Time elapsed: 3.095 sec - in org.apache.hadoop.hbase.regionserver.TestCacheOnWriteInSchema
Java HotSpot(TM) 64-Bit Server VM warning: ignoring option MaxPermSize=256m; support was removed
in 8.0
Java HotSpot(TM) 64-Bit Server VM warning: ignoring option MaxPermSize=256m; support was removed
in 8.0
Running org.apache.hadoop.hbase.regionserver.wal.TestWALReplayCompressed
Running org.apache.hadoop.hbase.regionserver.TestCompactionState
Tests run: 9, Failures: 0, Errors: 0, Skipped: 0, Time elapsed: 43.904 sec - in org.apache.hadoop.hbase.regionserver.wal.TestWALReplayCompressed
Java HotSpot(TM) 64-Bit Server VM warning: ignoring option MaxPermSize=256m; support was removed
in 8.0
Running org.apache.hadoop.hbase.regionserver.TestRegionServerMetrics
Tests run: 13, Failures: 0, Errors: 0, Skipped: 1, Time elapsed: 333.623 sec - in org.apache.hadoop.hbase.mapreduce.TestHFileOutputFormat
Java HotSpot(TM) 64-Bit Server VM warning: ignoring option MaxPermSize=256m; support was removed
in 8.0
Java HotSpot(TM) 64-Bit Server VM warning: ignoring option MaxPermSize=256m; support was removed
in 8.0
Tests run: 5, Failures: 0, Errors: 0, Skipped: 0, Time elapsed: 69.792 sec - in org.apache.hadoop.hbase.regionserver.TestCompactionState
Java HotSpot(TM) 64-Bit Server VM warning: ignoring option MaxPermSize=256m; support was removed
in 8.0
Running org.apache.hadoop.hbase.regionserver.TestWALLockup
Java HotSpot(TM) 64-Bit Server VM warning: ignoring option MaxPermSize=256m; support was removed
in 8.0
Tests run: 1, Failures: 0, Errors: 0, Skipped: 0, Time elapsed: 1.644 sec - in org.apache.hadoop.hbase.regionserver.TestWALLockup
Java HotSpot(TM) 64-Bit Server VM warning: ignoring option MaxPermSize=256m; support was removed
in 8.0
Running org.apache.hadoop.hbase.regionserver.TestCompactSplitThread
Running org.apache.hadoop.hbase.regionserver.TestTags
Tests run: 1, Failures: 0, Errors: 0, Skipped: 0, Time elapsed: 20.575 sec - in org.apache.hadoop.hbase.regionserver.TestCompactSplitThread
Java HotSpot(TM) 64-Bit Server VM warning: ignoring option MaxPermSize=256m; support was removed
in 8.0
Java HotSpot(TM) 64-Bit Server VM warning: ignoring option MaxPermSize=256m; support was removed
in 8.0
Running org.apache.hadoop.hbase.regionserver.TestGetClosestAtOrBefore
Tests run: 3, Failures: 0, Errors: 0, Skipped: 0, Time elapsed: 1.662 sec - in org.apache.hadoop.hbase.regionserver.TestGetClosestAtOrBefore
Java HotSpot(TM) 64-Bit Server VM warning: ignoring option MaxPermSize=256m; support was removed
in 8.0
Java HotSpot(TM) 64-Bit Server VM warning: ignoring option MaxPermSize=256m; support was removed
in 8.0
Running org.apache.hadoop.hbase.regionserver.TestJoinedScanners
Tests run: 11, Failures: 0, Errors: 0, Skipped: 0, Time elapsed: 50.61 sec - in org.apache.hadoop.hbase.regionserver.TestRegionServerMetrics
Java HotSpot(TM) 64-Bit Server VM warning: ignoring option MaxPermSize=256m; support was removed
in 8.0
Running org.apache.hadoop.hbase.regionserver.TestAtomicOperation
Tests run: 8, Failures: 0, Errors: 0, Skipped: 0, Time elapsed: 380.697 sec - in org.apache.hadoop.hbase.mapreduce.TestTableSnapshotInputFormat
Java HotSpot(TM) 64-Bit Server VM warning: ignoring option MaxPermSize=256m; support was removed
in 8.0
Running org.apache.hadoop.hbase.regionserver.TestRowTooBig
Tests run: 1, Failures: 0, Errors: 0, Skipped: 0, Time elapsed: 31.967 sec - in org.apache.hadoop.hbase.regionserver.TestJoinedScanners
Java HotSpot(TM) 64-Bit Server VM warning: ignoring option MaxPermSize=256m; support was removed
in 8.0
Java HotSpot(TM) 64-Bit Server VM warning: ignoring option MaxPermSize=256m; support was removed
in 8.0
Running org.apache.hadoop.hbase.regionserver.TestRegionReplicaFailover
Tests run: 2, Failures: 0, Errors: 0, Skipped: 0, Time elapsed: 17.149 sec - in org.apache.hadoop.hbase.regionserver.TestRowTooBig
Java HotSpot(TM) 64-Bit Server VM warning: ignoring option MaxPermSize=256m; support was removed
in 8.0
Java HotSpot(TM) 64-Bit Server VM warning: ignoring option MaxPermSize=256m; support was removed
in 8.0
Running org.apache.hadoop.hbase.regionserver.TestDefaultMemStore

Results :

Tests in error: 
  TestAdmin2.testCreateTableRPCTimeOut:202 ? TableExists testCreateTableRPCTimeO...
org.apache.hadoop.hbase.master.procedure.TestWALProcedureStoreOnHDFS.testWalRollOnLowReplication(org.apache.hadoop.hbase.master.procedure.TestWALProcedureStoreOnHDFS)
  Run 1: TestWALProcedureStoreOnHDFS.testWalRollOnLowReplication:189 ? Runtime sync abo...
  Run 2: TestWALProcedureStoreOnHDFS.testWalRollOnLowReplication:189 ? Runtime sync abo...
  Run 3: TestWALProcedureStoreOnHDFS.testWalRollOnLowReplication:189 ? Runtime sync abo...

Flaked tests: 
org.apache.hadoop.hbase.mapreduce.TestLoadIncrementalHFilesUseSecurityEndPoint.testRegionCrossingHFileSplitRowColBloom(org.apache.hadoop.hbase.mapreduce.TestLoadIncrementalHFilesUseSecurityEndPoint)
  Run 1: TestLoadIncrementalHFilesUseSecurityEndPoint>TestLoadIncrementalHFiles.testRegionCrossingHFileSplitRowColBloom:191->TestLoadIncrementalHFiles.testRegionCrossingHFileSplit:195->TestLoadIncrementalHFiles.runTest:223->TestLoadIncrementalHFiles.runTest:232->TestLoadIncrementalHFiles.runTest:285
? TestTimedOut
  Run 2: PASS


Tests run: 1437, Failures: 0, Errors: 2, Skipped: 19, Flakes: 1

[INFO] ------------------------------------------------------------------------
[INFO] Reactor Summary:
[INFO] 
[INFO] Apache HBase ...................................... SUCCESS [4.884s]
[INFO] Apache HBase - Checkstyle ......................... SUCCESS [0.832s]
[INFO] Apache HBase - Resource Bundle .................... SUCCESS [0.179s]
[INFO] Apache HBase - Annotations ........................ SUCCESS [1.113s]
[INFO] Apache HBase - Protocol ........................... SUCCESS [10.977s]
[INFO] Apache HBase - Common ............................. SUCCESS [1:22.464s]
[INFO] Apache HBase - Procedure .......................... SUCCESS [2:28.966s]
[INFO] Apache HBase - Client ............................. SUCCESS [1:16.585s]
[INFO] Apache HBase - Hadoop Compatibility ............... SUCCESS [7.605s]
[INFO] Apache HBase - Hadoop Two Compatibility ........... SUCCESS [5.964s]
[INFO] Apache HBase - Prefix Tree ........................ SUCCESS [7.109s]
[INFO] Apache HBase - Server ............................. FAILURE [1:28:06.701s]
[INFO] Apache HBase - Testing Util ....................... SKIPPED
[INFO] Apache HBase - Thrift ............................. SKIPPED
[INFO] Apache HBase - Rest ............................... SKIPPED
[INFO] Apache HBase - Shell .............................. SKIPPED
[INFO] Apache HBase - Integration Tests .................. SKIPPED
[INFO] Apache HBase - Examples ........................... SKIPPED
[INFO] Apache HBase - Assembly ........................... SKIPPED
[INFO] Apache HBase - Shaded ............................. SKIPPED
[INFO] Apache HBase - Shaded - Client .................... SKIPPED
[INFO] Apache HBase - Shaded - Server .................... SKIPPED
[INFO] ------------------------------------------------------------------------
[INFO] BUILD FAILURE
[INFO] ------------------------------------------------------------------------
[INFO] Total time: 1:33:54.801s
[INFO] Finished at: Thu Dec 24 07:10:55 UTC 2015
[INFO] Final Memory: 301M/645M
[INFO] ------------------------------------------------------------------------
Tests run: 6, Failures: 0, Errors: 0, Skipped: 0, Time elapsed: 43.525 sec - in org.apache.hadoop.hbase.regionserver.TestAtomicOperation
[ERROR] Failed to execute goal org.apache.maven.plugins:maven-surefire-plugin:2.18.1:test
(secondPartTestsExecution) on project hbase-server: ExecutionException: java.lang.RuntimeException:
java.lang.RuntimeException: org.apache.maven.surefire.report.ReporterException: When writing
xml report stdout/stderr: /tmp/stderr1450552501513724856deferred (No such file or directory)
-> [Help 1]
[ERROR] 
[ERROR] To see the full stack trace of the errors, re-run Maven with the -e switch.
[ERROR] Re-run Maven using the -X switch to enable full debug logging.
[ERROR] 
[ERROR] For more information about the errors and possible solutions, please read the following
articles:
[ERROR] [Help 1] http://cwiki.apache.org/confluence/display/MAVEN/MojoFailureException
[ERROR] 
[ERROR] After correcting the problems, you can resume the build with the command
[ERROR]   mvn <goals> -rf :hbase-server
Build step 'Invoke top-level Maven targets' marked build as failure
Performing Post build task...
Match found for :.* : True
Logical operation result is TRUE
Running script  : # Post-build task script. TODO: Check this in and have all builds reference
check-in.
pwd && ls
# NOTE!!!! The below code has been copied and pasted from ./dev-tools/run-test.sh
# Do not change here without syncing there and vice-versa.
ZOMBIE_TESTS_COUNT=`jps -v | grep surefirebooter | grep -e '-Dhbase.test' | wc -l`
if [[ $ZOMBIE_TESTS_COUNT != 0 ]] ; then
 echo "Suspicious java process found - waiting 30s to see if there are just slow to stop"
 sleep 30
 ZOMBIE_TESTS_COUNT=`jps -v | grep surefirebooter | grep -e '-Dhbase.test' | wc -l`
 if [[ $ZOMBIE_TESTS_COUNT != 0 ]] ; then
   echo " {color:red}There appear to be $ZOMBIE_TESTS_COUNT zombie tests{color}, they should
have been killed by surefire but survived"
   jps -v | grep surefirebooter | grep -e '-Dhbase.test'
   jps -v | grep surefirebooter | grep -e '-Dhbase.test' | cut -d ' ' -f 1 | xargs -n 1 jstack
   # Exit with error
   exit 1
 else
   echo "We're ok: there is no zombie test, but some tests took some time to stop"
 fi
else
  echo "We're ok: there is no zombie test"
fi
[HBase-1.1-JDK8] $ /bin/bash -xe /tmp/hudson4980410931228505025.sh
+ pwd
/x1/jenkins/jenkins-slave/workspace/HBase-1.1-JDK8
+ ls
CHANGES.txt
LICENSE.txt
NOTICE.txt
README.txt
bin
conf
dev-support
hbase-annotations
hbase-assembly
hbase-checkstyle
hbase-client
hbase-common
hbase-examples
hbase-hadoop-compat
hbase-hadoop2-compat
hbase-it
hbase-native-client
hbase-prefix-tree
hbase-procedure
hbase-protocol
hbase-resource-bundle
hbase-rest
hbase-server
hbase-shaded
hbase-shell
hbase-testing-util
hbase-thrift
pom.xml
src
target
++ jps -v
++ grep surefirebooter
++ grep -e -Dhbase.test
++ wc -l
+ ZOMBIE_TESTS_COUNT=0
+ [[ 0 != 0 ]]
+ echo 'We'\''re ok: there is no zombie test'
We're ok: there is no zombie test
POST BUILD TASK : SUCCESS
END OF POST BUILD TASK : 0
Archiving artifacts
Recording test results
Updating HBASE-15018
Updating HBASE-14940

Mime
View raw message