hbase-builds mailing list archives

Site index · List index
Message view « Date » · « Thread »
Top « Date » · « Thread »
From Apache Jenkins Server <jenk...@builds.apache.org>
Subject Build failed in Jenkins: HBase-1.2-IT » IntegrationTestBigLinkedList,latest1.7,Hadoop #357
Date Tue, 22 Dec 2015 00:03:55 GMT
See <https://builds.apache.org/job/HBase-1.2-IT/it.test=IntegrationTestBigLinkedList,jdk=latest1.7,label=Hadoop/357/changes>

Changes:

[antonov] HBASE-14976 fix tests

[matteo.bertozzi] HBASE-15022 replication_admin.rb throws undefined method

------------------------------------------
[...truncated 48516 lines...]
     bool UseOSErrorReporting                       = false           {pd product}       

     bool UseOldInlining                            = true            {C2 product}       

     bool UseOnStackReplacement                     = true            {pd product}       

     bool UseOnlyInlinedBimorphic                   = true            {C2 product}       

     bool UseOprofile                               = false           {product}          

     bool UseOptoBiasInlining                       = true            {C2 product}       

     bool UsePPCLWSYNC                              = true            {product}          

     bool UsePSAdaptiveSurvivorSizePolicy           = true            {product}          

     bool UseParNewGC                               = false           {product}          

     bool UseParallelGC                            := true            {product}          

     bool UseParallelOldGC                          = true            {product}          

     bool UsePerfData                               = true            {product}          

     bool UsePopCountInstruction                    = true            {product}          

     bool UseRDPCForConstantTableBase               = false           {C2 product}       

     bool UseSHM                                    = false           {product}          

     intx UseSSE                                    = 4               {product}          

     bool UseSSE42Intrinsics                        = true            {product}          

     bool UseSerialGC                               = false           {product}          

     bool UseSharedSpaces                           = false           {product}          

     bool UseSignalChaining                         = true            {product}          

     bool UseSplitVerifier                          = true            {product}          

     bool UseStoreImmI16                            = false           {ARCH product}     

     bool UseStringCache                            = false           {product}          

     bool UseSuperWord                              = true            {C2 product}       

     bool UseTLAB                                   = true            {pd product}       

     bool UseThreadPriorities                       = true            {pd product}       

     bool UseTransparentHugePages                   = false           {product}          

     bool UseTypeProfile                            = true            {product}          

     bool UseUnalignedLoadStores                    = true            {ARCH product}     

     bool UseVMInterruptibleIO                      = false           {product}          

     bool UseVectoredExceptions                     = false           {pd product}       

     bool UseXMMForArrayCopy                        = true            {product}          

     bool UseXmmI2D                                 = false           {ARCH product}     

     bool UseXmmI2F                                 = false           {ARCH product}     

     bool UseXmmLoadAndClearUpper                   = true            {ARCH product}     

     bool UseXmmRegToRegMoveAll                     = true            {ARCH product}     

     bool VMThreadHintNoPreempt                     = false           {product}          

     intx VMThreadPriority                          = -1              {product}          

     intx VMThreadStackSize                         = 1024            {pd product}       

     intx ValueMapInitialSize                       = 11              {C1 product}       

     intx ValueMapMaxLoopSize                       = 8               {C1 product}       

     intx ValueSearchLimit                          = 1000            {C2 product}       

     bool VerifyMergedCPBytecodes                   = true            {product}          

     intx WorkAroundNPTLTimedWaitHang               = 1               {product}          

    uintx YoungGenerationSizeIncrement              = 20              {product}          

    uintx YoungGenerationSizeSupplement             = 80              {product}          

    uintx YoungGenerationSizeSupplementDecay        = 8               {product}          

    uintx YoungPLABSize                             = 4096            {product}          

     bool ZeroTLAB                                  = false           {product}          

     intx hashCode                                  = 0               {product}          

Running org.apache.hadoop.hbase.test.IntegrationTestBigLinkedList
SUREFIRE-859: [GC 194048K->14475K(740864K), 0.0219660 secs]
SUREFIRE-859: [GC 208523K->70188K(740864K), 0.1265380 secs]
SUREFIRE-859: [GC 264236K->112510K(740864K), 0.0816800 secs]
SUREFIRE-859: [GC 306558K->133568K(934912K), 0.0817750 secs]
SUREFIRE-859: [GC 521664K->166486K(934912K), 0.0799980 secs]
SUREFIRE-859: [GC 554582K->183637K(1373696K), 0.0516590 secs]
SUREFIRE-859: [GC 959829K->259511K(1377792K), 0.1024230 secs]
SUREFIRE-859: [GC 1035678K->375336K(1687552K), 0.1151960 secs]
SUREFIRE-859: [GC 1430568K->552332K(1741824K), 0.4201550 secs]
SUREFIRE-859: [GC 1607564K->648483K(1497088K), 0.2577350 secs]
SUREFIRE-859: [Full GC 648483K->488543K(1808896K), 0.7742160 secs]
SUREFIRE-859: [GC 1299039K->718241K(1867264K), 0.0644440 secs]
SUREFIRE-859: [GC 1528737K->829528K(1908224K), 0.1635460 secs]
SUREFIRE-859: [GC 1593944K->892608K(1712640K), 0.1476620 secs]
SUREFIRE-859: [Full GC 892608K->721485K(2089472K), 0.6703980 secs]
SUREFIRE-859: [GC 1485901K->948727K(2252288K), 0.0842720 secs]
SUREFIRE-859: [GC 1695735K->1059813K(2269696K), 0.1670830 secs]
SUREFIRE-859: [GC 1806821K->1267585K(2250240K), 0.1223380 secs]
SUREFIRE-859: [Full GC 1267585K->960760K(2685952K), 1.6540700 secs]
SUREFIRE-859: [GC 1727224K->1085114K(2705408K), 0.0650250 secs]
SUREFIRE-859: [GC 1851578K->1129899K(2721792K), 0.0640040 secs]
SUREFIRE-859: [GC 1941419K->1184267K(2733568K), 0.1094820 secs]
SUREFIRE-859: [GC 1995787K->1254121K(2664960K), 0.1075800 secs]
SUREFIRE-859: [GC 1981584K->1243316K(2649600K), 0.1011510 secs]
SUREFIRE-859: [GC 1970868K->1182916K(2678784K), 0.0938130 secs]
SUREFIRE-859: [GC 1861316K->1147003K(2504192K), 0.0684170 secs]
SUREFIRE-859: [GC 1825348K->1161355K(2670080K), 0.0772960 secs]
SUREFIRE-859: [GC 1849483K->1184309K(2660352K), 0.0846130 secs]
SUREFIRE-859: [GC 1872208K->1237222K(2669568K), 0.1026880 secs]
SUREFIRE-859: [GC 1935078K->1313610K(2687488K), 0.1174850 secs]
SUREFIRE-859: [GC 2011466K->1412778K(2571776K), 0.1675360 secs]
SUREFIRE-859: [GC 1994922K->1428005K(2541056K), 0.0781560 secs]
SUREFIRE-859: [GC 2010149K->1438593K(2578944K), 0.0790510 secs]
SUREFIRE-859: [GC 1953153K->1443717K(2488832K), 0.0787100 secs]
SUREFIRE-859: [GC 1958277K->1470491K(2562560K), 0.0887360 secs]
SUREFIRE-859: [GC 1936923K->1454531K(2571776K), 0.0899990 secs]
SUREFIRE-859: [GC 1920281K->1504315K(2571776K), 0.1007870 secs]
SUREFIRE-859: [GC 1970747K->1601198K(2571776K), 0.2183410 secs]
SUREFIRE-859: [GC 2067630K->1731948K(2571776K), 0.1953030 secs]
SUREFIRE-859: [GC 2198380K->1747564K(2571776K), 0.2800330 secs]
SUREFIRE-859: [Full GC 1747564K->563451K(2278400K), 0.5936550 secs]
SUREFIRE-859: [GC 1029859K->582513K(2278400K), 0.0252470 secs]
SUREFIRE-859: [GC 1048899K->631698K(2278400K), 0.0376850 secs]
SUREFIRE-859: [GC 1098130K->660370K(2278400K), 0.0378790 secs]
SUREFIRE-859: [GC 1126802K->682794K(2278400K), 0.0458780 secs]
SUREFIRE-859: [GC 1149226K->669751K(2278400K), 0.0468860 secs]
SUREFIRE-859: [GC 1136147K->701233K(2278400K), 0.0528820 secs]
SUREFIRE-859: [GC 1167665K->787340K(2278400K), 0.0510150 secs]
SUREFIRE-859: [GC 1252128K->793204K(2278400K), 0.0612800 secs]
SUREFIRE-859: [GC 1259636K->915565K(2278400K), 0.0607640 secs]
SUREFIRE-859: [GC 1381997K->1016501K(1885696K), 0.0679980 secs]
SUREFIRE-859: [GC 1482933K->1121343K(2294272K), 0.0602410 secs]
SUREFIRE-859: [GC 1611327K->1126614K(2019328K), 0.0700180 secs]
SUREFIRE-859: [GC 1616598K->1262551K(2234880K), 0.0895690 secs]
SUREFIRE-859: [GC 1728545K->1334712K(2266624K), 0.1018620 secs]
SUREFIRE-859: [GC 1801144K->1344792K(2278400K), 0.1196540 secs]
SUREFIRE-859: [GC 1811224K->1421089K(2278400K), 0.1070310 secs]
SUREFIRE-859: [Full GC 1421089K->820392K(2642944K), 0.8236200 secs]
SUREFIRE-859: [GC 1286824K->913252K(2625536K), 0.0376540 secs]
SUREFIRE-859: [GC 1379653K->1003535K(2634240K), 0.0576560 secs]
SUREFIRE-859: [GC 1469967K->991961K(2647040K), 0.0460560 secs]
SUREFIRE-859: [GC 1485529K->1026857K(2646016K), 0.0484200 secs]
SUREFIRE-859: [GC 1520425K->1083696K(2635264K), 0.0769270 secs]
SUREFIRE-859: [GC 1609520K->1118991K(2644992K), 0.0751950 secs]
SUREFIRE-859: [GC 1644786K->1155052K(2632704K), 0.0636370 secs]
SUREFIRE-859: [GC 1713644K->1135280K(2646528K), 0.0799060 secs]
SUREFIRE-859: [GC 1693872K->1140147K(2624000K), 0.0693160 secs]
SUREFIRE-859: [GC 1722291K->1256470K(2641920K), 0.0846660 secs]
SUREFIRE-859: [GC 1838614K->1110167K(2669056K), 0.0991090 secs]
SUREFIRE-859: [GC 1729687K->1127926K(2693632K), 0.0770720 secs]
SUREFIRE-859: [GC 1747446K->1179013K(2716160K), 0.1277290 secs]
SUREFIRE-859: [GC 1839472K->1178765K(2716160K), 0.0720140 secs]
SUREFIRE-859: [GC 1839245K->1152387K(2723328K), 0.1041610 secs]
SUREFIRE-859: [GC 1853306K->1162460K(2742784K), 0.0725660 secs]

Results :

Tests run: 0, Failures: 0, Errors: 0, Skipped: 0

[WARNING] File encoding has not been set, using platform encoding ISO-8859-1, i.e. build is
platform dependent! The file encoding for reports output files should be provided by the POM
property ${project.reporting.outputEncoding}.
[INFO] 
[INFO] --- maven-failsafe-plugin:2.18.1:verify (verify) @ hbase-it ---
[INFO] Failsafe report directory: <https://builds.apache.org/job/HBase-1.2-IT/it.test=IntegrationTestBigLinkedList,jdk=latest1.7,label=Hadoop/ws/hbase-it/target/failsafe-reports>
[WARNING] File encoding has not been set, using platform encoding ISO-8859-1, i.e. build is
platform dependent! The file encoding for reports output files should be provided by the POM
property ${project.reporting.outputEncoding}.
[INFO] ------------------------------------------------------------------------
[INFO] Reactor Summary:
[INFO] 
[INFO] Apache HBase ...................................... SUCCESS [1:10.389s]
[INFO] Apache HBase - Checkstyle ......................... SUCCESS [4.486s]
[INFO] Apache HBase - Resource Bundle .................... SUCCESS [0.293s]
[INFO] Apache HBase - Annotations ........................ SUCCESS [1.078s]
[INFO] Apache HBase - Protocol ........................... SUCCESS [17.698s]
[INFO] Apache HBase - Common ............................. SUCCESS [1:20.813s]
[INFO] Apache HBase - Procedure .......................... SUCCESS [1.388s]
[INFO] Apache HBase - Client ............................. SUCCESS [13.696s]
[INFO] Apache HBase - Hadoop Compatibility ............... SUCCESS [0.956s]
[INFO] Apache HBase - Hadoop Two Compatibility ........... SUCCESS [2.861s]
[INFO] Apache HBase - Prefix Tree ........................ SUCCESS [1.518s]
[INFO] Apache HBase - Server ............................. SUCCESS [1:01.113s]
[INFO] Apache HBase - Testing Util ....................... SUCCESS [2.882s]
[INFO] Apache HBase - Thrift ............................. SUCCESS [6.840s]
[INFO] Apache HBase - Rest ............................... SUCCESS [2.846s]
[INFO] Apache HBase - Shell .............................. SUCCESS [7.255s]
[INFO] Apache HBase - Integration Tests .................. FAILURE [30:03.126s]
[INFO] Apache HBase - Examples ........................... SKIPPED
[INFO] Apache HBase - External Block Cache ............... SKIPPED
[INFO] Apache HBase - Assembly ........................... SKIPPED
[INFO] Apache HBase - Shaded ............................. SKIPPED
[INFO] Apache HBase - Shaded - Client .................... SKIPPED
[INFO] Apache HBase - Shaded - Server .................... SKIPPED
[INFO] ------------------------------------------------------------------------
[INFO] BUILD FAILURE
[INFO] ------------------------------------------------------------------------
[INFO] Total time: 34:58.959s
[INFO] Finished at: Tue Dec 22 00:03:53 UTC 2015
[INFO] Final Memory: 138M/1180M
[INFO] ------------------------------------------------------------------------
[ERROR] Failed to execute goal org.apache.maven.plugins:maven-failsafe-plugin:2.18.1:verify
(verify) on project hbase-it: There was a timeout or other error in the fork -> [Help 1]
[ERROR] 
[ERROR] To see the full stack trace of the errors, re-run Maven with the -e switch.
[ERROR] Re-run Maven using the -X switch to enable full debug logging.
[ERROR] 
[ERROR] For more information about the errors and possible solutions, please read the following
articles:
[ERROR] [Help 1] http://cwiki.apache.org/confluence/display/MAVEN/MojoFailureException
[ERROR] 
[ERROR] After correcting the problems, you can resume the build with the command
[ERROR]   mvn <goals> -rf :hbase-it
Build step 'Invoke top-level Maven targets' marked build as failure
Performing Post build task...
Match found for :.* : True
Logical operation result is TRUE
Running script  : # Post-build task script. TODO: Check this in and have all builds reference
check-in.
pwd && ls
# NOTE!!!! The below code has been copied and pasted from ./dev-tools/run-test.sh
# Do not change here without syncing there and vice-versa.
ZOMBIE_TESTS_COUNT=`jps -v | grep surefirebooter | grep -e '-Dhbase.test' | wc -l`
if [[ $ZOMBIE_TESTS_COUNT != 0 ]] ; then
 echo "Suspicious java process found - waiting 30s to see if there are just slow to stop"
 sleep 30
 ZOMBIE_TESTS_COUNT=`jps -v | grep surefirebooter | grep -e '-Dhbase.test' | wc -l`
 if [[ $ZOMBIE_TESTS_COUNT != 0 ]] ; then
   echo " {color:red}There appear to be $ZOMBIE_TESTS_COUNT zombie tests{color}, they should
have been killed by surefire but survived"
   jps -v | grep surefirebooter | grep -e '-Dhbase.test'
   jps -v | grep surefirebooter | grep -e '-Dhbase.test' | cut -d ' ' -f 1 | xargs -n 1 jstack
   # Exit with error
   exit 1
 else
   echo "We're ok: there is no zombie test, but some tests took some time to stop"
 fi
else
  echo "We're ok: there is no zombie test"
fi
[Hadoop] $ /bin/bash -xe /tmp/hudson1324339589049380045.sh
+ pwd
<https://builds.apache.org/job/HBase-1.2-IT/it.test=IntegrationTestBigLinkedList,jdk=latest1.7,label=Hadoop/ws/>
+ ls
bin
CHANGES.txt
conf
dev-support
hbase-annotations
hbase-assembly
hbase-checkstyle
hbase-client
hbase-common
hbase-examples
hbase-external-blockcache
hbase-hadoop2-compat
hbase-hadoop-compat
hbase-it
hbase-native-client
hbase-prefix-tree
hbase-procedure
hbase-protocol
hbase-resource-bundle
hbase-rest
hbase-server
hbase-shaded
hbase-shell
hbase-testing-util
hbase-thrift
LICENSE.txt
NOTICE.txt
pom.xml
README.txt
src
target
++ jps -v
++ grep surefirebooter
++ grep -e -Dhbase.test
++ wc -l
+ ZOMBIE_TESTS_COUNT=0
+ [[ 0 != 0 ]]
+ echo 'We'\''re ok: there is no zombie test'
We're ok: there is no zombie test
POST BUILD TASK : SUCCESS
END OF POST BUILD TASK : 0
Archiving artifacts

Mime
View raw message