hbase-builds mailing list archives

Site index · List index
Message view « Date » · « Thread »
Top « Date » · « Thread »
From Apache Jenkins Server <jenk...@builds.apache.org>
Subject Build failed in Jenkins: HBase-Trunk_matrix » latest1.8,Hadoop #581
Date Thu, 24 Dec 2015 01:14:32 GMT
See <https://builds.apache.org/job/HBase-Trunk_matrix/jdk=latest1.8,label=Hadoop/581/changes>

Changes:

[matteo.bertozzi] HBASE-15030 Deadlock in master TableNamespaceManager while running

------------------------------------------
[...truncated 13598 lines...]

  TestRestoreSnapshotFromClientWithRegionReplicas>TestRestoreSnapshotFromClient.testCorruptedSnapshot:293
Expected CorruptedSnapshotException got: org.apache.hadoop.hbase.client.RetriesExhaustedException:
Failed after attempts=7, exceptions:
Wed Dec 23 23:43:59 UTC 2015, RpcRetryingCaller{globalStartTime=1450914239890, pause=250,
maxAttempts=7}, java.io.IOException: Call to asf904.gq1.ygridcore.net/67.195.81.148:54331
failed on local exception: java.util.concurrent.ExecutionException: org.apache.hadoop.hbase.snapshot.CorruptedSnapshotException:
org.apache.hadoop.hbase.snapshot.CorruptedSnapshotException: Can't find hfile: 4d5eec2086ef41e3a9b13dcd3913b859
in the real (hdfs://localhost:33191/user/jenkins/test-data/4b511950-46b1-4397-9b61-9f390223f87d/data/default/testtb-1450914228474/0134ba1a3c37f7a3da4d7a37f5f4103a/cf/4d5eec2086ef41e3a9b13dcd3913b859)
or archive (hdfs://localhost:33191/user/jenkins/test-data/4b511950-46b1-4397-9b61-9f390223f87d/archive/data/default/testtb-1450914228474/0134ba1a3c37f7a3da4d7a37f5f4103a/cf/4d5eec2086ef41e3a9b13dcd3913b859)
directory for the primary table.
	at org.apache.hadoop.hbase.snapshot.SnapshotReferenceUtil.concurrentVisitReferencedFiles(SnapshotReferenceUtil.java:212)
	at org.apache.hadoop.hbase.snapshot.SnapshotReferenceUtil.verifySnapshot(SnapshotReferenceUtil.java:171)
	at org.apache.hadoop.hbase.master.snapshot.SnapshotManager.restoreSnapshot(SnapshotManager.java:711)
	at org.apache.hadoop.hbase.master.MasterRpcServices.restoreSnapshot(MasterRpcServices.java:1313)
	at org.apache.hadoop.hbase.protobuf.generated.MasterProtos$MasterService$2.callBlockingMethod(MasterProtos.java:57974)
	at org.apache.hadoop.hbase.ipc.RpcServer.call(RpcServer.java:2224)
	at org.apache.hadoop.hbase.ipc.CallRunner.run(CallRunner.java:109)
	at org.apache.hadoop.hbase.ipc.RpcExecutor.consumerLoop(RpcExecutor.java:133)
	at org.apache.hadoop.hbase.ipc.RpcExecutor$1.run(RpcExecutor.java:108)
	at java.lang.Thread.run(Thread.java:745)

Wed Dec 23 23:44:00 UTC 2015, RpcRetryingCaller{globalStartTime=1450914239890, pause=250,
maxAttempts=7}, java.io.IOException: Call to asf904.gq1.ygridcore.net/67.195.81.148:54331
failed on local exception: java.util.concurrent.ExecutionException: org.apache.hadoop.hbase.snapshot.CorruptedSnapshotException:
org.apache.hadoop.hbase.snapshot.CorruptedSnapshotException: Can't find hfile: 4d5eec2086ef41e3a9b13dcd3913b859
in the real (hdfs://localhost:33191/user/jenkins/test-data/4b511950-46b1-4397-9b61-9f390223f87d/data/default/testtb-1450914228474/0134ba1a3c37f7a3da4d7a37f5f4103a/cf/4d5eec2086ef41e3a9b13dcd3913b859)
or archive (hdfs://localhost:33191/user/jenkins/test-data/4b511950-46b1-4397-9b61-9f390223f87d/archive/data/default/testtb-1450914228474/0134ba1a3c37f7a3da4d7a37f5f4103a/cf/4d5eec2086ef41e3a9b13dcd3913b859)
directory for the primary table.
	at org.apache.hadoop.hbase.snapshot.SnapshotReferenceUtil.concurrentVisitReferencedFiles(SnapshotReferenceUtil.java:212)
	at org.apache.hadoop.hbase.snapshot.SnapshotReferenceUtil.verifySnapshot(SnapshotReferenceUtil.java:171)
	at org.apache.hadoop.hbase.master.snapshot.SnapshotManager.restoreSnapshot(SnapshotManager.java:711)
	at org.apache.hadoop.hbase.master.MasterRpcServices.restoreSnapshot(MasterRpcServices.java:1313)
	at org.apache.hadoop.hbase.protobuf.generated.MasterProtos$MasterService$2.callBlockingMethod(MasterProtos.java:57974)
	at org.apache.hadoop.hbase.ipc.RpcServer.call(RpcServer.java:2224)
	at org.apache.hadoop.hbase.ipc.CallRunner.run(CallRunner.java:109)
	at org.apache.hadoop.hbase.ipc.RpcExecutor.consumerLoop(RpcExecutor.java:133)
	at org.apache.hadoop.hbase.ipc.RpcExecutor$1.run(RpcExecutor.java:108)
	at java.lang.Thread.run(Thread.java:745)

Wed Dec 23 23:44:01 UTC 2015, RpcRetryingCaller{globalStartTime=1450914239890, pause=250,
maxAttempts=7}, java.io.IOException: Call to asf904.gq1.ygridcore.net/67.195.81.148:54331
failed on local exception: java.util.concurrent.ExecutionException: org.apache.hadoop.hbase.snapshot.CorruptedSnapshotException:
org.apache.hadoop.hbase.snapshot.CorruptedSnapshotException: Can't find hfile: 4d5eec2086ef41e3a9b13dcd3913b859
in the real (hdfs://localhost:33191/user/jenkins/test-data/4b511950-46b1-4397-9b61-9f390223f87d/data/default/testtb-1450914228474/0134ba1a3c37f7a3da4d7a37f5f4103a/cf/4d5eec2086ef41e3a9b13dcd3913b859)
or archive (hdfs://localhost:33191/user/jenkins/test-data/4b511950-46b1-4397-9b61-9f390223f87d/archive/data/default/testtb-1450914228474/0134ba1a3c37f7a3da4d7a37f5f4103a/cf/4d5eec2086ef41e3a9b13dcd3913b859)
directory for the primary table.
	at org.apache.hadoop.hbase.snapshot.SnapshotReferenceUtil.concurrentVisitReferencedFiles(SnapshotReferenceUtil.java:212)
	at org.apache.hadoop.hbase.snapshot.SnapshotReferenceUtil.verifySnapshot(SnapshotReferenceUtil.java:171)
	at org.apache.hadoop.hbase.master.snapshot.SnapshotManager.restoreSnapshot(SnapshotManager.java:711)
	at org.apache.hadoop.hbase.master.MasterRpcServices.restoreSnapshot(MasterRpcServices.java:1313)
	at org.apache.hadoop.hbase.protobuf.generated.MasterProtos$MasterService$2.callBlockingMethod(MasterProtos.java:57974)
	at org.apache.hadoop.hbase.ipc.RpcServer.call(RpcServer.java:2224)
	at org.apache.hadoop.hbase.ipc.CallRunner.run(CallRunner.java:109)
	at org.apache.hadoop.hbase.ipc.RpcExecutor.consumerLoop(RpcExecutor.java:133)
	at org.apache.hadoop.hbase.ipc.RpcExecutor$1.run(RpcExecutor.java:108)
	at java.lang.Thread.run(Thread.java:745)

Wed Dec 23 23:44:02 UTC 2015, RpcRetryingCaller{globalStartTime=1450914239890, pause=250,
maxAttempts=7}, java.io.IOException: Call to asf904.gq1.ygridcore.net/67.195.81.148:54331
failed on local exception: java.util.concurrent.ExecutionException: org.apache.hadoop.hbase.snapshot.CorruptedSnapshotException:
org.apache.hadoop.hbase.snapshot.CorruptedSnapshotException: Can't find hfile: 4d5eec2086ef41e3a9b13dcd3913b859
in the real (hdfs://localhost:33191/user/jenkins/test-data/4b511950-46b1-4397-9b61-9f390223f87d/data/default/testtb-1450914228474/0134ba1a3c37f7a3da4d7a37f5f4103a/cf/4d5eec2086ef41e3a9b13dcd3913b859)
or archive (hdfs://localhost:33191/user/jenkins/test-data/4b511950-46b1-4397-9b61-9f390223f87d/archive/data/default/testtb-1450914228474/0134ba1a3c37f7a3da4d7a37f5f4103a/cf/4d5eec2086ef41e3a9b13dcd3913b859)
directory for the primary table.
	at org.apache.hadoop.hbase.snapshot.SnapshotReferenceUtil.concurrentVisitReferencedFiles(SnapshotReferenceUtil.java:212)
	at org.apache.hadoop.hbase.snapshot.SnapshotReferenceUtil.verifySnapshot(SnapshotReferenceUtil.java:171)
	at org.apache.hadoop.hbase.master.snapshot.SnapshotManager.restoreSnapshot(SnapshotManager.java:711)
	at org.apache.hadoop.hbase.master.MasterRpcServices.restoreSnapshot(MasterRpcServices.java:1313)
	at org.apache.hadoop.hbase.protobuf.generated.MasterProtos$MasterService$2.callBlockingMethod(MasterProtos.java:57974)
	at org.apache.hadoop.hbase.ipc.RpcServer.call(RpcServer.java:2224)
	at org.apache.hadoop.hbase.ipc.CallRunner.run(CallRunner.java:109)
	at org.apache.hadoop.hbase.ipc.RpcExecutor.consumerLoop(RpcExecutor.java:133)
	at org.apache.hadoop.hbase.ipc.RpcExecutor$1.run(RpcExecutor.java:108)
	at java.lang.Thread.run(Thread.java:745)

Wed Dec 23 23:44:05 UTC 2015, RpcRetryingCaller{globalStartTime=1450914239890, pause=250,
maxAttempts=7}, java.io.IOException: Call to asf904.gq1.ygridcore.net/67.195.81.148:54331
failed on local exception: java.util.concurrent.ExecutionException: org.apache.hadoop.hbase.snapshot.CorruptedSnapshotException:
org.apache.hadoop.hbase.snapshot.CorruptedSnapshotException: Can't find hfile: 4d5eec2086ef41e3a9b13dcd3913b859
in the real (hdfs://localhost:33191/user/jenkins/test-data/4b511950-46b1-4397-9b61-9f390223f87d/data/default/testtb-1450914228474/0134ba1a3c37f7a3da4d7a37f5f4103a/cf/4d5eec2086ef41e3a9b13dcd3913b859)
or archive (hdfs://localhost:33191/user/jenkins/test-data/4b511950-46b1-4397-9b61-9f390223f87d/archive/data/default/testtb-1450914228474/0134ba1a3c37f7a3da4d7a37f5f4103a/cf/4d5eec2086ef41e3a9b13dcd3913b859)
directory for the primary table.
	at org.apache.hadoop.hbase.snapshot.SnapshotReferenceUtil.concurrentVisitReferencedFiles(SnapshotReferenceUtil.java:212)
	at org.apache.hadoop.hbase.snapshot.SnapshotReferenceUtil.verifySnapshot(SnapshotReferenceUtil.java:171)
	at org.apache.hadoop.hbase.master.snapshot.SnapshotManager.restoreSnapshot(SnapshotManager.java:711)
	at org.apache.hadoop.hbase.master.MasterRpcServices.restoreSnapshot(MasterRpcServices.java:1313)
	at org.apache.hadoop.hbase.protobuf.generated.MasterProtos$MasterService$2.callBlockingMethod(MasterProtos.java:57974)
	at org.apache.hadoop.hbase.ipc.RpcServer.call(RpcServer.java:2224)
	at org.apache.hadoop.hbase.ipc.CallRunner.run(CallRunner.java:109)
	at org.apache.hadoop.hbase.ipc.RpcExecutor.consumerLoop(RpcExecutor.java:133)
	at org.apache.hadoop.hbase.ipc.RpcExecutor$1.run(RpcExecutor.java:108)
	at java.lang.Thread.run(Thread.java:745)

Wed Dec 23 23:44:10 UTC 2015, RpcRetryingCaller{globalStartTime=1450914239890, pause=250,
maxAttempts=7}, java.io.IOException: Call to asf904.gq1.ygridcore.net/67.195.81.148:54331
failed on local exception: java.util.concurrent.ExecutionException: org.apache.hadoop.hbase.snapshot.CorruptedSnapshotException:
org.apache.hadoop.hbase.snapshot.CorruptedSnapshotException: Can't find hfile: 4d5eec2086ef41e3a9b13dcd3913b859
in the real (hdfs://localhost:33191/user/jenkins/test-data/4b511950-46b1-4397-9b61-9f390223f87d/data/default/testtb-1450914228474/0134ba1a3c37f7a3da4d7a37f5f4103a/cf/4d5eec2086ef41e3a9b13dcd3913b859)
or archive (hdfs://localhost:33191/user/jenkins/test-data/4b511950-46b1-4397-9b61-9f390223f87d/archive/data/default/testtb-1450914228474/0134ba1a3c37f7a3da4d7a37f5f4103a/cf/4d5eec2086ef41e3a9b13dcd3913b859)
directory for the primary table.
	at org.apache.hadoop.hbase.snapshot.SnapshotReferenceUtil.concurrentVisitReferencedFiles(SnapshotReferenceUtil.java:212)
	at org.apache.hadoop.hbase.snapshot.SnapshotReferenceUtil.verifySnapshot(SnapshotReferenceUtil.java:171)
	at org.apache.hadoop.hbase.master.snapshot.SnapshotManager.restoreSnapshot(SnapshotManager.java:711)
	at org.apache.hadoop.hbase.master.MasterRpcServices.restoreSnapshot(MasterRpcServices.java:1313)
	at org.apache.hadoop.hbase.protobuf.generated.MasterProtos$MasterService$2.callBlockingMethod(MasterProtos.java:57974)
	at org.apache.hadoop.hbase.ipc.RpcServer.call(RpcServer.java:2224)
	at org.apache.hadoop.hbase.ipc.CallRunner.run(CallRunner.java:109)
	at org.apache.hadoop.hbase.ipc.RpcExecutor.consumerLoop(RpcExecutor.java:133)
	at org.apache.hadoop.hbase.ipc.RpcExecutor$1.run(RpcExecutor.java:108)
	at java.lang.Thread.run(Thread.java:745)

Wed Dec 23 23:44:20 UTC 2015, RpcRetryingCaller{globalStartTime=1450914239890, pause=250,
maxAttempts=7}, java.io.IOException: Call to asf904.gq1.ygridcore.net/67.195.81.148:54331
failed on local exception: java.util.concurrent.ExecutionException: org.apache.hadoop.hbase.snapshot.CorruptedSnapshotException:
org.apache.hadoop.hbase.snapshot.CorruptedSnapshotException: Can't find hfile: 4d5eec2086ef41e3a9b13dcd3913b859
in the real (hdfs://localhost:33191/user/jenkins/test-data/4b511950-46b1-4397-9b61-9f390223f87d/data/default/testtb-1450914228474/0134ba1a3c37f7a3da4d7a37f5f4103a/cf/4d5eec2086ef41e3a9b13dcd3913b859)
or archive (hdfs://localhost:33191/user/jenkins/test-data/4b511950-46b1-4397-9b61-9f390223f87d/archive/data/default/testtb-1450914228474/0134ba1a3c37f7a3da4d7a37f5f4103a/cf/4d5eec2086ef41e3a9b13dcd3913b859)
directory for the primary table.
	at org.apache.hadoop.hbase.snapshot.SnapshotReferenceUtil.concurrentVisitReferencedFiles(SnapshotReferenceUtil.java:212)
	at org.apache.hadoop.hbase.snapshot.SnapshotReferenceUtil.verifySnapshot(SnapshotReferenceUtil.java:171)
	at org.apache.hadoop.hbase.master.snapshot.SnapshotManager.restoreSnapshot(SnapshotManager.java:711)
	at org.apache.hadoop.hbase.master.MasterRpcServices.restoreSnapshot(MasterRpcServices.java:1313)
	at org.apache.hadoop.hbase.protobuf.generated.MasterProtos$MasterService$2.callBlockingMethod(MasterProtos.java:57974)
	at org.apache.hadoop.hbase.ipc.RpcServer.call(RpcServer.java:2224)
	at org.apache.hadoop.hbase.ipc.CallRunner.run(CallRunner.java:109)
	at org.apache.hadoop.hbase.ipc.RpcExecutor.consumerLoop(RpcExecutor.java:133)
	at org.apache.hadoop.hbase.ipc.RpcExecutor$1.run(RpcExecutor.java:108)
	at java.lang.Thread.run(Thread.java:745)


  TestMasterCoprocessorExceptionWithRemove.testExceptionFromCoprocessorWhenCreatingTable:202
null
  TestAssignmentManagerOnCluster.testRestartMetaRegionServer:129 Waiting timed out after [60,000]
msec found in transition: {b7412acfbcece553cd01558c0f1ade1d={b7412acfbcece553cd01558c0f1ade1d
state=FAILED_CLOSE, ts=1450909886235, server=asf904.gq1.ygridcore.net,53625,1450909885942}}
  TestHMasterRPCException.testRPCException:106 null
  TestMaster.testMoveThrowsUnknownRegionException:157 null
  TestMasterFailover.testPendingOpenOrCloseWhenMasterFailover:308 Waiting timed out after
[60,000] msec found in transition: {e5d9b48a77d1daa36b7de4e61f2f8fa7={e5d9b48a77d1daa36b7de4e61f2f8fa7
state=FAILED_CLOSE, ts=1450909845522, server=asf904.gq1.ygridcore.net,41310,1450909835654}}
  TestModifyNamespaceProcedure.testRollbackAndDoubleExecution:278 expected null, but was:<bar>
  TestZKProcedure.testMultiCohortWithMemberTimeoutDuringPrepare:323->waitAndVerifyProc:347

procedure.sendGlobalBarrierReached();
Never wanted here:
-> at org.apache.hadoop.hbase.procedure.TestZKProcedure.waitAndVerifyProc(TestZKProcedure.java:347)
But invoked here:
-> at org.apache.hadoop.hbase.procedure.Procedure.call(Procedure.java:213)

  TestQuotaThrottle.testNamespaceGlobalReadAndWriteThrottle:390 expected:<6> but was:<3>
  TestQuotaThrottle.testNamespaceGlobalThrottle:368 expected:<6> but was:<100>
  TestQuotaThrottle.testTableGlobalThrottle:308 expected:<30> but was:<0>
  TestQuotaThrottle.testUserGlobalReadAndWriteThrottle:151 expected:<60> but was:<6>
  TestQuotaThrottle.testUserGlobalThrottle:136 expected:<60> but was:<6>
  TestQuotaThrottle.testUserTableThrottle:183 expected:<6> but was:<3>
  TestMobStoreScanner.testReadFromCorruptMobFiles:233 expected:<...apache.hadoop.hbase.[io.hfile.CorruptHFile]Exception>
but was:<...apache.hadoop.hbase.[client.RetriesExhausted]Exception>
  TestRegionMergeTransactionOnCluster.testMerge:314 Exception should mention regions not online
  TestNamespaceCommands.testAclTableEntries:202 expected:<6> but was:<7>
  TestNamespaceCommands.testGrantRevoke:442->SecureTestUtil.verifyDenied:215->SecureTestUtil.verifyDenied:299
Expected exception was not thrown for user 'global_create'
  TestFlushSnapshotFromClient.testConcurrentSnapshottingAttempts:487 We expect at least 1
request to be rejected because of we concurrently issued many requests
  TestHBaseFsckReplicas.testHbckWithRegionReplica:114 expected:<[]> but was:<[EMPTY_META_CELL]>
  TestHBaseFsckTwoRS.testFixAssignmentsWhenMETAinTransition:123 expected:<[]> but was:<[NOT_DEPLOYED,
HOLE_IN_REGION_CHAIN]>
  TestHBaseFsckTwoRS.testLingeringReferenceFile:278 expected:<[LINGERING_REFERENCE_HFILE]>
but was:<[NOT_DEPLOYED, HOLE_IN_REGION_CHAIN, LINGERING_REFERENCE_HFILE]>
  TestHBaseFsckTwoRS.testMetaOffline:292 expected:<[]> but was:<[NOT_DEPLOYED, HOLE_IN_REGION_CHAIN]>
  TestHBaseFsckTwoRS.testSidelineOverlapRegion:331 expected:<[DUPE_STARTKEYS, DUPE_STARTKEYS,
OVERLAP_IN_REGION_CHAIN]> but was:<[NOT_DEPLOYED, DUPE_STARTKEYS, DUPE_STARTKEYS, HOLE_IN_REGION_CHAIN,
OVERLAP_IN_REGION_CHAIN]>
Tests in error: 
  TestAdmin1.testDeleteLastColumnFamily:1323 » RetriesExhausted Failed after att...
  TestAdmin1.testEnableDisableAddColumnDeleteColumn:1305 » RetriesExhausted Fail...
  TestAdmin1.testShouldFailOnlineSchemaUpdateIfOnlineSchemaIsNotEnabled:619 » RetriesExhausted
  TestAdmin1.testSplitAndMergeWithReplicaTable:1257 » IO Call to asf904.gq1.ygri...
  TestCloneSnapshotFromClient.testCloneNonExistentSnapshot »  Unexpected excepti...
  TestCloneSnapshotFromClient.testCloneOnMissingNamespace »  Unexpected exceptio...
  TestCloneSnapshotFromClientWithRegionReplicas.testCloneNonExistentSnapshot »  ...
  TestCloneSnapshotFromClientWithRegionReplicas.testCloneOnMissingNamespace »  U...
  TestLeaseRenewal.testLeaseRenewal:106 » RetriesExhausted Failed after attempts...
  TestMetaWithReplicas.testHBaseFsckWithFewerMetaReplicaZnodes:353 » IO Region {...
  TestMetaWithReplicas.testHBaseFsckWithFewerMetaReplicas:335 » IO Region {ENCOD...
  TestMobCloneSnapshotFromClient.testCloneNonExistentSnapshot »  Unexpected exce...
  TestMobCloneSnapshotFromClient.testCloneOnMissingNamespace »  Unexpected excep...
  TestMobRestoreSnapshotFromClient.testRestoreSchemaChange » RetriesExhausted Fa...
  TestMobSnapshotFromClient>TestSnapshotFromClient.testSnapshotFailsOnNonExistantTable:265->Object.wait:-2
» TestTimedOut
  TestMultiParallel.testNonceCollision:527->Object.wait:-2 » TestTimedOut test t...
  TestRestoreSnapshotFromClient.testRestoreSchemaChange » RetriesExhausted Faile...
  TestRestoreSnapshotFromClientWithRegionReplicas.testRestoreSchemaChange » RetriesExhausted
  TestScannersFromClientSide.testScanOnReopenedRegion:645 » RetriesExhausted Fai...
  TestSnapshotFromClient.testSnapshotFailsOnNonExistantTable:265->Object.wait:-2 » TestTimedOut
  TestSnapshotFromClientWithRegionReplicas>TestSnapshotFromClient.testSnapshotFailsOnNonExistantTable:265->Object.wait:-2
» TestTimedOut
  TestRegionServerCoprocessorEndpoint.testEndpointExceptions:102 ClassCast java....
  TestAssignmentManagerOnCluster.testAssignDisabledRegionBySSH:1071 » TestTimedOut
  TestAssignmentManagerOnCluster.testAssignOfflinedRegionBySSH:991 » TestTimedOut
  TestAssignmentManagerOnCluster.testMoveRegionOfDeletedTable:388->Object.wait:-2 » TestTimedOut
  TestAssignmentManagerOnCluster.testOpenFailedUnrecoverable:603->Object.wait:-2 » TestTimedOut
  TestAssignmentManagerOnCluster.testSSHWaitForServerToAssignRegion:881 » TestTimedOut
  TestTableDeleteFamilyHandler.deleteColumnFamilyTwice:269 » RetriesExhausted Fa...
  TestCreateNamespaceProcedure.testRollbackAndDoubleExecution:277->Object.wait:-2 » TestTimedOut
  TestDeleteNamespaceProcedure.testDeleteNamespace:110->validateNamespaceNotExist:277->Object.wait:-2
» TestTimedOut
  TestDeleteNamespaceProcedure.testDeleteNonExistNamespace:118->validateNamespaceNotExist:277->Object.wait:-2
» TestTimedOut
  TestDeleteNamespaceProcedure.testDeleteSameNamespaceTwiceWithSameNonce:192->validateNamespaceNotExist:277->Object.wait:-2
» TestTimedOut
  TestDeleteNamespaceProcedure.testRecoveryAndDoubleExecution:226->validateNamespaceNotExist:277->Object.wait:-2
» TestTimedOut
  TestModifyNamespaceProcedure.testModifyNonExistNamespace:136->Object.wait:-2 » TestTimedOut
  TestNamespaceAuditor.testCloneSnapshotQuotaExceed »  Unexpected exception, exp...
  TestQuotaThrottle.testTableGlobalReadAndWriteThrottle:330->doGets:534 » RetriesExhausted
  TestQuotaThrottle.testUserAndTableThrottle:433->doGets:534 » RetriesExhausted ...
  TestQuotaThrottle.testUserGlobalBypassThrottle:476->doGets:534 » RetriesExhausted
  TestQuotaThrottle.testUserNamespaceReadAndWriteThrottle:275->doGets:534 » RetriesExhausted
  TestQuotaThrottle.testUserNamespaceThrottle:258->triggerUserCacheRefresh:545->triggerCacheRefresh:578
» TestTimedOut
  TestQuotaThrottle.testUserTableReadAndWriteThrottle:209->doGets:534 » RetriesExhausted
  TestCorruptedRegionStoreFile.testLosingFileAfterScannerInit:173->fullScanAndCount:227
» RetriesExhausted
  TestCorruptedRegionStoreFile.testLosingFileDuringScan:147->fullScanAndCount:227 » RetriesExhausted
  TestAccessController2.testACLTableAccess:333->SecureTestUtil.verifyDenied:215->SecureTestUtil.verifyDenied:257->Object.wait:460->Object.wait:-2
» TestTimedOut
  TestAccessController2.testCreateTableWithGroupPermissions:230->SecureTestUtil.verifyDenied:215->SecureTestUtil.verifyDenied:257->Object.wait:-2
» TestTimedOut
  TestAccessController2.testPostGrantAndRevokeScanAction:465->SecureTestUtil.verifyDenied:257->Object.wait:460->Object.wait:-2
» TestTimedOut
  TestCellACLs.testCellPermissions:335->SecureTestUtil.verifyDenied:215->SecureTestUtil.verifyDenied:257->Object.wait:-2
» TestTimedOut
  TestGenerateDelegationToken.test:173->testTokenAuth:160 ClassCast org.apache.h...
  TestFlushSnapshotFromClient.testSnapshotFailsOnNonExistantTable:259->Object.wait:-2 »
TestTimedOut
  TestMobRestoreFlushSnapshotFromClient.testCloneNonExistentSnapshot »  Unexpect...
  TestRestoreFlushSnapshotFromClient.testCloneNonExistentSnapshot »  Unexpected ...
  TestSnapshotClientRetries.testCloneNonExistentSnapshot:74->cloneAndAssertOneRetry:112->Object.wait:-2
» TestTimedOut
  TestSnapshotClientRetries.testSnapshotAlreadyExist:68->snapshotAndAssertOneRetry:104->Object.wait:-2
» TestTimedOut
  TestHBaseFsckReplicas.testHbckWithExcessReplica:198->BaseTestHBaseFsck.cleanupTable:322->BaseTestHBaseFsck.deleteTable:642
» TestTimedOut
  TestHBaseFsckReplicas.testHbckWithFewerReplica:140->BaseTestHBaseFsck.cleanupTable:322->BaseTestHBaseFsck.deleteTable:642
» TestTimedOut
  TestHBaseFsckReplicas.testNotInHdfsWithReplicas:269->BaseTestHBaseFsck.cleanupTable:322->BaseTestHBaseFsck.deleteTable:642
» TestTimedOut
  TestHBaseFsckTwoRS.testHBaseFsck:446 » IO 1 region(s) could not be checked or ...

Tests run: 2088, Failures: 30, Errors: 57, Skipped: 26

[INFO] ------------------------------------------------------------------------
[INFO] Reactor Summary:
[INFO] 
[INFO] Apache HBase ...................................... SUCCESS [  5.411 s]
[INFO] Apache HBase - Checkstyle ......................... SUCCESS [  0.903 s]
[INFO] Apache HBase - Resource Bundle .................... SUCCESS [  0.284 s]
[INFO] Apache HBase - Annotations ........................ SUCCESS [  0.378 s]
[INFO] Apache HBase - Protocol ........................... SUCCESS [  2.968 s]
[INFO] Apache HBase - Common ............................. SUCCESS [02:03 min]
[INFO] Apache HBase - Procedure .......................... SUCCESS [02:43 min]
[INFO] Apache HBase - Client ............................. SUCCESS [ 50.196 s]
[INFO] Apache HBase - Hadoop Compatibility ............... SUCCESS [  9.012 s]
[INFO] Apache HBase - Hadoop Two Compatibility ........... SUCCESS [ 12.358 s]
[INFO] Apache HBase - Prefix Tree ........................ SUCCESS [ 14.225 s]
[INFO] Apache HBase - Server ............................. FAILURE [  03:07 h]
[INFO] Apache HBase - Testing Util ....................... SKIPPED
[INFO] Apache HBase - Thrift ............................. SKIPPED
[INFO] Apache HBase - Shell .............................. SKIPPED
[INFO] Apache HBase - Integration Tests .................. SKIPPED
[INFO] Apache HBase - Examples ........................... SKIPPED
[INFO] Apache HBase - Rest ............................... SKIPPED
[INFO] Apache HBase - External Block Cache ............... SKIPPED
[INFO] Apache HBase - Assembly ........................... SKIPPED
[INFO] Apache HBase - Shaded ............................. SKIPPED
[INFO] Apache HBase - Shaded - Client .................... SKIPPED
[INFO] Apache HBase - Shaded - Server .................... SKIPPED
[INFO] Apache HBase - Spark .............................. SKIPPED
[INFO] ------------------------------------------------------------------------
[INFO] BUILD FAILURE
[INFO] ------------------------------------------------------------------------
[INFO] Total time: 03:14 h
[INFO] Finished at: 2015-12-24T01:09:29+00:00
[INFO] Final Memory: 401M/2545M
[INFO] ------------------------------------------------------------------------
[ERROR] Failed to execute goal org.apache.maven.plugins:maven-surefire-plugin:2.18.1:test
(secondPartTestsExecution) on project hbase-server: There was a timeout or other error in
the fork -> [Help 1]
[ERROR] 
[ERROR] To see the full stack trace of the errors, re-run Maven with the -e switch.
[ERROR] Re-run Maven using the -X switch to enable full debug logging.
[ERROR] 
[ERROR] For more information about the errors and possible solutions, please read the following
articles:
[ERROR] [Help 1] http://cwiki.apache.org/confluence/display/MAVEN/MojoFailureException
[ERROR] 
[ERROR] After correcting the problems, you can resume the build with the command
[ERROR]   mvn <goals> -rf :hbase-server
Build step 'Invoke top-level Maven targets' marked build as failure
Performing Post build task...
Match found for :.* : True
Logical operation result is TRUE
Running script  : # Run zombie detector script
./dev-support/zombie-detector.sh --jenkins ${BUILD_ID}
[Hadoop] $ /bin/bash -xe /tmp/hudson1342653641273898779.sh
+ ./dev-support/zombie-detector.sh --jenkins 581
Thu Dec 24 01:09:32 UTC 2015 Found 8 suspicious java process(es) listed below; waiting 30s
to see if just slow to stop
32625 surefirebooter6695751337578318104.jar -enableassertions -Dhbase.build.id=581 -Xmx2800m
-XX:MaxPermSize=256m -Djava.security.egd=file:/dev/./urandom -Djava.net.preferIPv4Stack=true
-Djava.awt.headless=true 28247 surefirebooter5897950034964218463.jar -enableassertions -Dhbase.build.id=581
-Xmx2800m -XX:MaxPermSize=256m -Djava.security.egd=file:/dev/./urandom -Djava.net.preferIPv4Stack=true
-Djava.awt.headless=true 26297 surefirebooter8216146837649452746.jar -enableassertions -Dhbase.build.id=581
-Xmx2800m -XX:MaxPermSize=256m -Djava.security.egd=file:/dev/./urandom -Djava.net.preferIPv4Stack=true
-Djava.awt.headless=true 19387 surefirebooter7920483539487275308.jar -enableassertions -Dhbase.build.id=581
-Xmx2800m -XX:MaxPermSize=256m -Djava.security.egd=file:/dev/./urandom -Djava.net.preferIPv4Stack=true
-Djava.awt.headless=true 9116 surefirebooter1463775144374249354.jar -enableassertions -Dhbase.build.id=581
-Xmx2800m -XX:MaxPermSize=256m -Djava.security.egd=file:/dev/./urandom -Djava.net.preferIPv4Stack=true
-Djava.awt.headless=true 3885 surefirebooter3205949170585365747.jar -enableassertions -Dhbase.build.id=581
-Xmx2800m -XX:MaxPermSize=256m -Djava.security.egd=file:/dev/./urandom -Djava.net.preferIPv4Stack=true
-Djava.awt.headless=true 15726 surefirebooter7609143894810701743.jar -enableassertions -Dhbase.build.id=581
-Xmx2800m -XX:MaxPermSize=256m -Djava.security.egd=file:/dev/./urandom -Djava.net.preferIPv4Stack=true
-Djava.awt.headless=true 20190 surefirebooter396243347237459218.jar -enableassertions -Dhbase.build.id=581
-Xmx2800m -XX:MaxPermSize=256m -Djava.security.egd=file:/dev/./urandom -Djava.net.preferIPv4Stack=true
-Djava.awt.headless=true
tail: cannot open '+2' for reading: No such file or directory
tail: cannot open '+2' for reading: No such file or directory
tail: cannot open '+2' for reading: No such file or directory
tail: cannot open '+2' for reading: No such file or directory
tail: cannot open '+2' for reading: No such file or directory
tail: cannot open '+2' for reading: No such file or directory
tail: cannot open '+2' for reading: No such file or directory
tail: cannot open '+2' for reading: No such file or directory
Thu Dec 24 01:10:02 UTC 2015 We're ok: there was a zombie candidate but it went away


    {color:green}+1 zombies{color}. No zombie tests found running at the end of the build
(There were candidates but they seem to have gone away).
POST BUILD TASK : SUCCESS
END OF POST BUILD TASK : 0
Archiving artifacts
Recording test results
[FINDBUGS] Skipping publisher since build result is FAILURE
[CHECKSTYLE] Skipping publisher since build result is FAILURE

Mime
View raw message