hbase-builds mailing list archives

Site index · List index
Message view « Date » · « Thread »
Top « Date » · « Thread »
From Apache Jenkins Server <jenk...@builds.apache.org>
Subject Build failed in Jenkins: HBase-1.3-IT » IntegrationTestImportTsv,latest1.7,Hadoop #357
Date Sat, 05 Dec 2015 05:02:17 GMT
See <https://builds.apache.org/job/HBase-1.3-IT/it.test=IntegrationTestImportTsv,jdk=latest1.7,label=Hadoop/357/changes>

Changes:

[eclark] HBASE-14922 Delayed flush doesn't work causing flush storms. -- ADD

[apurtell] HBASE-14923 VerifyReplication should not mask the exception during

[apurtell] HBASE-14930 check_compatibility.sh needs smarter exit codes

------------------------------------------
[...truncated 49148 lines...]
SUREFIRE-859: [GC 1486805K->99893K(1906688K), 0.0462730 secs]
SUREFIRE-859: [GC 1486901K->99941K(1908224K), 0.0393310 secs]
SUREFIRE-859: [GC 1488997K->99949K(1908224K), 0.0128190 secs]
SUREFIRE-859: [GC 1489005K->99977K(1908736K), 0.0744340 secs]
2015-12-05 04:52:09\2C966 ERROR [asf909.gq1.ygridcore.net\2C51545\2C1449291037100_ChoreService_55644]
server.NIOServerCnxnFactory$1(44): Thread Thread[asf909.gq1.ygridcore.net\2C51545\2C1449291037100_ChoreService_55644\2C5\2Cmain]
died\0Ajava.lang.IllegalArgumentException\0A\09at java.util.concurrent.ThreadLocalRandom.nextLong(ThreadLocalRandom.java:190)\0A\09at
org.apache.hadoop.hbase.JitterScheduledThreadPoolExecutorImpl$JitteredRunnableScheduledFuture.getDelay(JitterScheduledThreadPoolExecutorImpl.java:84)\0A\09at
java.util.concurrent.ScheduledThreadPoolExecutor$DelayedWorkQueue.take(ScheduledThreadPoolExecutor.java:1081)\0A\09at
java.util.concurrent.ScheduledThreadPoolExecutor$DelayedWorkQueue.take(ScheduledThreadPoolExecutor.java:807)\0A\09at
java.util.concurrent.ThreadPoolExecutor.getTask(ThreadPoolExecutor.java:1068)\0A\09at java.util.concurrent.ThreadPoolExecutor.runWorker(ThreadPoolExecutor.java:1130)\0A\09at
java.util.concurrent.ThreadPoolExecutor$Worker.run(ThreadPoolExecutor.java:615)\0A\09at java.lang.Thread.run(Thread.java:745)\0A
SUREFIRE-859: [GC 1490025K->99993K(1909248K), 0.0621360 secs]
SUREFIRE-859: [GC 1491097K->100017K(1909248K), 0.0590110 secs]
SUREFIRE-859: [GC 1491121K->100169K(1909760K), 0.0117770 secs]
SUREFIRE-859: [GC 1492297K->100057K(1909760K), 0.0096090 secs]
SUREFIRE-859: [GC 1492185K->100017K(1909760K), 0.0116890 secs]
SUREFIRE-859: [GC 1493169K->100073K(1910272K), 0.0245790 secs]
SUREFIRE-859: [GC 1493225K->100257K(1911296K), 0.0214710 secs]
SUREFIRE-859: [GC 1494433K->100105K(1911296K), 0.0418010 secs]
SUREFIRE-859: [GC 1494281K->100161K(1910272K), 0.0481250 secs]
SUREFIRE-859: [GC 1494337K->100153K(1910784K), 0.0086940 secs]
SUREFIRE-859: [GC 1494329K->100193K(1911808K), 0.0666920 secs]
SUREFIRE-859: [GC 1495393K->100281K(1911808K), 0.0401270 secs]
SUREFIRE-859: [GC 1495481K->100225K(1911808K), 0.0147220 secs]
SUREFIRE-859: [GC 1495425K->100217K(1910784K), 0.0330630 secs]
SUREFIRE-859: [GC 1495417K->100305K(1911296K), 0.0382970 secs]
SUREFIRE-859: [GC 1495505K->100233K(1911296K), 0.0749840 secs]
SUREFIRE-859: [GC 1495433K->100249K(1912320K), 0.0424730 secs]
SUREFIRE-859: [GC 1496473K->100265K(1912320K), 0.0192700 secs]
SUREFIRE-859: [GC 1496489K->100377K(1912320K), 0.0737510 secs]
SUREFIRE-859: [GC 1496601K->100393K(1912320K), 0.0820050 secs]
SUREFIRE-859: [GC 1496617K->100377K(1912320K), 0.0445960 secs]
SUREFIRE-859: [GC 1496601K->100441K(1912320K), 0.0074190 secs]
SUREFIRE-859: [GC 1496665K->100537K(1912320K), 0.0314860 secs]
SUREFIRE-859: [GC 1496761K->100705K(1912320K), 0.0287000 secs]
SUREFIRE-859: [GC 1496929K->100497K(1912320K), 0.0122130 secs]
SUREFIRE-859: [GC 1496721K->100481K(1912320K), 0.0168240 secs]
2015-12-05 04:52:41\2C222 ERROR [asf909.gq1.ygridcore.net\2C51545\2C1449291037100_ChoreService_77825]
server.NIOServerCnxnFactory$1(44): Thread Thread[asf909.gq1.ygridcore.net\2C51545\2C1449291037100_ChoreService_77825\2C5\2Cmain]
died\0Ajava.lang.IllegalArgumentException\0A\09at java.util.concurrent.ThreadLocalRandom.nextLong(ThreadLocalRandom.java:190)\0A\09at
org.apache.hadoop.hbase.JitterScheduledThreadPoolExecutorImpl$JitteredRunnableScheduledFuture.getDelay(JitterScheduledThreadPoolExecutorImpl.java:84)\0A\09at
java.util.concurrent.ScheduledThreadPoolExecutor$DelayedWorkQueue.take(ScheduledThreadPoolExecutor.java:1081)\0A\09at
java.util.concurrent.ScheduledThreadPoolExecutor$DelayedWorkQueue.take(ScheduledThreadPoolExecutor.java:807)\0A\09at
java.util.concurrent.ThreadPoolExecutor.getTask(ThreadPoolExecutor.java:1068)\0A\09at java.util.concurrent.ThreadPoolExecutor.runWorker(ThreadPoolExecutor.java:1130)\0A\09at
java.util.concurrent.ThreadPoolExecutor$Worker.run(ThreadPoolExecutor.java:615)\0A\09at java.lang.Thread.run(Thread.java:745)\0A
SUREFIRE-859: [GC 1497273K->100593K(1912320K), 0.0387090 secs]
SUREFIRE-859: [GC 1497329K->100593K(1912832K), 0.0384150 secs]
2015-12-05 04:52:43\2C929 ERROR [asf909.gq1.ygridcore.net\2C51545\2C1449291037100_ChoreService_79916]
server.NIOServerCnxnFactory$1(44): Thread Thread[asf909.gq1.ygridcore.net\2C51545\2C1449291037100_ChoreService_79916\2C5\2Cmain]
died\0Ajava.lang.IllegalArgumentException\0A\09at java.util.concurrent.ThreadLocalRandom.nextLong(ThreadLocalRandom.java:190)\0A\09at
org.apache.hadoop.hbase.JitterScheduledThreadPoolExecutorImpl$JitteredRunnableScheduledFuture.getDelay(JitterScheduledThreadPoolExecutorImpl.java:84)\0A\09at
java.util.concurrent.ScheduledThreadPoolExecutor$DelayedWorkQueue.take(ScheduledThreadPoolExecutor.java:1081)\0A\09at
java.util.concurrent.ScheduledThreadPoolExecutor$DelayedWorkQueue.take(ScheduledThreadPoolExecutor.java:807)\0A\09at
java.util.concurrent.ThreadPoolExecutor.getTask(ThreadPoolExecutor.java:1068)\0A\09at java.util.concurrent.ThreadPoolExecutor.runWorker(ThreadPoolExecutor.java:1130)\0A\09at
java.util.concurrent.ThreadPoolExecutor$Worker.run(ThreadPoolExecutor.java:615)\0A\09at java.lang.Thread.run(Thread.java:745)\0A
SUREFIRE-859: [GC 1497857K->100665K(1912832K), 0.0384380 secs]
SUREFIRE-859: [GC 1497913K->100793K(1912832K), 0.0357880 secs]
SUREFIRE-859: [GC 1498041K->100673K(1912832K), 0.0516030 secs]
SUREFIRE-859: [GC 1497921K->100657K(1912832K), 0.0368110 secs]
SUREFIRE-859: [GC 1497905K->100665K(1912832K), 0.0180380 secs]
SUREFIRE-859: [GC 1497913K->100697K(1912832K), 0.0559820 secs]
SUREFIRE-859: [GC 1497945K->100753K(1912832K), 0.0544920 secs]
SUREFIRE-859: [GC 1498001K->100745K(1912832K), 0.0197700 secs]
SUREFIRE-859: [GC 1497993K->100817K(1912832K), 0.1347320 secs]
SUREFIRE-859: [GC 1498065K->100801K(1912832K), 0.1036170 secs]
SUREFIRE-859: [GC 1498049K->100825K(1912832K), 0.0383130 secs]
SUREFIRE-859: [GC 1498073K->100913K(1912832K), 0.0542490 secs]
SUREFIRE-859: [GC 1498161K->101073K(1912832K), 0.0074330 secs]
SUREFIRE-859: [GC 1498321K->100865K(1912832K), 0.0402390 secs]
2015-12-05 04:52:58\2C497 ERROR [asf909.gq1.ygridcore.net\2C51545\2C1449291037100_ChoreService_91385]
server.NIOServerCnxnFactory$1(44): Thread Thread[asf909.gq1.ygridcore.net\2C51545\2C1449291037100_ChoreService_91385\2C5\2Cmain]
died\0Ajava.lang.IllegalArgumentException\0A\09at java.util.concurrent.ThreadLocalRandom.nextLong(ThreadLocalRandom.java:190)\0A\09at
org.apache.hadoop.hbase.JitterScheduledThreadPoolExecutorImpl$JitteredRunnableScheduledFuture.getDelay(JitterScheduledThreadPoolExecutorImpl.java:84)\0A\09at
java.util.concurrent.ScheduledThreadPoolExecutor$DelayedWorkQueue.take(ScheduledThreadPoolExecutor.java:1081)\0A\09at
java.util.concurrent.ScheduledThreadPoolExecutor$DelayedWorkQueue.take(ScheduledThreadPoolExecutor.java:807)\0A\09at
java.util.concurrent.ThreadPoolExecutor.getTask(ThreadPoolExecutor.java:1068)\0A\09at java.util.concurrent.ThreadPoolExecutor.runWorker(ThreadPoolExecutor.java:1130)\0A\09at
java.util.concurrent.ThreadPoolExecutor$Worker.run(ThreadPoolExecutor.java:615)\0A\09at java.lang.Thread.run(Thread.java:745)\0A
SUREFIRE-859: [GC 1498385K->100889K(1912832K), 0.0723370 secs]
SUREFIRE-859: [GC 1498137K->100913K(1912832K), 0.1201640 secs]
SUREFIRE-859: [GC 1498161K->100889K(1912832K), 0.0442950 secs]
SUREFIRE-859: [GC 1498137K->100969K(1912832K), 0.0176760 secs]
SUREFIRE-859: [GC 1498217K->100905K(1912832K), 0.0555480 secs]
SUREFIRE-859: [GC 1498153K->100993K(1912832K), 0.0224370 secs]
SUREFIRE-859: [GC 1498241K->101001K(1912832K), 0.0352650 secs]
SUREFIRE-859: [GC 1498249K->101081K(1912832K), 0.0074890 secs]
SUREFIRE-859: [GC 1498329K->101073K(1912832K), 0.0467300 secs]
SUREFIRE-859: [GC 1498321K->101057K(1912832K), 0.0310550 secs]
SUREFIRE-859: [GC 1498305K->101041K(1912832K), 0.0190170 secs]
SUREFIRE-859: [GC 1498289K->101049K(1912832K), 0.0503180 secs]
SUREFIRE-859: [GC 1498297K->101121K(1912832K), 0.0078570 secs]
SUREFIRE-859: [GC 1498369K->101145K(1912832K), 0.0153090 secs]
SUREFIRE-859: [GC 1498393K->101225K(1912832K), 0.0442690 secs]
SUREFIRE-859: [GC 1498473K->101105K(1912832K), 0.0661700 secs]
SUREFIRE-859: [GC 1498353K->101153K(1912832K), 0.0107700 secs]
SUREFIRE-859: [GC 1498401K->101345K(1912832K), 0.0297120 secs]
SUREFIRE-859: [GC 1498593K->101201K(1912832K), 0.0338030 secs]
SUREFIRE-859: [GC 1498449K->101217K(1912832K), 0.0339410 secs]
SUREFIRE-859: [GC 1498465K->101273K(1912832K), 0.0109130 secs]
SUREFIRE-859: [GC 1498521K->101273K(1912832K), 0.0609520 secs]
SUREFIRE-859: [GC 1498521K->101281K(1912832K), 0.0106930 secs]
SUREFIRE-859: [GC 1498529K->101297K(1912832K), 0.0483340 secs]
SUREFIRE-859: [GC 1498545K->101305K(1912832K), 0.0118420 secs]
SUREFIRE-859: [GC 1498553K->101369K(1912832K), 0.0953490 secs]
SUREFIRE-859: [GC 1498617K->101569K(1912832K), 0.0076600 secs]
SUREFIRE-859: [GC 1498817K->101481K(1912832K), 0.0117340 secs]
SUREFIRE-859: [GC 1498729K->101457K(1912832K), 0.0204020 secs]
SUREFIRE-859: [GC 1498705K->101545K(1912832K), 0.1131270 secs]
SUREFIRE-859: [GC 1498793K->101457K(1912832K), 0.0521600 secs]
SUREFIRE-859: [GC 1498705K->101545K(1912832K), 0.0249710 secs]
SUREFIRE-859: [GC 1498793K->101625K(1912832K), 0.0087560 secs]
SUREFIRE-859: [GC 1498873K->101553K(1912832K), 0.0358790 secs]
SUREFIRE-859: [GC 1498801K->101529K(1912832K), 0.0605770 secs]
SUREFIRE-859: [GC 1498777K->101609K(1912832K), 0.0149180 secs]
SUREFIRE-859: [GC 1498857K->101561K(1912832K), 0.0137030 secs]
SUREFIRE-859: [GC 1498809K->101705K(1912832K), 0.0167560 secs]
SUREFIRE-859: [GC 1498953K->101721K(1912832K), 0.0386540 secs]
SUREFIRE-859: [GC 1498969K->101681K(1912832K), 0.0583470 secs]
SUREFIRE-859: [GC 1498929K->101665K(1912832K), 0.0466730 secs]
SUREFIRE-859: [GC 1498913K->101729K(1912832K), 0.0103440 secs]
SUREFIRE-859: [GC 1498977K->101713K(1912832K), 0.0540890 secs]
SUREFIRE-859: [GC 1498961K->101889K(1912832K), 0.0438850 secs]
SUREFIRE-859: [GC 1499137K->101785K(1912832K), 0.0081850 secs]
SUREFIRE-859: [GC 1499033K->101769K(1912832K), 0.0561960 secs]
SUREFIRE-859: [GC 1499017K->101817K(1912832K), 0.0217870 secs]
SUREFIRE-859: [GC 1499065K->101841K(1912832K), 0.0282160 secs]
SUREFIRE-859: [GC 1499089K->101849K(1912832K), 0.0268250 secs]
SUREFIRE-859: [GC 1499097K->101881K(1912832K), 0.0252270 secs]
SUREFIRE-859: [GC 1499129K->101937K(1912832K), 0.0459430 secs]
SUREFIRE-859: [GC 1499185K->102001K(1912832K), 0.0315390 secs]
SUREFIRE-859: [GC 1499249K->102568K(1912832K), 0.0591260 secs]
Tests run: 1, Failures: 0, Errors: 1, Skipped: 0, Time elapsed: 213.595 sec <<< FAILURE!
- in org.apache.hadoop.hbase.mapreduce.IntegrationTestImportTsv
org.apache.hadoop.hbase.mapreduce.IntegrationTestImportTsv  Time elapsed: 213.594 sec  <<<
ERROR!
java.io.IOException: Shutting down
	at org.apache.hadoop.hbase.util.JVMClusterUtil.startup(JVMClusterUtil.java:225)
	at org.apache.hadoop.hbase.LocalHBaseCluster.startup(LocalHBaseCluster.java:447)
	at org.apache.hadoop.hbase.MiniHBaseCluster.init(MiniHBaseCluster.java:225)
	at org.apache.hadoop.hbase.MiniHBaseCluster.<init>(MiniHBaseCluster.java:94)
	at org.apache.hadoop.hbase.HBaseTestingUtility.startMiniHBaseCluster(HBaseTestingUtility.java:1056)
	at org.apache.hadoop.hbase.HBaseTestingUtility.startMiniCluster(HBaseTestingUtility.java:1016)
	at org.apache.hadoop.hbase.HBaseTestingUtility.startMiniCluster(HBaseTestingUtility.java:888)
	at org.apache.hadoop.hbase.HBaseTestingUtility.startMiniCluster(HBaseTestingUtility.java:870)
	at org.apache.hadoop.hbase.HBaseTestingUtility.startMiniCluster(HBaseTestingUtility.java:857)
	at org.apache.hadoop.hbase.IntegrationTestingUtility.initializeCluster(IntegrationTestingUtility.java:78)
	at org.apache.hadoop.hbase.mapreduce.IntegrationTestImportTsv.provisionCluster(IntegrationTestImportTsv.java:115)


Results :

Tests in error: 
  IntegrationTestImportTsv.provisionCluster:115 » IO Shutting down

Tests run: 1, Failures: 0, Errors: 1, Skipped: 0

[WARNING] File encoding has not been set, using platform encoding ISO-8859-1, i.e. build is
platform dependent! The file encoding for reports output files should be provided by the POM
property ${project.reporting.outputEncoding}.
[INFO] 
[INFO] --- maven-failsafe-plugin:2.18.1:verify (verify) @ hbase-it ---
[INFO] Failsafe report directory: <https://builds.apache.org/job/HBase-1.3-IT/it.test=IntegrationTestImportTsv,jdk=latest1.7,label=Hadoop/ws/hbase-it/target/failsafe-reports>
[WARNING] File encoding has not been set, using platform encoding ISO-8859-1, i.e. build is
platform dependent! The file encoding for reports output files should be provided by the POM
property ${project.reporting.outputEncoding}.
[INFO] ------------------------------------------------------------------------
[INFO] Reactor Summary:
[INFO] 
[INFO] Apache HBase ...................................... SUCCESS [1:42.682s]
[INFO] Apache HBase - Checkstyle ......................... SUCCESS [7.108s]
[INFO] Apache HBase - Resource Bundle .................... SUCCESS [0.708s]
[INFO] Apache HBase - Annotations ........................ SUCCESS [2.427s]
[INFO] Apache HBase - Protocol ........................... SUCCESS [32.893s]
[INFO] Apache HBase - Common ............................. SUCCESS [1:19.669s]
[INFO] Apache HBase - Procedure .......................... SUCCESS [3.284s]
[INFO] Apache HBase - Client ............................. SUCCESS [18.650s]
[INFO] Apache HBase - Hadoop Compatibility ............... SUCCESS [2.824s]
[INFO] Apache HBase - Hadoop Two Compatibility ........... SUCCESS [5.879s]
[INFO] Apache HBase - Prefix Tree ........................ SUCCESS [2.373s]
[INFO] Apache HBase - Server ............................. SUCCESS [1:47.400s]
[INFO] Apache HBase - Testing Util ....................... SUCCESS [4.378s]
[INFO] Apache HBase - Thrift ............................. SUCCESS [15.232s]
[INFO] Apache HBase - Rest ............................... SUCCESS [6.085s]
[INFO] Apache HBase - Shell .............................. SUCCESS [5.314s]
[INFO] Apache HBase - Integration Tests .................. FAILURE [10:28.340s]
[INFO] Apache HBase - Examples ........................... SKIPPED
[INFO] Apache HBase - External Block Cache ............... SKIPPED
[INFO] Apache HBase - Assembly ........................... SKIPPED
[INFO] Apache HBase - Shaded ............................. SKIPPED
[INFO] Apache HBase - Shaded - Client .................... SKIPPED
[INFO] Apache HBase - Shaded - Server .................... SKIPPED
[INFO] ------------------------------------------------------------------------
[INFO] BUILD FAILURE
[INFO] ------------------------------------------------------------------------
[INFO] Total time: 17:41.079s
[INFO] Finished at: Sat Dec 05 05:00:48 UTC 2015
[INFO] Final Memory: 137M/1670M
[INFO] ------------------------------------------------------------------------
[ERROR] Failed to execute goal org.apache.maven.plugins:maven-failsafe-plugin:2.18.1:verify
(verify) on project hbase-it: There are test failures.
[ERROR] 
[ERROR] Please refer to <https://builds.apache.org/job/HBase-1.3-IT/it.test=IntegrationTestImportTsv,jdk=latest1.7,label=Hadoop/ws/hbase-it/target/failsafe-reports>
for the individual test results.
[ERROR] -> [Help 1]
[ERROR] 
[ERROR] To see the full stack trace of the errors, re-run Maven with the -e switch.
[ERROR] Re-run Maven using the -X switch to enable full debug logging.
[ERROR] 
[ERROR] For more information about the errors and possible solutions, please read the following
articles:
[ERROR] [Help 1] http://cwiki.apache.org/confluence/display/MAVEN/MojoFailureException
[ERROR] 
[ERROR] After correcting the problems, you can resume the build with the command
[ERROR]   mvn <goals> -rf :hbase-it
Build step 'Invoke top-level Maven targets' marked build as failure
Performing Post build task...
Match found for :.* : True
Logical operation result is TRUE
Running script  : # Post-build task script. TODO: Check this in and have all builds reference
check-in.
pwd && ls
# NOTE!!!! The below code has been copied and pasted from ./dev-tools/run-test.sh
# Do not change here without syncing there and vice-versa.
ZOMBIE_TESTS_COUNT=`jps -v | grep surefirebooter | grep -e '-Dhbase.test' | wc -l`
if [[ $ZOMBIE_TESTS_COUNT != 0 ]] ; then
 echo "Suspicious java process found - waiting 30s to see if there are just slow to stop"
 sleep 30
 ZOMBIE_TESTS_COUNT=`jps -v | grep surefirebooter | grep -e '-Dhbase.test' | wc -l`
 if [[ $ZOMBIE_TESTS_COUNT != 0 ]] ; then
   echo " {color:red}There appear to be $ZOMBIE_TESTS_COUNT zombie tests{color}, they should
have been killed by surefire but survived"
   jps -v | grep surefirebooter | grep -e '-Dhbase.test'
   jps -v | grep surefirebooter | grep -e '-Dhbase.test' | cut -d ' ' -f 1 | xargs -n 1 jstack
   # Exit with error
   exit 1
 else
   echo "We're ok: there is no zombie test, but some tests took some time to stop"
 fi
else
  echo "We're ok: there is no zombie test"
fi
[Hadoop] $ /bin/bash -xe /tmp/hudson5204104336160081380.sh
+ pwd
<https://builds.apache.org/job/HBase-1.3-IT/it.test=IntegrationTestImportTsv,jdk=latest1.7,label=Hadoop/ws/>
+ ls
bin
CHANGES.txt
conf
dev-support
hbase-annotations
hbase-assembly
hbase-checkstyle
hbase-client
hbase-common
hbase-examples
hbase-external-blockcache
hbase-hadoop2-compat
hbase-hadoop-compat
hbase-it
hbase-native-client
hbase-prefix-tree
hbase-procedure
hbase-protocol
hbase-resource-bundle
hbase-rest
hbase-server
hbase-shaded
hbase-shell
hbase-spark
hbase-testing-util
hbase-thrift
LICENSE.txt
NOTICE.txt
pom.xml
README.txt
src
target
++ jps -v
++ grep surefirebooter
++ wc -l
++ grep -e -Dhbase.test
+ ZOMBIE_TESTS_COUNT=0
+ [[ 0 != 0 ]]
+ echo 'We'\''re ok: there is no zombie test'
We're ok: there is no zombie test
POST BUILD TASK : SUCCESS
END OF POST BUILD TASK : 0
Archiving artifacts

Mime
View raw message